18.701298701298697, 0.004149377593360981
25.454545454545446, 0.029045643153526868
29.480519480519483, 0.03526970954356834
37.01298701298701, 0.04149377593360981
45.84415584415585, 0.03941908713692932
54.93506493506494, 0.03941908713692932
64.67532467532467, 0.03526970954356834
78.18181818181819, 0.03112033195020736
88.18181818181819, 0.029045643153526868
96.75324675324676, 0.026970954356846377
112.33766233766235, 0.022821576763485396
119.35064935064935, 0.022821576763485396
