x, y
0.584958217270195, 2.046511627906977
3.8997214484679663, 1.9302325581395348
5.069637883008356, 1.069767441860465
7.799442896935933, 1.6511627906976745
9.944289693593314, 1.3488372093023255
11.504178272980502, 1.5581395348837208
13.454038997214484, 2.0930232558139537
15.013927576601672, 0.2558139534883721
16.768802228412255, 1.372093023255814
17.938718662952645, 1.8604651162790697
21.058495821727018, 1.1395348837209303
22.618384401114206, 1.6744186046511627
24.178272980501394, 1.4651162790697674
27.298050139275766, 1.302325581395349
31.002785515320333, 1.1860465116279069
32.56267409470752, 0.5813953488372093
34.9025069637883, 0.8837209302325582
38.022284122562674, 0.5116279069767442
40.55710306406685, 0.5581395348837209
43.48189415041783, 0.3023255813953488
47.381615598885794, 0.20930232558139533
52.061281337047355, 0.11627906976744186
56.54596100278552, 0.11627906976744186
62.39554317548746, 0.06976744186046512
70.1949860724234, 0.06976744186046512
77.01949860724234, 0.06976744186046512
84.03899721448468, 0.09302325581395349
91.25348189415041, 0.13953488372093023
98.66295264623956, 0.11627906976744186
105.0974930362117, 0.11627906976744186
111.53203342618384, 0.2558139534883721
118.94150417827298, 0.13953488372093023
124.40111420612813, 0.06976744186046512
131.61559888579387, 0.06976744186046512