x, y
4.409448818897638, 2.1132075471698113
13.385826771653543, 12.075471698113207
17.480314960629922, 4.830188679245283
37.16535433070866, 1.8113207547169812
39.21259842519685, 3.320754716981132
46.29921259842519, 4.528301886792453
52.125984251968504, 5.735849056603773
58.4251968503937, 1.8113207547169812
66.14173228346456, 1.8113207547169812
71.02362204724409, 2.7169811320754715
72.5984251968504, 23.245283018867923
85.19685039370079, 18.11320754716981
86.92913385826772, 11.471698113207546
105.35433070866142, 74.56603773584905
117.32283464566929, 9.962264150943396
118.89763779527559, 8.754716981132075
125.19685039370079, 1.2075471698113207
132.44094488188975, 1.2075471698113207