x, y
16.8503937007874, 20.150375939849624
34.803149606299215, 42.70676691729323
46.61417322834646, 55.037593984962406
60.47244094488189, 50.225563909774436
74.48818897637796, 20.150375939849624
89.29133858267717, 55.33834586466165
102.20472440944881, 61.95488721804511
116.22047244094487, 55.33834586466165
126.14173228346456, 38.49624060150376
132.1259842519685, 10.526315789473683
135.90551181102362, 5.7142857142857135