DomainArea [m2]: 1
nCell(SW) : 1
nCellValid(SW) : 1
runTime : 264.365 : 1
simTime : 261.207 : 0.988056
initTime : 3.15769 : 0.0119445
outputTime : 0.0154602 : 5.84805e-05
sweFluxTime : 0 : 0
rainInfTime : 0.0617444 : 0.000233558
sweNotFluxTime : 0 : 0
exchangeTime : 0.000109215 : 4.13122e-07
integrateTime : 4.02351 : 0.0152195
dtComputeTime : 0 : 0
 -------- GW Times --------
gwTime : 256.872 : 0.971658
gwLinSysTime : 12.6847 : 0.0479818
gwLinSolTime : 131.307 : 0.49669
gwUpdateKTime : 66.3104 : 0.250829
gwUpdateQTime : 7.04444 : 0.0266467
gwUpdateWCTime : 7.25056 : 0.0274263
gwBCTime : 10.8869 : 0.0411814
gwIntegrateTime : 2.61304 : 0.00988424
gwExchangeTime : 0.343809 : 0.00130051
TIMERS PER RANK
runTime		 :	264.365
runTime_lb		 :	1
simTime		 :	261.207
simTime_lb		 :	1
initTime		 :	3.15769
initTime_lb		 :	1
outputTime		 :	0.0154602
outputTime_lb		 :	1
sweFluxTime		 :	0
sweFluxTime_lb		 :	-nan
rainInfTime		 :	0.0617444
rainInfTime_lb		 :	1
sweNotFluxTime		 :	0
sweNotFluxTime_lb		 :	-nan
exchangeTime		 :	0.000109215
exchangeTime_lb		 :	1
dtComputeTime		 :	0
dtComputeTime_lb		 :	-nan
gwTime		 :	256.872
gwTime_lb		 :	1
gwLinSysTime		 :	12.6847
gwLinSysTime_lb		 :	1
gwLinSolTime		 :	131.307
gwLinSolTime_lb		 :	1
gwLinSolIter		 :	234487
gwLinSolIter_lb		 :	1
gwUpdateKTime		 :	66.3104
gwUpdateKTime_lb		 :	1
gwUpdateQTime		 :	7.04444
gwUpdateQTime_lb		 :	1
gwUpdateWCTime		 :	7.25056
gwUpdateWCTime_lb		 :	1
gwBCTime		 :	10.8869
gwBCTime_lb		 :	1
gwIntegrateTime		 :	2.61304
gwIntegrateTime_lb		 :	1
gwExchangeTime		 :	0.343809
gwExchangeTime_lb		 :	1

DateTime : Tue Jun 18 10:29:36 2024

Machine : ibg3549
CPU: Intel(R) Core(TM) i7-10510U CPU @ 1.80GHz
nTasks : 1

-------------------------
MODEL COMPONENT SETUP
SERGHEI_TOOLS 1
SERGHEI_SUBSURFACE_MODEL 1
SERGHEI_PARTICLE_TRACKING 0
SERGHEI_VEGETATION_MODEL 0
SERGHEI_FRICTION_MODEL 1
SERGHEI_MAXFLOOD 0
SERGHEI_REAL 2
SERGHEI_NC_MODE 0
SERGHEI_NC_REAL NC_DOUBLE
SERGHEI_WRITE_HZ 1

-------------------------
DEBUG FLAGS
SERGHEI_DEBUG_PARALLEL_DECOMPOSITION 0
SERGHEI_DEBUG_WORKFLOW 0
SERGHEI_DEBUG_KOKKOS_SETUP 0
SERGHEI_DEBUG_BOUNDARY 0
SERGHEI_DEBUG_DT 0
SERGHEI_DEBUG_TOOLS 0
SERGHEI_DEBUG_MASS_CONS 0
SERGHEI_DEBUG_INFILTRATION 0
SERGHEI_DEBUG_MPI 0
