Time SurfaceVolume InfFlux InfAccum 
0.000000e+00 0.000000e+00 0.000000e+00 0.000000e+00 
3.990943e-02 2.530000e+02 0.000000e+00 0.000000e+00 
7.754228e-02 2.530000e+02 0.000000e+00 0.000000e+00 
1.138480e-01 2.530000e+02 0.000000e+00 0.000000e+00 
1.477872e-01 2.530000e+02 0.000000e+00 0.000000e+00 
1.807759e-01 2.530000e+02 0.000000e+00 0.000000e+00 
2.133132e-01 2.530000e+02 0.000000e+00 0.000000e+00 
2.456146e-01 2.530000e+02 0.000000e+00 0.000000e+00 
2.777812e-01 2.530000e+02 0.000000e+00 0.000000e+00 
3.098632e-01 2.530000e+02 0.000000e+00 0.000000e+00 
3.418872e-01 2.530000e+02 0.000000e+00 0.000000e+00 
3.738684e-01 2.530000e+02 0.000000e+00 0.000000e+00 
4.058160e-01 2.530000e+02 0.000000e+00 0.000000e+00 
4.377363e-01 2.530000e+02 0.000000e+00 0.000000e+00 
4.696303e-01 2.530000e+02 0.000000e+00 0.000000e+00 
5.014987e-01 2.530000e+02 0.000000e+00 0.000000e+00 
5.333488e-01 2.530000e+02 0.000000e+00 0.000000e+00 
5.651850e-01 2.530000e+02 0.000000e+00 0.000000e+00 
5.970103e-01 2.530000e+02 0.000000e+00 0.000000e+00 
6.288269e-01 2.530000e+02 0.000000e+00 0.000000e+00 
6.606363e-01 2.530000e+02 0.000000e+00 0.000000e+00 
6.924397e-01 2.530000e+02 0.000000e+00 0.000000e+00 
7.242380e-01 2.530000e+02 0.000000e+00 0.000000e+00 
7.560298e-01 2.530000e+02 0.000000e+00 0.000000e+00 
7.878158e-01 2.530000e+02 0.000000e+00 0.000000e+00 
8.195966e-01 2.530000e+02 0.000000e+00 0.000000e+00 
8.513730e-01 2.530000e+02 0.000000e+00 0.000000e+00 
8.831455e-01 2.530000e+02 0.000000e+00 0.000000e+00 
9.149144e-01 2.530000e+02 0.000000e+00 0.000000e+00 
9.466802e-01 2.530000e+02 0.000000e+00 0.000000e+00 
9.784433e-01 2.530000e+02 0.000000e+00 0.000000e+00 
1.000000e+00 2.530000e+02 0.000000e+00 0.000000e+00 
1.031759e+00 2.530000e+02 0.000000e+00 0.000000e+00 
1.063517e+00 2.530000e+02 0.000000e+00 0.000000e+00 
1.095272e+00 2.530000e+02 0.000000e+00 0.000000e+00 
1.127027e+00 2.530000e+02 0.000000e+00 0.000000e+00 
1.158780e+00 2.530000e+02 0.000000e+00 0.000000e+00 
1.190532e+00 2.530000e+02 0.000000e+00 0.000000e+00 
1.222283e+00 2.530000e+02 0.000000e+00 0.000000e+00 
1.254034e+00 2.530000e+02 0.000000e+00 0.000000e+00 
1.285783e+00 2.530000e+02 0.000000e+00 0.000000e+00 
1.317533e+00 2.530000e+02 0.000000e+00 0.000000e+00 
1.349282e+00 2.530000e+02 0.000000e+00 0.000000e+00 
1.381030e+00 2.530000e+02 0.000000e+00 0.000000e+00 
1.412779e+00 2.530000e+02 0.000000e+00 0.000000e+00 
1.444527e+00 2.530000e+02 0.000000e+00 0.000000e+00 
1.476275e+00 2.530000e+02 0.000000e+00 0.000000e+00 
1.508023e+00 2.530000e+02 0.000000e+00 0.000000e+00 
1.539771e+00 2.530000e+02 0.000000e+00 0.000000e+00 
1.571519e+00 2.530000e+02 0.000000e+00 0.000000e+00 
1.603267e+00 2.530000e+02 0.000000e+00 0.000000e+00 
1.635015e+00 2.530000e+02 0.000000e+00 0.000000e+00 
1.666764e+00 2.530000e+02 0.000000e+00 0.000000e+00 
1.698512e+00 2.530000e+02 0.000000e+00 0.000000e+00 
1.730261e+00 2.530000e+02 0.000000e+00 0.000000e+00 
1.762010e+00 2.530000e+02 0.000000e+00 0.000000e+00 
1.793759e+00 2.530000e+02 0.000000e+00 0.000000e+00 
1.825508e+00 2.530000e+02 0.000000e+00 0.000000e+00 
1.857257e+00 2.530000e+02 0.000000e+00 0.000000e+00 
1.889005e+00 2.530000e+02 0.000000e+00 0.000000e+00 
1.920752e+00 2.530000e+02 0.000000e+00 0.000000e+00 
1.952498e+00 2.530000e+02 0.000000e+00 0.000000e+00 
1.984244e+00 2.530000e+02 0.000000e+00 0.000000e+00 
2.000000e+00 2.530000e+02 0.000000e+00 0.000000e+00 
2.031745e+00 2.530000e+02 0.000000e+00 0.000000e+00 
2.063490e+00 2.530000e+02 0.000000e+00 0.000000e+00 
2.095234e+00 2.530000e+02 0.000000e+00 0.000000e+00 
2.126979e+00 2.530000e+02 0.000000e+00 0.000000e+00 
2.158723e+00 2.530000e+02 0.000000e+00 0.000000e+00 
2.190467e+00 2.530000e+02 0.000000e+00 0.000000e+00 
2.222211e+00 2.530000e+02 0.000000e+00 0.000000e+00 
2.253955e+00 2.530000e+02 0.000000e+00 0.000000e+00 
2.285699e+00 2.530000e+02 0.000000e+00 0.000000e+00 
2.317443e+00 2.530000e+02 0.000000e+00 0.000000e+00 
2.349188e+00 2.530000e+02 0.000000e+00 0.000000e+00 
2.380932e+00 2.530000e+02 0.000000e+00 0.000000e+00 
2.412677e+00 2.530000e+02 0.000000e+00 0.000000e+00 
2.444422e+00 2.530000e+02 0.000000e+00 0.000000e+00 
2.476167e+00 2.530000e+02 0.000000e+00 0.000000e+00 
2.507913e+00 2.530000e+02 0.000000e+00 0.000000e+00 
2.539658e+00 2.530000e+02 0.000000e+00 0.000000e+00 
2.571403e+00 2.530000e+02 0.000000e+00 0.000000e+00 
2.603148e+00 2.530000e+02 0.000000e+00 0.000000e+00 
2.634892e+00 2.530000e+02 0.000000e+00 0.000000e+00 
2.666636e+00 2.530000e+02 0.000000e+00 0.000000e+00 
2.698380e+00 2.530000e+02 0.000000e+00 0.000000e+00 
2.730124e+00 2.530000e+02 0.000000e+00 0.000000e+00 
2.761867e+00 2.530000e+02 0.000000e+00 0.000000e+00 
2.793610e+00 2.530000e+02 0.000000e+00 0.000000e+00 
2.825354e+00 2.530000e+02 0.000000e+00 0.000000e+00 
2.857097e+00 2.530000e+02 0.000000e+00 0.000000e+00 
2.888840e+00 2.530000e+02 0.000000e+00 0.000000e+00 
2.920584e+00 2.530000e+02 0.000000e+00 0.000000e+00 
2.952327e+00 2.530000e+02 0.000000e+00 0.000000e+00 
2.984071e+00 2.530000e+02 0.000000e+00 0.000000e+00 
3.000000e+00 2.530000e+02 0.000000e+00 0.000000e+00 
3.031744e+00 2.530000e+02 0.000000e+00 0.000000e+00 
3.063488e+00 2.530000e+02 0.000000e+00 0.000000e+00 
3.095232e+00 2.530000e+02 0.000000e+00 0.000000e+00 
3.126977e+00 2.530000e+02 0.000000e+00 0.000000e+00 
3.158721e+00 2.530000e+02 0.000000e+00 0.000000e+00 
3.190466e+00 2.530000e+02 0.000000e+00 0.000000e+00 
3.222210e+00 2.530000e+02 0.000000e+00 0.000000e+00 
3.253954e+00 2.530000e+02 0.000000e+00 0.000000e+00 
3.285697e+00 2.530000e+02 0.000000e+00 0.000000e+00 
3.317441e+00 2.530000e+02 0.000000e+00 0.000000e+00 
3.349184e+00 2.530000e+02 0.000000e+00 0.000000e+00 
3.380927e+00 2.530000e+02 0.000000e+00 0.000000e+00 
3.412670e+00 2.530000e+02 0.000000e+00 0.000000e+00 
3.444414e+00 2.530000e+02 0.000000e+00 0.000000e+00 
3.476157e+00 2.530000e+02 0.000000e+00 0.000000e+00 
3.507900e+00 2.530000e+02 0.000000e+00 0.000000e+00 
3.539644e+00 2.530000e+02 0.000000e+00 0.000000e+00 
3.571387e+00 2.530000e+02 0.000000e+00 0.000000e+00 
3.603131e+00 2.530000e+02 0.000000e+00 0.000000e+00 
3.634875e+00 2.530000e+02 0.000000e+00 0.000000e+00 
3.666618e+00 2.530000e+02 0.000000e+00 0.000000e+00 
3.698363e+00 2.530000e+02 0.000000e+00 0.000000e+00 
3.730107e+00 2.530000e+02 0.000000e+00 0.000000e+00 
3.761851e+00 2.530000e+02 0.000000e+00 0.000000e+00 
3.793595e+00 2.530000e+02 0.000000e+00 0.000000e+00 
3.825338e+00 2.530000e+02 0.000000e+00 0.000000e+00 
3.857082e+00 2.530000e+02 0.000000e+00 0.000000e+00 
3.888825e+00 2.530000e+02 0.000000e+00 0.000000e+00 
3.920569e+00 2.530000e+02 0.000000e+00 0.000000e+00 
3.952312e+00 2.530000e+02 0.000000e+00 0.000000e+00 
3.984055e+00 2.530000e+02 0.000000e+00 0.000000e+00 
4.000000e+00 2.530000e+02 0.000000e+00 0.000000e+00 
4.031743e+00 2.530000e+02 0.000000e+00 0.000000e+00 
4.063487e+00 2.530000e+02 0.000000e+00 0.000000e+00 
4.095230e+00 2.530000e+02 0.000000e+00 0.000000e+00 
4.126974e+00 2.530000e+02 0.000000e+00 0.000000e+00 
4.158717e+00 2.530000e+02 0.000000e+00 0.000000e+00 
4.190461e+00 2.530000e+02 0.000000e+00 0.000000e+00 
4.222205e+00 2.530000e+02 0.000000e+00 0.000000e+00 
4.253949e+00 2.530000e+02 0.000000e+00 0.000000e+00 
4.285693e+00 2.530000e+02 0.000000e+00 0.000000e+00 
4.317437e+00 2.530000e+02 0.000000e+00 0.000000e+00 
4.349181e+00 2.530000e+02 0.000000e+00 0.000000e+00 
4.380924e+00 2.530000e+02 0.000000e+00 0.000000e+00 
4.412668e+00 2.530000e+02 0.000000e+00 0.000000e+00 
4.444411e+00 2.530000e+02 0.000000e+00 0.000000e+00 
4.476155e+00 2.530000e+02 0.000000e+00 0.000000e+00 
4.507898e+00 2.530000e+02 0.000000e+00 0.000000e+00 
4.539642e+00 2.530000e+02 0.000000e+00 0.000000e+00 
4.571385e+00 2.530000e+02 0.000000e+00 0.000000e+00 
4.603129e+00 2.530000e+02 0.000000e+00 0.000000e+00 
4.634872e+00 2.530000e+02 0.000000e+00 0.000000e+00 
4.666616e+00 2.530000e+02 0.000000e+00 0.000000e+00 
4.698360e+00 2.530000e+02 0.000000e+00 0.000000e+00 
4.730104e+00 2.530000e+02 0.000000e+00 0.000000e+00 
4.761847e+00 2.530000e+02 0.000000e+00 0.000000e+00 
4.793592e+00 2.530000e+02 0.000000e+00 0.000000e+00 
4.825336e+00 2.530000e+02 0.000000e+00 0.000000e+00 
4.857080e+00 2.530000e+02 0.000000e+00 0.000000e+00 
4.888824e+00 2.530000e+02 0.000000e+00 0.000000e+00 
4.920567e+00 2.530000e+02 0.000000e+00 0.000000e+00 
4.952311e+00 2.530000e+02 0.000000e+00 0.000000e+00 
4.984055e+00 2.530000e+02 0.000000e+00 0.000000e+00 
5.000000e+00 2.530000e+02 0.000000e+00 0.000000e+00 
5.031744e+00 2.530000e+02 0.000000e+00 0.000000e+00 
5.063487e+00 2.530000e+02 0.000000e+00 0.000000e+00 
5.095231e+00 2.530000e+02 0.000000e+00 0.000000e+00 
5.126975e+00 2.530000e+02 0.000000e+00 0.000000e+00 
5.158718e+00 2.530000e+02 0.000000e+00 0.000000e+00 
5.190462e+00 2.530000e+02 0.000000e+00 0.000000e+00 
5.222206e+00 2.530000e+02 0.000000e+00 0.000000e+00 
5.253950e+00 2.530000e+02 0.000000e+00 0.000000e+00 
5.285694e+00 2.530000e+02 0.000000e+00 0.000000e+00 
5.317439e+00 2.530000e+02 0.000000e+00 0.000000e+00 
5.349183e+00 2.530000e+02 0.000000e+00 0.000000e+00 
5.380928e+00 2.530000e+02 0.000000e+00 0.000000e+00 
5.412672e+00 2.530000e+02 0.000000e+00 0.000000e+00 
5.444417e+00 2.530000e+02 0.000000e+00 0.000000e+00 
5.476162e+00 2.530000e+02 0.000000e+00 0.000000e+00 
5.507907e+00 2.530000e+02 0.000000e+00 0.000000e+00 
5.539653e+00 2.530000e+02 0.000000e+00 0.000000e+00 
5.571399e+00 2.530000e+02 0.000000e+00 0.000000e+00 
5.603146e+00 2.530000e+02 0.000000e+00 0.000000e+00 
5.634893e+00 2.530000e+02 0.000000e+00 0.000000e+00 
5.666642e+00 2.530000e+02 0.000000e+00 0.000000e+00 
5.698392e+00 2.530000e+02 0.000000e+00 0.000000e+00 
5.730144e+00 2.530000e+02 0.000000e+00 0.000000e+00 
5.761896e+00 2.530000e+02 0.000000e+00 0.000000e+00 
5.793651e+00 2.530000e+02 0.000000e+00 0.000000e+00 
5.825408e+00 2.530000e+02 0.000000e+00 0.000000e+00 
5.857166e+00 2.530000e+02 0.000000e+00 0.000000e+00 
5.888926e+00 2.530000e+02 0.000000e+00 0.000000e+00 
5.920688e+00 2.530000e+02 0.000000e+00 0.000000e+00 
5.952452e+00 2.530000e+02 0.000000e+00 0.000000e+00 
5.984216e+00 2.530000e+02 0.000000e+00 0.000000e+00 
6.000000e+00 2.530000e+02 0.000000e+00 0.000000e+00 
6.031766e+00 2.530000e+02 0.000000e+00 0.000000e+00 
6.063533e+00 2.530000e+02 0.000000e+00 0.000000e+00 
6.095300e+00 2.530000e+02 0.000000e+00 0.000000e+00 
6.127068e+00 2.530000e+02 0.000000e+00 0.000000e+00 
6.158836e+00 2.530000e+02 0.000000e+00 0.000000e+00 
6.190605e+00 2.530000e+02 0.000000e+00 0.000000e+00 
6.222374e+00 2.530000e+02 0.000000e+00 0.000000e+00 
6.254142e+00 2.530000e+02 0.000000e+00 0.000000e+00 
6.285911e+00 2.530000e+02 0.000000e+00 0.000000e+00 
6.317680e+00 2.530000e+02 0.000000e+00 0.000000e+00 
6.349449e+00 2.530000e+02 0.000000e+00 0.000000e+00 
6.381218e+00 2.530000e+02 0.000000e+00 0.000000e+00 
6.412987e+00 2.530000e+02 0.000000e+00 0.000000e+00 
6.444757e+00 2.530000e+02 0.000000e+00 0.000000e+00 
6.476526e+00 2.530000e+02 0.000000e+00 0.000000e+00 
6.508296e+00 2.530000e+02 0.000000e+00 0.000000e+00 
6.540066e+00 2.530000e+02 0.000000e+00 0.000000e+00 
6.571836e+00 2.530000e+02 0.000000e+00 0.000000e+00 
6.603606e+00 2.530000e+02 0.000000e+00 0.000000e+00 
6.635376e+00 2.530000e+02 0.000000e+00 0.000000e+00 
6.667147e+00 2.530000e+02 0.000000e+00 0.000000e+00 
6.698918e+00 2.530000e+02 0.000000e+00 0.000000e+00 
6.730689e+00 2.530000e+02 0.000000e+00 0.000000e+00 
6.762460e+00 2.530000e+02 0.000000e+00 0.000000e+00 
6.794231e+00 2.530000e+02 0.000000e+00 0.000000e+00 
6.826002e+00 2.530000e+02 0.000000e+00 0.000000e+00 
6.857772e+00 2.530000e+02 0.000000e+00 0.000000e+00 
6.889543e+00 2.530000e+02 0.000000e+00 0.000000e+00 
6.921314e+00 2.530000e+02 0.000000e+00 0.000000e+00 
6.953084e+00 2.530000e+02 0.000000e+00 0.000000e+00 
6.984855e+00 2.530000e+02 0.000000e+00 0.000000e+00 
7.000000e+00 2.530000e+02 0.000000e+00 0.000000e+00 
7.031771e+00 2.530000e+02 0.000000e+00 0.000000e+00 
7.063542e+00 2.530000e+02 0.000000e+00 0.000000e+00 
7.095314e+00 2.530000e+02 0.000000e+00 0.000000e+00 
7.127087e+00 2.530000e+02 0.000000e+00 0.000000e+00 
7.158860e+00 2.530000e+02 0.000000e+00 0.000000e+00 
7.190635e+00 2.530000e+02 0.000000e+00 0.000000e+00 
7.222411e+00 2.530000e+02 0.000000e+00 0.000000e+00 
7.254189e+00 2.530000e+02 0.000000e+00 0.000000e+00 
7.285969e+00 2.530000e+02 0.000000e+00 0.000000e+00 
7.317752e+00 2.530000e+02 0.000000e+00 0.000000e+00 
7.349541e+00 2.530000e+02 0.000000e+00 0.000000e+00 
7.381333e+00 2.530000e+02 0.000000e+00 0.000000e+00 
7.413131e+00 2.530000e+02 0.000000e+00 0.000000e+00 
7.444935e+00 2.530000e+02 0.000000e+00 0.000000e+00 
7.476747e+00 2.530000e+02 0.000000e+00 0.000000e+00 
7.508570e+00 2.530000e+02 0.000000e+00 0.000000e+00 
7.540407e+00 2.530000e+02 0.000000e+00 0.000000e+00 
7.572255e+00 2.530000e+02 0.000000e+00 0.000000e+00 
7.604118e+00 2.530000e+02 0.000000e+00 0.000000e+00 
7.635998e+00 2.530000e+02 0.000000e+00 0.000000e+00 
7.667902e+00 2.530000e+02 0.000000e+00 0.000000e+00 
7.699834e+00 2.530000e+02 0.000000e+00 0.000000e+00 
7.731788e+00 2.530000e+02 0.000000e+00 0.000000e+00 
7.763769e+00 2.530000e+02 0.000000e+00 0.000000e+00 
7.795784e+00 2.530000e+02 0.000000e+00 0.000000e+00 
7.827846e+00 2.530000e+02 0.000000e+00 0.000000e+00 
7.859947e+00 2.530000e+02 0.000000e+00 0.000000e+00 
7.892087e+00 2.530000e+02 0.000000e+00 0.000000e+00 
7.924274e+00 2.530000e+02 0.000000e+00 0.000000e+00 
7.956522e+00 2.530000e+02 0.000000e+00 0.000000e+00 
7.988836e+00 2.530000e+02 0.000000e+00 0.000000e+00 
8.000000e+00 2.530000e+02 0.000000e+00 0.000000e+00 
