DomainArea [m2]: 0
nCellDomain : 10000
nCellValid : 0
runTime : 6.65815 : 1
simTime : 3.36608 : 0.505558
initTime : 3.29207 : 0.494442
outputTime : 0.0279985 : 0.00420515
sweFluxTime : 2.45666 : 0.368971
rainInfTime : 7.615e-05 : 1.14371e-05
sweNotFluxTime : 0.589625 : 0.0885569
exchangeTime : 0.0215805 : 0.00324122
integrateTime : 0.159482 : 0.0239529
dtComputeTime : 0.000418645 : 6.28771e-05
sweBCtime0 : 0
TIMERS PER RANK
runTime		 :	6.65815
runTime_lb		 :	1
simTime		 :	3.36608
simTime_lb		 :	1
initTime		 :	3.29207
initTime_lb		 :	1
outputTime		 :	0.0279985
outputTime_lb		 :	1
sweFluxTime		 :	2.45666
sweFluxTime_lb		 :	1
rainInfTime		 :	7.615e-05
rainInfTime_lb		 :	1
sweNotFluxTime		 :	0.589625
sweNotFluxTime_lb		 :	1
integrateTime		 :	0.0215805
integrateTime_lb		 :	1
exchangeTime		 :	0.159482
exchangeTime_lb		 :	1
dtComputeTime		 :	0.000418645
dtComputeTime_lb		 :	1
sweBCtime		 :	0.000418645
sweBCtime_lb		 :	1

DateTime : Mon Apr 22 09:38:33 2024

Machine : ibg3549
CPU: Intel(R) Core(TM) i7-10510U CPU @ 1.80GHz
nTasks : 1

SERGHEI_GIT_VERSION v1.2.0-56-g56b7b4c

-------------------------
MODEL COMPONENT SETUP
SERGHEI_TOOLS 1
SERGHEI_SUBSURFACE_MODEL 0
SERGHEI_PARTICLE_TRACKING 0
SERGHEI_VEGETATION_MODEL 0
SERGHEI_FRICTION_MODEL 1
SERGHEI_MAXFLOOD 0
SERGHEI_REAL 2
SERGHEI_NC_MODE 0
SERGHEI_NC_REAL NC_DOUBLE
SERGHEI_WRITE_HZ 0
SERGHEI_WRITE_SUBDOMS 0

-------------------------
DEBUG FLAGS
SERGHEI_DEBUG_PARALLEL_DECOMPOSITION 0
SERGHEI_DEBUG_WORKFLOW 0
SERGHEI_DEBUG_KOKKOS_SETUP 0
SERGHEI_DEBUG_BOUNDARY 0
SERGHEI_DEBUG_DT 0
SERGHEI_DEBUG_TOOLS 0
SERGHEI_DEBUG_MASS_CONS 0
SERGHEI_DEBUG_INFILTRATION 0
SERGHEI_DEBUG_MPI 0
SERGHEI_DEBUG_OUTPUT0
