{
  "type": "object",
  "$schema": "http://json-schema.org/draft-07/schema",
  "required": [
    "status",
    "data",
    "message"
  ],
  "properties": {
    "status": {
      "type": "string",
      "const": "success",
      "minLength": 1
    },
    "data": {
      "type": "object",
      "required": [
        "id",
        "employee_name",
        "employee_age",
        "employee_salary",
        "profile_image"
      ],
      "additionalProperties": false,
      "properties": {
        "id": {
          "type": "integer",
          "minLength": 1
        },
        "employee_name": {
          "type": "string",
          "minLength": 1
        },
        "employee_age": {
          "type": "integer"
        },
        "employee_salary": {
          "type": "integer"
        },
        "profile_image": {
          "type": "string"
        }
      },
      "message": {
        "type": "string",
        "minLength": 1
      }
    }
  }