<?xml version="1.0" encoding="UTF-8"?>
<svg width="141px" height="40px" viewBox="0 0 141 40" version="1.1" xmlns="http://www.w3.org/2000/svg" xmlns:xlink="http://www.w3.org/1999/xlink">
    <!-- Generator: Sketch 46.2 (44496) - http://www.bohemiancoding.com/sketch -->
    <title>мел</title>
    <desc>Created with Sketch.</desc>
    <defs></defs>
    <g id="Page-1" stroke="none" stroke-width="1" fill="none" fill-rule="evenodd">
        <g id="Desktop-v.1-Copy-3" transform="translate(-1079.000000, -6510.000000)" fill="#000000">
            <g id="секция-партнеры" transform="translate(60.000000, 6380.000000)">
                <g id="публикации" transform="translate(674.000000, 120.000000)">
                    <g id="мел" transform="translate(345.000000, 10.000000)">
                        <path d="M107.793548,1.29032258 L105.23871,19.4322581 C104.129032,27.6387097 102.219355,30.1419355 99.3548387,30.1419355 L99.3548387,40 C110.645161,40 115.587097,33.3548387 117.16129,20.9935484 L118.374194,11.7677419 L128.4,11.7677419 L128.4,39.3548387 L140.658065,39.3548387 L140.658065,1.29032258 L107.793548,1.29032258 Z M68.3870968,15.483871 C68.8516129,12.7741935 70.8774194,9.03225806 76.0903226,9.03225806 C81.6129032,9.03225806 83.5741935,12.8387097 83.8709677,15.483871 L68.3870968,15.483871 Z M75.8709677,0 C63.9096774,0 55.483871,8.90322581 55.483871,19.9612903 C55.483871,32.3483871 64.6064516,40 76.4387097,40 C82.3096774,40 88.6580645,38.3483871 92.4645161,34.9677419 L87.3032258,27.3806452 C85.1612903,29.4451613 80.4645161,30.6064516 77.7806452,30.6064516 C72.2322581,30.6064516 68.8774194,27.3806452 68.1806452,23.8322581 L95.483871,23.8322581 L95.483871,21.2258065 C95.483871,8.28387097 87.2258065,0 75.8709677,0 Z M24.516129,22.1935484 L16.3870968,1.29032258 L0,1.29032258 L0,40 L12.4129032,40 L12.4129032,16.8387097 L21.3677419,40 L27.7419355,40 L36.6967742,16.8387097 L36.6967742,40 L49.0322581,40 L49.0322581,1.29032258 L32.6451613,1.29032258 L24.516129,22.1935484 Z" id="Shape"></path>
                    </g>
                </g>
            </g>
        </g>
    </g>
</svg>