<?xml version="1.0" encoding="UTF-8"?>
<svg width="143px" height="60px" viewBox="0 0 143 60" version="1.1" xmlns="http://www.w3.org/2000/svg" xmlns:xlink="http://www.w3.org/1999/xlink">
    <!-- Generator: Sketch 46.2 (44496) - http://www.bohemiancoding.com/sketch -->
    <title>pp-logo-rgb-black</title>
    <desc>Created with Sketch.</desc>
    <defs>
        <polygon id="path-1" points="48.3171136 0.267613636 48.3171136 23.7602273 0.0589451872 23.7602273 0.0589451872 0.267613636 48.3171136 0.267613636"></polygon>
    </defs>
    <g id="Page-1" stroke="none" stroke-width="1" fill="none" fill-rule="evenodd">
        <g id="Desktop-v.1-Copy-3" transform="translate(-220.000000, -6593.000000)">
            <g id="pp-logo-rgb-black" transform="translate(220.000000, 6593.000000)">
                <path d="M18.3830409,11.8819437 L20.2998751,11.8819437 C22.378925,11.8819437 24.5878619,11.3849142 25.107982,8.76913132 C25.5952012,6.28762777 23.5487661,5.89123757 21.4368153,5.89123757 L19.552882,5.89123757 L18.3830409,11.8819437 Z M12.1782199,0.681818182 L27.1544171,0.681818182 C30.6956968,0.681818182 35.1135706,2.42688818 33.8793582,8.73156676 C32.6774745,14.8352469 28.3242582,17.351792 23.7759253,17.351792 L17.5384895,17.351792 L16.2067188,23.8636364 L7.5,23.8636364 L12.1782199,0.681818182 L12.1782199,0.681818182 Z" id="Fill-1" fill="#0A0B09"></path>
                <path d="M45.0513885,18.8340106 C48.4932983,18.8340106 49.3696443,14.8225298 49.8891616,12.2728694 C50.3434892,10.0630879 50.9605054,5.71144392 47.6489753,5.71144392 C44.4346582,5.71144392 43.2981246,10.0630879 42.8437971,12.2728694 C42.3242798,14.8225298 41.9348562,18.8340106 45.0513885,18.8340106 Z M43.9151409,24.5454545 C35.9931444,24.5454545 32.1946919,20.36375 33.7529581,12.2728694 C35.3112243,4.31754241 40.7983226,0 48.7203191,0 C56.6423155,0 60.5382668,4.31754241 58.9800007,12.2728694 C57.4217345,20.36375 51.8374232,24.5454545 43.9151409,24.5454545 L43.9151409,24.5454545 Z" id="Fill-2" fill="#0A0B09"></path>
                <polyline id="Fill-3" fill="#0A0B09" points="68.5417647 15.5285093 68.6058743 15.5285093 75.1773887 0.681818182 83.4557495 0.681818182 84.0032338 15.5285093 84.0679108 15.5285093 89.8014621 0.681818182 97.5 0.681818182 87.4498323 23.8636364 78.1729508 23.8636364 77.4322868 8.75623602 77.3676099 8.75623602 70.7643243 23.8636364 61.2939795 23.8636364 60.6818182 0.681818182 68.7669992 0.681818182 68.5417647 15.5285093"></polyline>
                <g id="Group-7" transform="translate(94.090909, 0.681818)">
                    <mask id="mask-2" fill="white">
                        <use xlink:href="#path-1"></use>
                    </mask>
                    <g id="Clip-5"></g>
                    <polyline id="Fill-4" fill="#0A0B09" mask="url(#mask-2)" points="4.71533021 0.267613636 24.2782981 0.267613636 23.1463797 5.81079545 12.0550027 5.81079545 11.3764211 9.24232955 21.9822834 9.24232955 20.8828275 15.0494318 10.2769652 15.0494318 9.66216979 18.2170455 20.9796457 18.2170455 19.8482968 23.7602273 0.0589451872 23.7602273 4.71533021 0.267613636"></polyline>
                    <path d="M32.9349826,10.5622159 L35.1985348,10.5622159 C36.9771417,10.5622159 38.7557487,10.3823864 39.2082313,7.96960227 C39.6285361,5.82840909 38.0765976,5.546875 36.3304532,5.546875 L33.9376203,5.546875 L32.9349826,10.5622159 Z M26.694766,0.267613636 L40.6958142,0.267613636 C46.0957059,0.267613636 49.0381243,1.93465909 48.1653369,6.48892045 C47.4537233,10.1255682 44.9640722,11.9107955 41.536139,12.7264205 L41.504246,12.7693182 C43.3472086,13.1090909 44.2849211,14.0335227 44.8666845,15.2911932 C45.6751163,17.8056818 44.8666845,21.6485795 45.3197366,23.7602273 L36.2979906,23.7602273 C36.233635,22.1764205 36.847861,18.4244318 36.4272714,16.9971591 C36.1362473,15.909375 35.2959225,15.8414773 34.2286444,15.8414773 L32.2882941,15.8414773 L30.703893,23.7602273 L22.038381,23.7602273 L26.694766,0.267613636 L26.694766,0.267613636 Z" id="Fill-6" fill="#0A0B09" mask="url(#mask-2)"></path>
                </g>
                <path d="M15.3478384,42.2938314 L18.0510551,42.2938314 C20.9831005,42.2938314 24.0987151,41.7036543 24.8313048,37.8943806 C25.5186347,34.2807897 22.6324113,33.8370902 19.6542627,33.8370902 L16.9971492,33.8370902 L15.3478384,42.2938314 Z M6.597524,25.9090909 L27.7180905,25.9090909 C32.7115636,25.9090909 38.9425116,28.4697488 37.2015569,37.6503459 C35.5061431,46.5379875 29.3674012,50.2218308 22.9528841,50.2218308 L14.1564666,50.2218308 L12.2780459,60 L0,60 L6.597524,25.9090909 L6.597524,25.9090909 Z" id="Fill-8" fill="#0A0B09"></path>
                <polyline id="Fill-9" fill="#0A0B09" points="42.051305 25.9090909 54.3279282 25.9090909 49.7015673 49.9576021 64.7727273 49.9576021 62.8028909 60 35.4545455 60 42.051305 25.9090909"></polyline>
                <path d="M83.6978732,44.4079456 L90.8007426,44.4079456 L89.4716608,33.3086328 L89.38,33.3086328 L83.6978732,44.4079456 Z M82.5979435,25.9090909 L99.5068327,25.9090909 L104.318182,60 L91.441806,60 L90.754631,52.6004581 L80.3986463,52.6004581 L77.0077586,60 L64.7727273,60 L82.5979435,25.9090909 L82.5979435,25.9090909 Z" id="Fill-10" fill="#0A0B09"></path>
                <polyline id="Fill-11" fill="#0A0B09" points="122.511185 49.54718 120.496224 60 108.221545 60 110.236787 49.54718 102.954545 25.9090909 116.282231 25.9090909 118.480982 40.1797172 118.572597 40.1797172 126.404246 25.9090909 139.090909 25.9090909 122.511185 49.54718"></polyline>
            </g>
        </g>
    </g>
</svg>