{
  "5447a9cd4bdc2dbd208b4567": 89233,
  "5447ac644bdc2d6c208b4567": 59127,
  "5448ba0b4bdc2d02308b456c": 142210,
  "5448bd6b4bdc2dfc2f8b4569": 9781,
  "5448be9a4bdc2dfd2f8b456a": 13986,
  "5448c1d04bdc2dff2f8b4569": 7378,
  "5448fee04bdc2dbc018b4567": 22082,
  "5448ff904bdc2d6f028b456e": 17395,
  "544909bb4bdc2d6f028b4577": 17592,
  "54491bb74bdc2d09088b4567": 15490,
  "54491c4f4bdc2db1078b4568": 36290,
  "544a378f4bdc2d30388b4567": 53754,
  "544a38634bdc2d58388b4568": 6406,
  "544a3a774bdc2d3a388b4567": 48860,
  "544a5caa4bdc2d1a388b4568": 54428,
  "544a5cde4bdc2d39388b456b": 21117,
  "544fb25a4bdc2dfb738b4567": 2619,
  "544fb3364bdc2d34748b456a": 4668,
  "544fb37f4bdc2dee738b4567": 8419,
  "544fb3f34bdc2d03748b456a": 18341,
  "544fb45d4bdc2dee738b4568": 36472,
  "544fb5454bdc2df8738b456a": 21622,
  "544fb62a4bdc2dfb738b4568": 15453,
  "544fb6cc4bdc2d34748b456e": 17404,
  "54527a984bdc2d4e668b4567": 949,
  "545cdae64bdc2d39198b4568": 96389,
  "557ff21e4bdc2d89578b4586": 5379,
  "55801eed4bdc2d89578b4588": 52601,
  "5580223e4bdc2d1c128b457f": 27500,
  "558022b54bdc2dac148b458d": 44067,
  "55802d5f4bdc2dac148b458e": 26678,
  "55802f5d4bdc2dac148b458f": 16796,
  "558032614bdc2de7118b4585": 10310,
  "559ba5b34bdc2d1f1a8b4582": 13377,
  "55d355e64bdc2d962f8b4569": 20648,
  "55d35ee94bdc2d61338b4568": 22586,
  "55d3632e4bdc2d972f8b4569": 30311,
  "55d4491a4bdc2d882f8b456e": 225442,
  "55d44fd14bdc2d962f8b456e": 2711,
  "55d459824bdc2d892f8b4573": 17422,
  "55d45d3f4bdc2d972f8b456c": 20437,
  "55d45f484bdc2d972f8b456d": 58282,
  "55d480c04bdc2d1d4e8b456a": 7554,
  "55d481904bdc2d8c2f8b456a": 23365,
  "55d482194bdc2d1d4e8b456b": 46249,
  "55d4837c4bdc2d1d4e8b456c": 4192,
  "55d484b44bdc2d1d4e8b456d": 21128,
  "55d485804bdc2d8c2f8b456b": 83164,
  "55d485be4bdc2d962f8b456f": 54507,
  "55d4887d4bdc2d962f8b4570": 17284,
  "55d48a634bdc2d8b2f8b456a": 64433,
  "55d48ebc4bdc2d8c2f8b456c": 12100,
  "55d4ae6c4bdc2d8b2f8b456e": 10452,
  "55d4b9964bdc2d1d4e8b456e": 7839,
  "55d614004bdc2d86028b4568": 30917,
  "55d6190f4bdc2d87028b4567": 39290,
  "55f84c3c4bdc2d5f408b4576": 27029,
  "560835c74bdc2dc8488b456f": 150000,
  "560838c94bdc2d77798b4569": 20926,
  "56083a334bdc2dc8488b4571": 35000,
  "56083be64bdc2d20478b456f": 98670,
  "56083cba4bdc2de22e8b456f": 5000,
  "56083e1b4bdc2dc8488b4572": 14123,
  "560d5e524bdc2d25448b4571": 39,
  "560d657b4bdc2da74d8b4572": 19951,
  "560e620e4bdc2d724b8b456b": 13345,
  "5644bd2b4bdc2d3b4c8b4572": 37450,
  "5645bc214bdc2d363b8b4571": 26061,
  "5645bcc04bdc2d363b8b4572": 34404,
  "5648a69d4bdc2ded0b8b457b": 48943,
  "5648a7494bdc2d9d488b4583": 31624,
  "5648ac824bdc2ded0b8b457d": 8024,
  "5648ae314bdc2d3d1c8b457f": 14667,
  "5648b1504bdc2d9d488b4584": 1000,
  "5648b4534bdc2d3d1c8b4580": 32108,
  "5649a2464bdc2d91118b45a8": 38638,
  "5649aa744bdc2ded0b8b457e": 19755,
  "5649ab884bdc2ded0b8b457f": 14036,
  "5649ade84bdc2d1b2b8b4587": 17161,
  "5649ae4a4bdc2d1b2b8b4588": 49895,
  "5649af094bdc2df8348b4586": 1654,
  "5649af884bdc2d1b2b8b4589": 37435,
  "5649b0544bdc2d1b2b8b458a": 708,
  "5649b1c04bdc2d16268b457c": 36235,
  "5649b2314bdc2d79388b4576": 19816,
  "5649be884bdc2d79388b4577": 10104,
  "5649d9a14bdc2d79388b4580": 14906,
  "564ca99c4bdc2d16268b4589": 5657,
  "564ca9df4bdc2d35148b4569": 25860,
  "564caa3d4bdc2d17108b458e": 47751,
  "5656d7c34bdc2d9d198b4587": 855,
  "5656eb674bdc2d35148b457c": 34800,
  "567143bf4bdc2d1a0f8b4567": 383382,
  "5672c92d4bdc2d180f8b4567": 30700,
  "5672cb124bdc2d1a0f8b4568": 12492,
  "5672cb304bdc2dc2088b456a": 11569,
  "5672cb724bdc2dc2088b456b": 47028,
  "5673de654bdc2d180f8b456d": 22386,
  "56742c284bdc2d98058b456d": 13830,
  "56742c2e4bdc2d95058b456d": 18400,
  "56742c324bdc2d150f8b456d": 13621,
  "56d59856d2720bd8418b456a": 16735,
  "56d59d3ad2720bdb418b4577": 454,
  "56dee2bdd2720bc8328b4567": 66893,
  "56deec93d2720bec348b4568": 67129,
  "56deed6ed2720b4c698b4583": 139844,
  "56deeefcd2720bc8328b4568": 88888,
  "56def37dd2720bec348b456a": 16596,
  "56dff0bed2720bb0668b4567": 102,
  "56dff216d2720bbd668b4568": 145,
  "56dff2ced2720bb4668b4567": 869,
  "56dff338d2720bbd668b4569": 95,
  "56dff3afd2720bba668b4567": 372,
  "56dff4a2d2720bbd668b456a": 344,
  "56dff4ecd2720b5f5a8b4568": 123,
  "56e0598dd2720bb5668b45a6": 15059,
  "56e05a6ed2720bd0748b4567": 13760,
  "56e05b06d2720bb2668b4586": 5528,
  "56e335e4d2720b6c058b456d": 23086,
  "56e33634d2720bd8058b456b": 40084,
  "56e33680d2720be2748b4576": 10036,
  "56ea6fafd2720b844b8b4593": 11793,
  "56ea70acd2720b844b8b4594": 38856,
  "56ea7165d2720b6e518b4583": 15203,
  "56ea7293d2720b8d4b8b45ba": 5050,
  "56ea8180d2720bf2698b456a": 18251,
  "56ea8222d2720b69698b4567": 5519,
  "56ea8d2fd2720b7c698b4570": 14203,
  "56eabcd4d2720b66698b4574": 26359,
  "56eabf3bd2720b75698b4569": 37178,
  "570fd6c2d2720bc6458b457f": 36808,
  "570fd721d2720bc5458b4596": 19564,
  "570fd79bd2720bc7458b4583": 16610,
  "5710c24ad2720bc3458b45a3": 13234,
  "571659bb2459771fb2755a12": 6538,
  "571a12c42459771f627b58a0": 10203,
  "571a279b24597720b4066566": 8887,
  "571a28e524597720b4066567": 10950,
  "571a29dc2459771fb2755a6a": 12273,
  "57235b6f24597759bf5a30f1": 65664,
  "572b7adb24597762ae139821": 40208,
  "572b7d8524597762b472f9d1": 18063,
  "572b7f1624597762ae139822": 10443,
  "572b7fa124597762b472f9d2": 20609,
  "572b7fa524597762b747ce82": 12143,
  "5733279d245977289b77ec24": 45179,
  "573474f924597738002c6174": 7231,
  "5734758f24597738025ee253": 31468,
  "573475fb24597737fb1379e1": 14365,
  "573476d324597737da2adc13": 5083,
  "573476f124597737e04bf328": 7759,
  "5734770f24597738025ee254": 9907,
  "5734773724597737fd047c14": 23054,
  "5734779624597737e04bf329": 19940,
  "573477e124597737dd42e191": 16091,
  "5734781f24597737e04bf32a": 25146,
  "573478bc24597738002c6175": 20290,
  "5734795124597738002c6176": 21127,
  "57347b8b24597737dd42e192": 22361,
  "57347baf24597738002c6178": 14223,
  "57347c1124597737fb1379e3": 22107,
  "57347c2e24597744902c94a1": 62949,
  "57347c5b245977448d35f6e1": 31338,
  "57347c77245977448d35f6e2": 24950,
  "57347c93245977448d35f6e3": 39980,
  "57347ca924597744596b4e71": 949946,
  "57347cd0245977445a2d6ff1": 15892,
  "57347d3d245977448f7b7f61": 22679,
  "57347d5f245977448b40fa81": 23752,
  "57347d692459774491567cf1": 22922,
  "57347d7224597744596b4e72": 18101,
  "57347d8724597744596b4e76": 33703,
  "57347d90245977448f7b7f65": 29144,
  "57347d9c245977448b40fa85": 29223,
  "57347da92459774491567cf5": 31002,
  "5735ff5c245977640e39ba7e": 167,
  "573601b42459776410737435": 274,
  "573602322459776445391df1": 199,
  "5736026a245977644601dc61": 54,
  "573718ba2459775a75491131": 145,
  "573719762459775a626ccbc1": 17,
  "573719df2459775a626ccbc2": 371,
  "57371aab2459775a77142f22": 124,
  "57371b192459775a9f58a5e0": 55,
  "57371e4124597760ff7b25f1": 108,
  "57371eb62459776125652ac1": 50,
  "57371f2b24597761224311f1": 30,
  "5737201124597760fc4431f1": 50,
  "5737207f24597760ff7b25f2": 154,
  "573720e02459776143012541": 368,
  "57372140245977611f70ee91": 509,
  "5737218f245977612125ba51": 269,
  "573722e82459776104581c21": 10912,
  "5737250c2459776125652acc": 18812,
  "573725b0245977612125bae2": 2323,
  "573726d824597765d96be361": 6740,
  "5737273924597765dd374461": 9636,
  "573728cc24597765cc785b5d": 11723,
  "57372d4c245977685a3da2a1": 124741,
  "57372db0245977685d4159b2": 38289,
  "57372deb245977685d4159b3": 20987,
  "57372e4a24597768553071c2": 1591,
  "57372e73245977685d4159b4": 51707,
  "57372ebf2459776862260582": 23325,
  "57372ee1245977685d4159b5": 22976,
  "57372fc52459776998772ca1": 8390,
  "5737300424597769942d5a01": 1844,
  "5737330a2459776af32363a1": 10000,
  "5737339e2459776af261abeb": 1200,
  "57486e672459770abd687134": 23787,
  "574d967124597745970e7c94": 30123,
  "574eb85c245977648157eec3": 26660,
  "57505f6224597709a92585a9": 54764,
  "575062b524597720a31c09a1": 11375,
  "57513f07245977207e26a311": 13467,
  "57513f9324597720a7128161": 13797,
  "57513fcc24597720a31c09a6": 20510,
  "5751435d24597720a27126d1": 18979,
  "57514643245977207f2c2d09": 32378,
  "575146b724597720a27126d5": 33711,
  "5751487e245977207e26a315": 23591,
  "5751496424597720a27126da": 19749,
  "5751a25924597722c463c472": 4665,
  "5751a89d24597722aa0e8db0": 189453,
  "5755356824597772cb798962": 6659,
  "5755383e24597772cb798966": 36426,
  "576165642459773c7a400233": 36858,
  "576167ab2459773cad038c43": 23729,
  "57616a9e2459773c7a400234": 2997,
  "576a581d2459771e7b1bc4f1": 20319,
  "576a5ed62459771e9c2096cb": 2000,
  "576a63cd2459771e796e0e11": 733,
  "576a7c512459771e796e0e17": 5468,
  "576fd4ec2459777f0b518431": 17372,
  "577d128124597739d65d0e56": 15470,
  "577d141e24597739c5255e01": 27520,
  "577e1c9d2459773cd707c525": 28592,
  "5780cda02459777b272ede61": 17319,
  "5780cf692459777de4559321": 15726,
  "5780cf722459777a5108b9a1": 71923,
  "5780cf7f2459777de4559322": 4052968,
  "5780cf942459777df90dcb72": 16999,
  "5780cf9e2459777df90dcb73": 31143,
  "5780cfa52459777dfb276eb1": 21058,
  "5780d0532459777a5108b9a2": 35741,
  "5780d0652459777df90dcb74": 30643,
  "5780d07a2459777de4559324": 26661,
  "57838ad32459774a17445cd2": 133694,
  "57838c962459774a1651ec63": 23770,
  "57838f0b2459774a256959b2": 7527,
  "57838f9f2459774a150289a0": 10959,
  "578395402459774a256959b5": 56323,
  "578395e82459774a0e553c7b": 16629,
  "5783c43d2459774bbe137486": 17235,
  "579204f224597773d619e051": 18822,
  "5798a2832459774b53341029": 48384,
  "57a0dfb82459774d3078b56c": 499,
  "57a3459f245977764a01f703": 17394,
  "57a349b2245977762b199ec7": 5327,
  "57a9b9ce2459770ee926038d": 409,
  "57ac965c24597706be5f975c": 136613,
  "57aca93d2459771f2c7e26db": 102218,
  "57acb6222459771ec34b5cb0": 22871,
  "57ade1442459771557167e15": 7674,
  "57adff4f24597737f373b6e6": 50065,
  "57ae0171245977343c27bfcf": 10975,
  "57af48872459771f0b2ebf11": 16631,
  "57c44b372459772d2b39b8ce": 284418,
  "57c44dd02459772d2e0ae249": 24551,
  "57c44f4f2459772d2c627113": 50858,
  "57c44fa82459772d2d75e415": 21548,
  "57c450252459772d28133253": 20333,
  "57c55efc2459772d2c6271e7": 23826,
  "57c55f092459772d291a8463": 15592,
  "57c55f112459772d28133310": 13383,
  "57c55f172459772d27602381": 11883,
  "57c5ac0824597754771e88a9": 32530,
  "57c69dd424597774c03b7bbc": 32282,
  "57c9a89124597704ee6faec1": 2727,
  "57cff947245977638e6f2a19": 26796,
  "57cffb66245977632f391a99": 27208,
  "57cffcd624597763133760c5": 25196,
  "57cffcdd24597763f5110006": 26599,
  "57cffce524597763b31685d8": 34052,
  "57cffd8224597763b03fc609": 17976,
  "57cffddc24597763133760c6": 17170,
  "57cffe0024597763b03fc60b": 19643,
  "57cffe20245977632f391a9d": 21220,
  "57d14d2524597714373db789": 20751,
  "57d1519e24597714373db79d": 21075,
  "57d152ec245977144076ccdf": 18623,
  "57d17c5e2459775a5c57d17d": 7699,
  "57d17e212459775a1179a0f5": 3157,
  "57da93632459771cb65bf83f": 29834,
  "57dbb57e2459774673234890": 30344,
  "57dc2fa62459775949412633": 28617,
  "57dc324a24597759501edc20": 10000,
  "57dc32dc245977596d4ef3d3": 2500,
  "57dc347d245977596754e7a1": 5000,
  "57e26ea924597715ca604a09": 7558,
  "57e26fc7245977162a14b800": 8143,
  "57ee59b42459771c7b045da5": 19459,
  "57f3a5ae2459772b0e0bf19e": 20503,
  "57f3c6bd24597738e730fa2f": 40080,
  "57f3c8cc2459773ec4480328": 15010,
  "57f4c844245977379d5c14d1": 16798,
  "57fd23e32459772d0805bcf1": 15051,
  "57ffa9f4245977728561e844": 11750,
  "57ffaea724597779f52b3a4d": 5621,
  "57ffb0062459777a045af529": 8212,
  "57ffb0e42459777d047111c5": 25023,
  "5827272a24597748c74bdeea": 16225,
  "58272b392459774b4c7b3ccd": 11616,
  "58272b842459774abc128d50": 7242,
  "58272d7f2459774f6311ddfd": 19071,
  "583990e32459771419544dd2": 29674,
  "5839a40f24597726f856b511": 62918,
  "58491f3324597764bc48fa02": 75265,
  "584924ec24597768f12ae244": 47363,
  "584984812459776a704a82a6": 23669,
  "587de4282459771bca0ec90b": 18446,
  "587de5ba2459771c0f1e8a58": 26000,
  "587df3a12459772c28142567": 8346,
  "587df583245977373c4f1129": 13348,
  "587e02ff24597743df3deaeb": 40783,
  "587e0531245977466077a0f7": 48326,
  "587e08ee245977446b4410cf": 19539,
  "58820d1224597753c90aeb13": 169,
  "588226d124597767ad33f787": 23939,
  "588226dd24597767ad33f789": 16534,
  "588226e62459776e3e094af7": 15050,
  "588226ef24597767af46e39c": 28212,
  "5887431f2459777e1612938f": 950,
  "588892092459774ac91d4b11": 98493,
  "5888945a2459774bf43ba385": 47524,
  "5888956924597752983e182d": 39991,
  "5888961624597754281f93f3": 55912,
  "5888976c24597754281f93f5": 28547,
  "5888988e24597752fe43a6fa": 16483,
  "5888996c24597754281f9419": 43059,
  "58889c7324597754281f9439": 39307,
  "58889d0c2459775bc215d981": 104473,
  "588b56d02459771481110ae2": 16884,
  "58948c8e86f77409493f7266": 45437,
  "58949edd86f77409483e16a9": 35302,
  "5894a05586f774094708ef75": 18296,
  "5894a2c386f77427140b8342": 24138,
  "5894a51286f77426d13baf02": 14208,
  "5894a5b586f77426d2590767": 39753,
  "58ac1bf086f77420ed183f9f": 53539,
  "58aeaaa886f7744fc1560f81": 13076,
  "58aeac1b86f77457c419f475": 16466,
  "58c157be86f77403c74b2bb6": 7837,
  "58c157c886f774032749fb06": 7192,
  "58d2664f86f7747fec5834f6": 28394,
  "58d268fc86f774111273f8c2": 47364,
  "58d2912286f7744e27117493": 66844,
  "58d2946386f774496974c37e": 13282,
  "58d2946c86f7744e271174b5": 17656,
  "58d2947686f774485c6a1ee5": 10764,
  "58d2947e86f77447aa070d53": 12383,
  "58d399e486f77442e0016fe7": 25702,
  "58d39b0386f77443380bf13c": 9023,
  "58d39d3d86f77445bb794ae7": 11876,
  "58d3db5386f77426186285a0": 22128,
  "5900b89686f7744e704a8747": 19875,
  "5909e99886f7740c983b9984": 21291,
  "590a358486f77429692b2790": 12407,
  "590a373286f774287540368b": 30388,
  "590a386e86f77429692b27ab": 15554,
  "590a391c86f774385a33c404": 26442,
  "590a3b0486f7743954552bdb": 25426,
  "590a3c0a86f774385a33c450": 14790,
  "590a3cd386f77436f20848cb": 26107,
  "590a3d9c86f774385926e510": 12178,
  "590a3efd86f77437d351a25b": 26435,
  "590c2b4386f77425357b6123": 15165,
  "590c2c9c86f774245b1f03f2": 9753,
  "590c2d8786f774245b1f03f3": 12544,
  "590c2e1186f77425357b6124": 47912,
  "590c311186f77424d1667482": 17013,
  "590c31c586f774245e3141b2": 26033,
  "590c346786f77423e50ed342": 32780,
  "590c35a486f774273531c822": 38398,
  "590c37d286f77443be3d7827": 52455,
  "590c392f86f77444754deb29": 39868,
  "590c595c86f7747884343ad7": 53246,
  "590c5a7286f7747884343aea": 27422,
  "590c5bbd86f774785762df04": 12498,
  "590c5c9f86f77477c91c36e7": 15482,
  "590c5d4b86f774784e1b9c45": 31821,
  "590c5f0d86f77413997acfab": 28602,
  "590c60fc86f77412b13fddcf": 372743,
  "590c621186f774138d11ea29": 20628,
  "590c639286f774151567fa95": 23878,
  "590c645c86f77412b01304d9": 29854,
  "590c651286f7741e566b6461": 40192,
  "590c657e86f77412b013051d": 69416,
  "590c661e86f7741e566b646a": 13096,
  "590c678286f77426c9660122": 24368,
  "590c695186f7741e566b64a2": 38783,
  "590de71386f774347051a052": 30597,
  "590de7e986f7741b096e5f32": 42871,
  "591094e086f7747caa7bb2ef": 343268,
  "5910968f86f77425cf569c32": 113906,
  "5913611c86f77479e0084092": 11396,
  "5913651986f774432f15d132": 12959,
  "59136a4486f774447a1ed172": 11119,
  "59136e1e86f774432f15d133": 23866,
  "59136f6f86f774447a1ed173": 13582,
  "591382d986f774465a6413a7": 23265,
  "591383f186f7744a4c5edcf3": 15227,
  "5913877a86f774432f15d444": 70671,
  "5913915886f774123603c392": 31296,
  "5914578086f774123569ffa4": 12232,
  "59148c8a86f774197930e983": 18815,
  "59148f8286f7741b951ea113": 14820,
  "591ae8f986f77406f854be45": 13553,
  "591aef7986f774139d495f03": 22218,
  "591af10186f774139d495f0e": 21544,
  "591af28e86f77414a27a9e1d": 20089,
  "591afe0186f77431bd616a11": 18459,
  "591c4e1186f77410354b316e": 6928,
  "591c4efa86f7741030027726": 15456,
  "591ee00d86f774592f7b841e": 10860,
  "5926bb2186f7744b1c6c6e60": 32400,
  "5926c0df86f77462f647f764": 18297,
  "5926c32286f774616e42de99": 20000,
  "5926c36d86f77467a92a8629": 22111,
  "5926c3b286f774640d189b6b": 23663,
  "5926d2be86f774134d668e4e": 2295,
  "5926d33d86f77410de68ebc0": 29468,
  "5926d3c686f77410de68ebc8": 97408,
  "5926dad986f7741f82604363": 29862,
  "5926e16e86f7742f5a0f7ecb": 29023,
  "5926f2e086f7745aae644231": 30069,
  "5926f34786f77469195bfe92": 35628,
  "5929a2a086f7744f4b234d43": 21307,
  "592c2d1a86f7746dbe2af32a": 66600,
  "5938144586f77473c2087145": 69372,
  "5938504186f7740991483f30": 19593,
  "593858c486f774253a24cb52": 5842,
  "5938603e86f77435642354f4": 7112,
  "59387a4986f77401cc236e62": 106328,
  "5938994586f774523a425196": 5427,
  "593aa4be86f77457f56379f8": 14665,
  "593d1fa786f7746da62d61ac": 15527,
  "593d489686f7745c6255d58a": 25898,
  "593d490386f7745ee97a1555": 44130,
  "593d493f86f7745e6b2ceb22": 49229,
  "5943ee5a86f77413872d25ec": 12140,
  "5943eeeb86f77412d6384f6b": 22241,
  "5947c73886f7747701588af5": 14113,
  "5947db3f86f77447880cf76f": 11748,
  "5947e98b86f774778f1448bc": 26071,
  "5947eab886f77475961d96c5": 37875,
  "5947f92f86f77427344a76b1": 33176,
  "5947fa2486f77425b47c1a9b": 24623,
  "595cf16b86f77427440c32e2": 19800,
  "595cfa8b86f77427437e845b": 86991,
  "5991b51486f77447b112d44f": 25297,
  "59984ab886f7743e98271174": 19636,
  "599851db86f77467372f0a18": 35000,
  "5998529a86f774647f44f421": 1602,
  "59985a6c86f77414ec448d17": 13609,
  "59985a8086f77414ec448d1a": 1300,
  "599860ac86f77436b225ed1a": 11315,
  "59bfc5c886f7743bf6794e62": 20653,
  "59bfe68886f7746004266202": 68226,
  "59bffbb386f77435b379b9c2": 97287,
  "59bffc1f86f77435b128b872": 24876,
  "59c0ec5b86f77435b128bfca": 34164,
  "59c63b4486f7747afb151c1c": 98501,
  "59c6633186f7740cf0493bb9": 18072,
  "59ccd11386f77428f24a488f": 54375,
  "59ccfdba86f7747f2109a587": 11453,
  "59d6088586f774275f37482f": 60069,
  "59d625f086f774661516605d": 9605,
  "59d6272486f77466146386ff": 16823,
  "59d64ec286f774171d1e0a42": 16000,
  "59d64f2f86f77417193ef8b3": 21000,
  "59d6507c86f7741b846413a2": 999,
  "59d6514b86f774171a068a08": 100080,
  "59d790f486f77403cb06aec6": 12335,
  "59db3a1d86f77429e05b4e92": 89168,
  "59db3acc86f7742a2c4ab912": 25622,
  "59db3b0886f77429d72fb895": 15777,
  "59db7e1086f77448be30ddf3": 26323,
  "59db7eed86f77461f8380365": 37811,
  "59e0bdb186f774156f04ce82": 20653,
  "59e0be5d86f7742d48765bd2": 14872,
  "59e0bed186f774156f04ce84": 31266,
  "59e3556c86f7741776641ac2": 12977,
  "59e3577886f774176a362503": 97618,
  "59e358a886f7741776641ac3": 14248,
  "59e3596386f774176c10a2a2": 30196,
  "59e35abd86f7741778269d82": 27223,
  "59e35cbb86f7741778269d83": 27449,
  "59e35de086f7741778269d84": 46192,
  "59e35ef086f7741777737012": 18123,
  "59e3606886f77417674759a5": 32439,
  "59e361e886f774176c10a2a5": 13845,
  "59e3639286f7741777737013": 119578,
  "59e3647686f774176a362507": 64019,
  "59e3658a86f7741776641ac4": 40397,
  "59e366c186f7741778269d85": 9974,
  "59e36c6f86f774176c10a2a7": 28209,
  "59e4cf5286f7741778269d8a": 480,
  "59e4d24686f7741776641ac7": 575,
  "59e4d3d286f774176a36250a": 124,
  "59e5d83b86f7745aed03d262": 998,
  "59e5f5a486f7746c530b3ce2": 19428,
  "59e6152586f77473dc057aa1": 31024,
  "59e6284f86f77440d569536f": 39400,
  "59e62cc886f77440d40b52a1": 37500,
  "59e6449086f7746c9f75e822": 32000,
  "59e649f986f77411d949b246": 109135,
  "59e6542b86f77411dc52a77a": 250,
  "59e655cb86f77411dc52a77b": 789,
  "59e6658b86f77411d949b250": 212,
  "59e6687d86f77411d949b251": 31603,
  "59e68f6f86f7746c9f75e846": 727,
  "59e6918f86f7746c9f75e849": 391,
  "59e6920f86f77411d82aa167": 528,
  "59e6927d86f77411da468256": 271,
  "59e7635f86f7742cbf2c1095": 22018,
  "59e7643b86f7742cbf2c109a": 15401,
  "59e7708286f7742cbd762753": 40045,
  "59e770b986f7742cbd762754": 24461,
  "59e770f986f7742cbe3164ef": 4262,
  "59e7711e86f7746cae05fbe1": 7925,
  "59e7715586f7742ee5789605": 32865,
  "59e77a2386f7742ee578960a": 3147,
  "59e89d0986f77427600d226e": 51332,
  "59e8a00d86f7742ad93b569c": 19813,
  "59eb7ebe86f7740b373438ce": 207975,
  "59ecc28286f7746d7a68aa8c": 36572,
  "59ecc3dd86f7746dc827481c": 41157,
  "59f8a37386f7747af3328f06": 51499,
  "59f98b4986f7746f546d2cef": 17917,
  "59f99a7d86f7745b134aa97b": 15268,
  "59f9cabd86f7743a10721f46": 22560,
  "59f9d81586f7744c7506ee62": 54773,
  "59faf7ca86f7740dbe19f6c2": 60992,
  "59faf98186f774067b6be103": 17722,
  "59fafb5d86f774067a6f2084": 55628,
  "59fafc5086f7740dbe19f6c3": 44867,
  "59fafc9386f774067d462453": 44561,
  "59fafd4b86f7745ca07e1232": 598002,
  "59fb023c86f7746d0d4b423c": 6531172,
  "59fb137a86f7740adb646af1": 36746,
  "59fb257e86f7742981561852": 28301,
  "59fb375986f7741b681b81a6": 12019,
  "59fc48e086f77463b1118392": 31697,
  "59ff346386f77477562ff5e2": 38279,
  "59ff3b6a86f77477562ff5ed": 37778,
  "5a0060fc86f7745793204432": 16563,
  "5a01c29586f77474660c694c": 7976,
  "5a0abb6e1526d8000a025282": 6095,
  "5a0c27731526d80618476ac4": 17805,
  "5a0c59791526d8dba737bba7": 32167,
  "5a0d63621526d8dba31fe3bf": 28276,
  "5a0d716f1526d8000d26b1e2": 14047,
  "5a0dc45586f7742f6b0b73e3": 75323,
  "5a0dc95c86f77452440fc675": 65799,
  "5a0ea64786f7741707720468": 59252,
  "5a0ea69f86f7741cd5406619": 19468,
  "5a0ea79b86f7741d4a35298e": 53472,
  "5a0eb38b86f774153b320eb0": 10200,
  "5a0eb6ac86f7743124037a28": 134960,
  "5a0ec13bfcdbcb00165aa685": 52137,
  "5a0ec6d286f7742c0b518fb5": 238107,
  "5a0ec70e86f7742c0b518fba": 20799,
  "5a0ee30786f774023b6ee08f": 190388,
  "5a0ee34586f774023b6ee092": 70891,
  "5a0ee37f86f774023657a86f": 85001,
  "5a0ee4b586f7743698200d22": 56725,
  "5a0ee62286f774369454a7ac": 17418,
  "5a0ee72c86f77436955d3435": 14377,
  "5a0ee76686f7743698200d5c": 18609,
  "5a0eeb1a86f774688b70aa5c": 29457,
  "5a0eeb8e86f77461257ed71a": 16235,
  "5a0eebed86f77461230ddb3d": 11013,
  "5a0eec9686f77402ac5c39f2": 50192,
  "5a0eecf686f7740350630097": 58053,
  "5a0eed4386f77405112912aa": 41634,
  "5a0eedb386f77403506300be": 13081,
  "5a0eee1486f77402aa773226": 82930,
  "5a0eff2986f7741fd654e684": 35065,
  "5a0f006986f7741ffd2fe484": 15392,
  "5a0f045e86f7745b0f0d0e42": 21142,
  "5a0f068686f7745b0d4ea242": 82733,
  "5a0f075686f7745bcc42ee12": 12111,
  "5a0f08bc86f77478f33b84c2": 44358,
  "5a0f0f5886f7741c4e32a472": 35324,
  "5a13ee1986f774794d4c14cd": 11666,
  "5a13eebd86f7746fd639aa93": 234194,
  "5a13ef0686f7746e5a411744": 71950,
  "5a13ef7e86f7741290491063": 96082,
  "5a13f24186f77410e57c5626": 195519,
  "5a13f35286f77413ef1436b0": 237682,
  "5a13f46386f7741dd7384b04": 43661,
  "5a144bdb86f7741d374bbde0": 61525,
  "5a144dfd86f77445cb5a0982": 91201,
  "5a1452ee86f7746f33111763": 87602,
  "5a145d4786f7744cbb6f4a12": 51270,
  "5a145d7b86f7744cbb6f4a13": 56505,
  "5a145ebb86f77458f1796f05": 26948,
  "5a16b672fcdbcb001912fa83": 21656,
  "5a16b8a9fcdbcb00165aa6ca": 50997,
  "5a16b93dfcdbcbcae6687261": 21147,
  "5a16b9fffcdbcb0176308b34": 51801,
  "5a16ba61fcdbcb098008728a": 23134,
  "5a16badafcdbcb001865f72d": 32883,
  "5a16bb52fcdbcb001a3b00dc": 15165,
  "5a17f98cfcdbcb0980087290": 15863,
  "5a17fb9dfcdbcbcae6687291": 41435,
  "5a1eacb3fcdbcb09800872be": 5058,
  "5a1ead28fcdbcb001912fa9f": 117439,
  "5a269f97c4a282000b151807": 832,
  "5a26abfac4a28232980eabff": 221,
  "5a26ac06c4a282000c5a90a8": 119,
  "5a27b281c4a28200741e1e52": 13530,
  "5a27b6bec4a282000e496f78": 20405,
  "5a27bad7c4a282000b15184b": 16030,
  "5a2a57cfc4a2826c6e06d44a": 14193,
  "5a329052c4a28200741e22d3": 45798,
  "5a32a064c4a28200741e22de": 34067,
  "5a32aa0cc4a28232996e405f": 8999,
  "5a32aa8bc4a2826c6e06d737": 33327,
  "5a339805c4a2826c6e06d73d": 14942,
  "5a33a8ebc4a282000c5a950d": 21416,
  "5a33b2c9c4a282000c5a9511": 26137,
  "5a33b652c4a28232996e407c": 12464,
  "5a33bab6c4a28200741e22f8": 41215,
  "5a33ca0fc4a282000d72292f": 11519,
  "5a33cae9c4a28232980eb086": 12602,
  "5a33e75ac4a2826c6e06d759": 31517,
  "5a34f7f1c4a2826c6e06d75d": 45573,
  "5a34fae7c4a2826c6e06d760": 29405,
  "5a34fbadc4a28200741e230a": 13448,
  "5a34fd2bc4a282329a73b4c5": 19474,
  "5a34fe59c4a282000b1521a2": 67287,
  "5a3501acc4a282000d72293a": 25390,
  "5a351711c4a282000b1521a4": 47672,
  "5a37ca54c4a282000d72296a": 26587,
  "5a37cb10c4a282329a73b4e7": 38008,
  "5a38e6bac4a2826c6e06d79b": 26380,
  "5a38ebd9c4a282000d722a5b": 118,
  "5a38ed75c4a28232996e40c6": 1000,
  "5a38ee51c4a282000c5a955c": 766,
  "5a398ab9c4a282000c5a9842": 23048,
  "5a398b75c4a282000a51a266": 28936,
  "5a3c16fe86f77452b62de32a": 472,
  "5a43943586f77416ad2f06e2": 65000,
  "5a43957686f7742a2c2f11b0": 396491,
  "5a5f1ce64f39f90b401987bc": 23032,
  "5a69a2ed8dc32e000d46d1f1": 76535,
  "5a6b5b8a8dc32e001207faf3": 17118,
  "5a6b5e468dc32e001207faf5": 18983,
  "5a6b5ed88dc32e000c52ec86": 22366,
  "5a6b60158dc32e000a31138b": 9724,
  "5a6f5f078dc32e00094b97dd": 12798,
  "5a702d198dc32e000b452fc3": 7582,
  "5a7033908dc32e000a311392": 10940,
  "5a70366c8dc32e001207fb06": 9769,
  "5a7037338dc32e000d46d257": 8597,
  "5a705e128dc32e000d46d258": 3344,
  "5a718b548dc32e000d46d262": 7641,
  "5a718f958dc32e00094b97e7": 40961,
  "5a71e22f8dc32e00094b97f4": 30464,
  "5a71e4f48dc32e001207fb26": 33971,
  "5a7828548dc32e5a9c28b516": 47879,
  "5a787ebcc5856700142fdd98": 10800,
  "5a787f25c5856700186c4ab9": 13931,
  "5a787f7ac5856700177af660": 157675,
  "5a788068c5856700137e4c8f": 64740,
  "5a788089c5856700142fdd9c": 3083,
  "5a7880d0c5856700142fdd9d": 46963,
  "5a78813bc5856700186c4abe": 171487,
  "5a788169c5856700142fdd9e": 9072,
  "5a78830bc5856700137e4c90": 11263,
  "5a78832ec5856700155a6ca3": 18274,
  "5a789261c5856700186c65d3": 7513,
  "5a7893c1c585673f2b5c374d": 12667,
  "5a78948ec5856700177b1124": 6868,
  "5a7ad0c451dfba0013379712": 8895,
  "5a7ad1fb51dfba0013379715": 6837,
  "5a7ad2e851dfba0016153692": 24158,
  "5a7ad4af51dfba0013379717": 15586,
  "5a7ad55551dfba0015068f42": 24492,
  "5a7ad74e51dfba0015068f45": 26688,
  "5a7ae0c351dfba0017554310": 21236,
  "5a7afa25e899ef00135e31b0": 9148,
  "5a7b32a2e899ef00135e345a": 18027,
  "5a7b483fe899ef0016170d15": 18876,
  "5a7b4900e899ef197b331a2a": 34128,
  "5a7b4960e899ef197b331a2d": 45895,
  "5a7c147ce899ef00150bd8b8": 7782,
  "5a7c4850e899ef00150be885": 42881,
  "5a7c74b3e899ef0014332c29": 14867,
  "5a7d90eb159bd400165484f1": 11357,
  "5a7dbfc1159bd40016548fde": 41804,
  "5a800961159bd4315e3a1657": 17122,
  "5a8036fb86f77407252ddc02": 30232,
  "5a80a29286f7742b25692012": 10995,
  "5a9548c9159bd400133e97b3": 18887,
  "5a957c3fa2750c00137fa5f7": 26457,
  "5a966ec8a2750c00171b3f36": 19494,
  "5a966f51a2750c00156aacf6": 26541,
  "5a9685b1a2750c0032157104": 19024,
  "5a9d56c8a2750c0032157146": 16448,
  "5a9d6d00a2750c5c985b5305": 10037,
  "5a9d6d13a2750c00164f6b03": 9149,
  "5a9d6d21a2750c00137fa649": 12348,
  "5a9d6d34a2750c00141e07da": 13289,
  "5a9e81fba2750c00164f6b11": 69100,
  "5a9ea27ca2750c00137fa672": 11716,
  "5a9eb32da2750c00171b3f9c": 42367,
  "5a9fb739a2750c003215717f": 22105,
  "5a9fbacda2750c00141e080f": 28152,
  "5a9fbb74a2750c0032157181": 25462,
  "5a9fbb84a2750c00137fa685": 63853,
  "5a9fc7e6a2750c0032157184": 16688,
  "5aa2a7e8e5b5b00016327c16": 3608,
  "5aa2b87de5b5b00016327c25": 1845,
  "5aa2b89be5b5b0001569311f": 8494,
  "5aa2b8d7e5b5b00014028f4a": 12596,
  "5aa2b923e5b5b000137b7589": 15989,
  "5aa2b986e5b5b00014028f4c": 8076,
  "5aa2b9aee5b5b00015693121": 27801,
  "5aa2b9ede5b5b000137b758b": 24762,
  "5aa2ba19e5b5b00014028f4e": 10326,
  "5aa2ba46e5b5b000137b758d": 25779,
  "5aa2ba71e5b5b000137b758f": 47915,
  "5aa66a9be5b5b0214e506e89": 30240,
  "5aa66be6e5b5b0214e506e97": 62453,
  "5aa66c72e5b5b00016327c93": 21045,
  "5aa7cfc0e5b5b00015693143": 48651,
  "5aa7d03ae5b5b00016327db5": 49077,
  "5aa7d193e5b5b000171d063f": 23156,
  "5aa7e373e5b5b000137b76f0": 46428,
  "5aa7e3abe5b5b000171d064d": 26907,
  "5aa7e454e5b5b0214e506fa2": 33184,
  "5aa7e4a4e5b5b000137b76f2": 33584,
  "5aaa4194e5b5b055d06310a5": 13066,
  "5aaa5dfee5b5b000140293d3": 26495,
  "5aaa5e60e5b5b000140293d6": 4004,
  "5aaf8a0be5b5b00015693243": 26248,
  "5aaf8e43e5b5b00015693246": 15740,
  "5aaf9d53e5b5b00015042a52": 26802,
  "5aafa1c2e5b5b00015042a56": 7140,
  "5aafa49ae5b5b00015042a58": 15416,
  "5aafbde786f774389d0cbc0f": 532829,
  "5ab372a310e891001717f0d8": 45055,
  "5ab3afb2d8ce87001660304d": 15527,
  "5ab8dab586f77441cd04f2a2": 35110,
  "5ab8dced86f774646209ec87": 66680,
  "5ab8e4ed86f7742d8e50c7fa": 55871,
  "5ab8e79e86f7742d8b372e78": 101071,
  "5ab8e9fcd8ce870019439434": 39277,
  "5ab8ee7786f7742d8f33f0b9": 9992,
  "5ab8f04f86f774585f4237d8": 20949,
  "5ab8f20c86f7745cdb629fb2": 8915,
  "5ab8f39486f7745cd93a1cca": 16814,
  "5ab8f4ff86f77431c60d91ba": 22135,
  "5ab8f85d86f7745cd93a1cf5": 21145,
  "5abcbb20d8ce87001773e258": 6176,
  "5abcbc27d8ce8700182eceeb": 37227,
  "5abcc328d8ce8700194394f3": 5284,
  "5abccb7dd8ce87001773e277": 22010,
  "5ac4c50d5acfc40019262e87": 9290,
  "5ac4cd105acfc40016339859": 38302,
  "5ac50c185acfc400163398d4": 23579,
  "5ac50da15acfc4001718d287": 1116,
  "5ac66bea5acfc43b321d4aec": 16473,
  "5ac66c5d5acfc4001718d314": 28098,
  "5ac66cb05acfc40198510a10": 32040,
  "5ac66d015acfc400180ae6e4": 36981,
  "5ac66d2e5acfc43b321d4b53": 35478,
  "5ac66d725acfc43b321d4b60": 30999,
  "5ac66d9b5acfc4001633997a": 32764,
  "5ac72e725acfc400180ae701": 9904,
  "5ac72e895acfc43b321d4bd5": 2208,
  "5ac72e945acfc43f3b691116": 31218,
  "5ac7655e5acfc40016339a19": 17228,
  "5ac78a9b86f7741cca0bbd8d": 37376,
  "5ac78eaf5acfc4001926317a": 20872,
  "5ad5ccd186f774446d5706e9": 17764,
  "5ad5cfbd86f7742c825d6104": 60623,
  "5ad5d20586f77449be26d877": 13719,
  "5ad5d49886f77455f9731921": 7893,
  "5ad5d64486f774079b080af8": 53966,
  "5ad5d7d286f77450166e0a89": 301964,
  "5ad5db3786f7743568421cce": 68019,
  "5ad7217186f7746744498875": 11530,
  "5ad7242b86f7740a6a3abd43": 12194,
  "5ad7247386f7747487619dc3": 69301,
  "5addaffe86f77470b455f900": 108842,
  "5addbac75acfc400194dbc56": 39302,
  "5addbb6e5acfc408fb1393fd": 8421,
  "5addbb825acfc408fb139400": 7282,
  "5addbb945acfc4001a5fc44e": 9141,
  "5addbba15acfc400185c2854": 8302,
  "5addbbb25acfc40015621bd9": 4102,
  "5addbf175acfc408fb13965b": 29934,
  "5addbfbb5acfc400194dbcf7": 193253,
  "5addbfd15acfc40015621bde": 11243,
  "5addbfe15acfc4001a5fc58b": 14604,
  "5addbfef5acfc400185c2857": 44327,
  "5addbffe5acfc4001714dfac": 18432,
  "5addc00b5acfc4001669f144": 18425,
  "5addc7005acfc4001669f275": 17355,
  "5addc7ac5acfc400194dbd90": 14458,
  "5addc7db5acfc4001669f279": 12772,
  "5addcce35acfc4001a5fc635": 54028,
  "5addccf45acfc400185c2989": 48073,
  "5ae08f0a5acfc408fb1398a1": 76807,
  "5ae0973a5acfc4001562206c": 6903,
  "5ae099875acfc4001714e593": 10641,
  "5ae09bff5acfc4001562219d": 99362,
  "5ae30c9a5acfc408fb139a03": 14369,
  "5ae30e795acfc408fb139a0b": 5643,
  "5ae35b315acfc4001714e8b0": 8621,
  "5af0454c86f7746bf20992e8": 25674,
  "5af0484c86f7740f02001f7f": 13412,
  "5af04b6486f774195a3ebb49": 23342,
  "5af0534a86f7743b6f354284": 91077,
  "5af0548586f7743a532b7e99": 115883,
  "5af0561e86f7745f5f3ad6ac": 38779,
  "5afd7ded5acfc40017541f5e": 17790,
  "5afd7e095acfc40017541f61": 5632,
  "5afd7e445acfc4001637e35a": 9931,
  "5b04473a5acfc40018632f70": 29600,
  "5b057b4f5acfc4771e1bd3e9": 117537,
  "5b07db875acfc40dc528a5f6": 44908,
  "5b07dd285acfc4001754240d": 41329,
  "5b0800175acfc400153aebd4": 24968,
  "5b099a9d5acfc47a8607efe7": 16423,
  "5b099ac65acfc400186331e1": 17870,
  "5b099b7d5acfc400186331e4": 5668,
  "5b099b965acfc400186331e6": 12479,
  "5b099bb25acfc400186331e8": 74531,
  "5b099bf25acfc4001637e683": 12457,
  "5b0bbe4e5acfc40dc528a72d": 119042,
  "5b0e794b5acfc47a877359b2": 92987,
  "5b1fa9b25acfc40018633c01": 47820,
  "5b1fa9ea5acfc40018633c0a": 109999,
  "5b1faa0f5acfc40dc528aeb5": 772839,
  "5b1fb3e15acfc4001637f068": 15979,
  "5b1fd4e35acfc40018633c39": 899,
  "5b222d335acfc4771e1be099": 24384,
  "5b222d405acfc400153af4fe": 21209,
  "5b2240bf5acfc40dc528af69": 33095,
  "5b237e425acfc4771e1be0b6": 37026,
  "5b2388675acfc4771e1be0be": 124552,
  "5b2389515acfc4771e1be0c0": 24363,
  "5b2cfa535acfc432ff4db7a0": 34578,
  "5b30ac585acfc433000eb79c": 32624,
  "5b30b0dc5acfc400153b7124": 11982,
  "5b30bc165acfc40016387293": 15072,
  "5b30bc285acfc47a8608615d": 104607,
  "5b31163c5acfc400153b71cb": 12586,
  "5b3116595acfc40019476364": 21011,
  "5b363dd25acfc4001a598fd2": 45012,
  "5b363dea5acfc4771e1c5e7e": 23513,
  "5b363e1b5acfc4771e1c5e80": 12571,
  "5b39f8db5acfc40016387a1b": 21709,
  "5b39ffbd5acfc47a8773fb06": 6186,
  "5b3a08b25acfc4001754880c": 7637,
  "5b3a16655acfc40016387a2a": 51694,
  "5b3a337e5acfc4704b4a19a0": 25750,
  "5b3b6dc75acfc47a8773fb1e": 14569,
  "5b3b6e495acfc4330140bd88": 28561,
  "5b3b713c5acfc4330140bd8d": 50241,
  "5b3b99265acfc4704b4a1afb": 102618,
  "5b3b99475acfc432ff4dcbee": 213596,
  "5b3baf8f5acfc40dc5296692": 40635,
  "5b3cadf35acfc400194776a0": 30357,
  "5b3f7bf05acfc433000ecf6b": 14669,
  "5b3f7c005acfc4704b4a1de8": 8086,
  "5b3f7c1c5acfc40dc5296b1d": 14922,
  "5b40e1525acfc4771e1c6611": 155857,
  "5b40e2bc5acfc40016388216": 92069,
  "5b40e3f35acfc40016388218": 78126,
  "5b40e4035acfc47a87740943": 65269,
  "5b40e5e25acfc4001a599bea": 9887,
  "5b40e61f5acfc4001a599bec": 2384,
  "5b4325355acfc40019478126": 11113,
  "5b4326435acfc433000ed01d": 9362,
  "5b4327aa5acfc400175496e0": 5908,
  "5b4329075acfc400153b78ff": 26210,
  "5b4329f05acfc47a86086aa1": 37209,
  "5b432b2f5acfc4771e1c6622": 21786,
  "5b432b6c5acfc4001a599bf0": 10785,
  "5b432b965acfc47a8774094e": 18016,
  "5b432be65acfc433000ed01f": 7351,
  "5b432c305acfc40019478128": 13775,
  "5b432d215acfc4771e1c6624": 37086,
  "5b432f3d5acfc4704b4a1dfb": 18379,
  "5b4335ba86f7744d2837a264": 16542,
  "5b43575a86f77424f443fe62": 49382,
  "5b4391a586f7745321235ab2": 914765,
  "5b44c6ae86f7742d1627baea": 91117,
  "5b44c8ea86f7742d1627baf1": 27502,
  "5b44cad286f77402a54ae7e5": 44846,
  "5b44cd8b86f774503d30cba2": 230125,
  "5b44cf1486f77431723e3d05": 214549,
  "5b44d0de86f774503d30cba8": 157513,
  "5b44d22286f774172b0c9de8": 51322,
  "5b46238386f7741a693bcf9c": 18763,
  "5b4736a986f774040571e998": 64677,
  "5b4736b986f77405cb415c10": 96728,
  "5b7be1265acfc400161d0798": 73814,
  "5b7be1ca5acfc400170e2d2f": 44237,
  "5b7be2345acfc400196d524a": 22356,
  "5b7be4575acfc400161d0832": 31277,
  "5b7be4645acfc400170e2dcc": 29177,
  "5b7be46e5acfc400170e2dcf": 173476,
  "5b7be47f5acfc400170e2dd2": 10718,
  "5b7be4895acfc400170e2dd5": 14359,
  "5b7bebc85acfc43bca706666": 30723,
  "5b7bed205acfc400161d08cc": 2458,
  "5b7bedd75acfc43d825283f9": 39739,
  "5b7bee755acfc400196d5383": 31632,
  "5b7bef1e5acfc43d82528402": 4725,
  "5b7bef5d5acfc43bca7067a3": 68563,
  "5b7bef9c5acfc43d102852ec": 79982,
  "5b7c2d1d5acfc43d1028532a": 24336,
  "5b7d37845acfc400170e2f87": 85095,
  "5b7d63b75acfc400170e2f8a": 22775,
  "5b7d63cf5acfc4001876c8df": 9912,
  "5b7d63de5acfc400170e2f8d": 20096,
  "5b7d64555acfc4001876c8e2": 22520,
  "5b7d645e5acfc400170e2f90": 2500,
  "5b7d671b5acfc43d82528ddd": 20933,
  "5b7d678a5acfc4001a5c4022": 6894,
  "5b7d679f5acfc4001a5c4024": 83407,
  "5b7d68af5acfc400170e30c3": 5808,
  "5b7d693d5acfc43bca706a3d": 10343,
  "5b7d6c105acfc40015109a5f": 11789,
  "5b800e9286f7747a8b04f3ff": 18760,
  "5b800ebc86f774394e230a90": 41943,
  "5b800ed086f7747baf6e2f9e": 20851,
  "5b80242286f77429445e0b47": 44573,
  "5b84038986f774774913b0c1": 20765,
  "5b8403a086f7747ff856f4e2": 29141,
  "5b86a0e586f7745b600ccb23": 38204,
  "5ba26383d4351e00334c93d9": 47373,
  "5ba264f6d4351e0034777d52": 9309,
  "5ba2657ed4351e0035628ff2": 87661,
  "5ba26586d4351e44f824b340": 133823,
  "5ba2678ad4351e44f824b344": 3365,
  "5ba26812d4351e003201fef1": 96,
  "5ba26acdd4351e003562908e": 28436,
  "5ba26ae8d4351e00367f9bdb": 111807,
  "5ba26b01d4351e0085325a51": 17581,
  "5bae13bad4351e00320204af": 20287,
  "5bae13ded4351e44f824bf38": 77452,
  "5bb20d92d4351e00853263eb": 66782,
  "5bb20d9cd4351e00334c9d8a": 20145,
  "5bb20da5d4351e0035629dbf": 29341,
  "5bb20dadd4351e00367faeff": 95165,
  "5bb20dbcd4351e44f824c04e": 10417,
  "5bb20de5d4351e0035629e59": 7181,
  "5bb20df1d4351e00347787d5": 6574,
  "5bb20dfcd4351e00334c9e24": 12585,
  "5bb20e0ed4351e3bac1212dc": 13141,
  "5bb20e18d4351e00320205d5": 9300,
  "5bb20e49d4351e3bac1212de": 15575,
  "5bb20e58d4351e00320205d7": 18218,
  "5bb20e70d4351e0035629f8f": 12287,
  "5bb2475ed4351e00853264e3": 74560,
  "5bbdb811d4351e45020113c7": 35884,
  "5bbdb83fd4351e44f824c44b": 9663,
  "5bbdb870d4351e00367fb67d": 54956,
  "5bbdb8bdd4351e4502011460": 34642,
  "5bbde409d4351e003562b036": 24286,
  "5bbde41ed4351e003562b038": 53786,
  "5bc09a18d4351e003562b68e": 20888,
  "5bc09a30d4351e00367fb7c8": 15702,
  "5bc5a351d4351e003477a414": 13806,
  "5bc5a35cd4351e450201232f": 17907,
  "5bc5a372d4351e44f824d17f": 15649,
  "5bc9b156d4351e00367fbce9": 19508,
  "5bc9b355d4351e6d1509862a": 25025,
  "5bc9b720d4351e450201234b": 28226,
  "5bc9b9ecd4351e3bac122519": 35223,
  "5bc9bc53d4351e00367fbcee": 62124,
  "5bc9bdb8d4351e003562b8a1": 37935,
  "5bc9be8fd4351e00334cae6e": 22172,
  "5bc9c049d4351e44f824d360": 39988,
  "5bc9c1e2d4351e00367fbcf0": 59079,
  "5bc9c29cd4351e003562b8a3": 20705,
  "5bc9c377d4351e3bac12251b": 39912,
  "5bd06f5d86f77427101ad47c": 21188,
  "5bd0716d86f774171822ef4b": 12515,
  "5bd071d786f7747e707b93a3": 15106,
  "5bd073a586f7747e6f135799": 15482,
  "5bd073c986f7747f627e796c": 16374,
  "5bd70322209c4d00d7167b8f": 76357,
  "5be4038986f774527d3fae60": 15987,
  "5bead2e00db834001c062938": 5040,
  "5bed61680db834001d2c45ab": 18963,
  "5bed625c0db834001c062946": 53446,
  "5beec2820db834001b095426": 30652,
  "5beec3420db834001b095429": 8572,
  "5beec8b20db834001961942a": 31683,
  "5beec8c20db834001d2c465c": 12450,
  "5beec8ea0db834001a6f9dbf": 13507,
  "5beec91a0db834001961942d": 26020,
  "5beecbb80db834001d2c465e": 32838,
  "5beed0f50db834001c062b12": 48034,
  "5bf3e03b0db834001d2c4a9c": 34697,
  "5bf3e0490db83400196199af": 23389,
  "5bfd297f0db834001a669119": 46606,
  "5bfd36290db834001966869a": 64852,
  "5bfd36ad0db834001c38ef66": 19918,
  "5bfd4cd60db834001c38f095": 17430,
  "5bfe7fb30db8340018089fed": 13069,
  "5bfe86a20db834001d23e8f7": 14937,
  "5bfe86df0db834001b734685": 15929,
  "5bfe89510db834001808a127": 41876,
  "5bfea6e90db834001b7347f3": 47484,
  "5bfeaa0f0db834001b734927": 42257,
  "5bfeb32b0db834001a6694d9": 26449,
  "5bfebc320db8340019668d79": 40370,
  "5bfebc530db834001d23eb65": 33329,
  "5bfebc5e0db834001a6694e5": 17806,
  "5bffcf7a0db83400232fea79": 4070,
  "5bffd7ed0db834001d23ebf9": 10898,
  "5bffdc370db834001d23eca8": 26499,
  "5bffe7c50db834001d23ece1": 13102,
  "5bffec120db834001c38f5fa": 2999,
  "5c0000c00db834001a6697fc": 212292,
  "5c00076d0db834001d23ee1f": 117500,
  "5c0009510db834001966907f": 31506,
  "5c0102aa0db834001b734ba1": 20250,
  "5c0102b20db834001d23eebc": 17332,
  "5c010a700db834001d23ef5d": 7530,
  "5c010e350db83400232feec7": 55004,
  "5c0111ab0db834001966914d": 18567,
  "5c0125fc0db834001a669aa3": 5806,
  "5c0126f40db834002a125382": 5056556,
  "5c012ffc0db834001d23f03f": 27535,
  "5c0505e00db834001b735073": 20188,
  "5c0517910db83400232ffee5": 97236,
  "5c05293e0db83400232fff80": 30094,
  "5c052a900db834001a66acbd": 23410,
  "5c052e6986f7746b207bc3c9": 206161,
  "5c052f6886f7746b1e3db148": 94179,
  "5c052fb986f7746b2101e909": 69886,
  "5c05300686f7746dce784e5d": 158748,
  "5c05308086f7746b2101e90b": 103430,
  "5c0530ee86f774697952d952": 1421970,
  "5c05413a0db834001c390617": 29500,
  "5c0548ae0db834001966a3c2": 36583,
  "5c064c400db834001d23f468": 22775,
  "5c06595c0db834001a66af6c": 35534,
  "5c066e3a0db834001b7353f0": 55514,
  "5c066ef40db834001966a595": 55975,
  "5c0672ed0db834001b7353f3": 11679,
  "5c0673fb0db8340023300271": 3820,
  "5c06779c86f77426e00dd782": 15072,
  "5c06782b86f77426df5407d2": 16661,
  "5c0684e50db834002a12585a": 12267,
  "5c0695860db834001b735461": 54281,
  "5c0696830db834001d23f5da": 36602,
  "5c06c6a80db834001b735491": 27834,
  "5c079ec50db834001966a706": 12656,
  "5c079ed60db834001a66b372": 11746,
  "5c07a8770db8340023300450": 30099,
  "5c07c5ed0db834001b73571c": 30014,
  "5c07c60e0db834002330051f": 46316,
  "5c07c9660db834001a66b588": 68181,
  "5c07dd120db834001c39092d": 76428,
  "5c07df7f0db834001b73588a": 11691,
  "5c08f87c0db8340019124324": 16168,
  "5c093e3486f77430cb02e593": 265534,
  "5c0a2cec0db834001b7ce47d": 68911,
  "5c0d2727d174af02a012cf58": 10277,
  "5c0d32fcd174af02a1659c75": 12619,
  "5c0d56a986f774449d5de529": 1415,
  "5c0d591486f7744c505b416f": 399,
  "5c0d5ae286f7741e46554302": 322,
  "5c0e2f26d174af02a9625114": 10000,
  "5c0e2f5cd174af02a012cfc9": 1500,
  "5c0e2f94d174af029f650d56": 18970,
  "5c0e2ff6d174af02a1659d4a": 8945,
  "5c0e3eb886f7742015526062": 59652,
  "5c0e446786f7742013381639": 74228,
  "5c0e51be86f774598e797894": 60362,
  "5c0e530286f7747fa1419862": 53387,
  "5c0e531286f7747fa54205c2": 61693,
  "5c0e531d86f7747fa23f4d42": 92779,
  "5c0e533786f7747fa23f4d47": 42693,
  "5c0e534186f7747fa1419867": 155778,
  "5c0e53c886f7747fa54205c7": 60657,
  "5c0e541586f7747fa54205c9": 159339,
  "5c0e57ba86f7747fa141986d": 63965,
  "5c0e5bab86f77461f55ed1f3": 52972,
  "5c0e5edb86f77461f55ed1f7": 58359,
  "5c0e625a86f7742d77340f62": 203251,
  "5c0e655586f774045612eeb2": 109354,
  "5c0e66e2d174af02a96252f4": 156727,
  "5c0e6a1586f77404597b4965": 29450,
  "5c0e722886f7740458316a57": 81763,
  "5c0e746986f7741453628fe5": 112368,
  "5c0e842486f77443a74d2976": 118926,
  "5c0e9f2c86f77432297fe0a3": 28488,
  "5c0fa877d174af02a012e1cf": 37095,
  "5c0faeddd174af02a962601f": 17359,
  "5c0faf68d174af02a96260b8": 8900,
  "5c0fafb6d174af02a96260ba": 3471,
  "5c10c8fd86f7743d7d706df3": 19999,
  "5c11046cd174af02a012e42b": 15012,
  "5c11279ad174af029d64592b": 1574,
  "5c1127bdd174af44217ab8b9": 26885,
  "5c12613b86f7743bbe2c3f76": 411965,
  "5c12620d86f7743f8b198b72": 241340,
  "5c1265fc86f7743f896a21c2": 73025,
  "5c1267ee86f77416ec610f72": 82059,
  "5c12688486f77426843c7d32": 58566,
  "5c127c4486f7745625356c13": 233810,
  "5c13cd2486f774072c757944": 9600,
  "5c13cef886f774072e618e82": 7516,
  "5c165d832e2216398b5a7e36": 41912,
  "5c17664f2e2216398b5a7e3c": 42801,
  "5c1780312e221602b66cc189": 14480,
  "5c17804b2e2216152006c02f": 16513,
  "5c178a942e22164bef5ceca3": 97941,
  "5c1793902e221602b21d3de2": 33306,
  "5c18b90d2e2216152142466b": 19181,
  "5c18b9192e2216398b5a8104": 18906,
  "5c1a1cc52e221602b3136e3d": 13234,
  "5c1a1e3f2e221602b66cc4c2": 117213,
  "5c1bc4812e22164bef5cfde7": 26025,
  "5c1bc5612e221602b5429350": 42210,
  "5c1bc5af2e221602b412949b": 55183,
  "5c1bc5fb2e221602b1779b32": 17302,
  "5c1bc7432e221602b412949d": 18098,
  "5c1bc7752e221602b1779b34": 8745,
  "5c1cd46f2e22164bef5cfedb": 150749,
  "5c1cdd302e221602b3137250": 49088,
  "5c1cdd512e22161b267d91ae": 19858,
  "5c1d0c5f86f7744bb2683cf0": 46639414,
  "5c1d0d6d86f7744bb2683e1f": 14806127,
  "5c1d0dc586f7744baf2e7b79": 84793477,
  "5c1d0efb86f7744baf2e7b7b": 93424530,
  "5c1d0f4986f7744bb01837fa": 4250440,
  "5c1e2a1e86f77431ea0ea84c": 59358,
  "5c1e2d1f86f77431e9280bee": 81934,
  "5c1e495a86f7743109743dfb": 18711902,
  "5c1f79a086f7746ed066fb8f": 162477,
  "5c3df7d588a4501f290594e5": 222,
  "5c46fbd72e2216398b5a8c9c": 95995,
  "5c471b5d2e221602b21d4e14": 34406,
  "5c471ba12e221602b3137d76": 17666,
  "5c471bd12e221602b4129c3a": 20000,
  "5c471be12e221602b66cd9ac": 145614,
  "5c471bfc2e221602b21d4e17": 25899,
  "5c471c2d2e22164bef5d077f": 17801,
  "5c471c442e221602b542a6f8": 11036,
  "5c471cb32e221602b177afaa": 110226,
  "5c488a752e221602b412af63": 69447,
  "5c48a14f2e2216152006edd7": 228375,
  "5c48a2852e221602b21d5923": 123703,
  "5c48a2a42e221602b66d1e07": 8209,
  "5c48a2c22e221602b313fb6c": 72301,
  "5c4ee3d62e2216152006f302": 16188,
  "5c4eec9b2e2216398b5aaba2": 58991,
  "5c4eecc32e221602b412b440": 40540,
  "5c501a4d2e221602b412b540": 38551,
  "5c5039be2e221602b177c9ff": 55000,
  "5c503ac82e221602b21d6e9a": 2241,
  "5c503ad32e2216398b5aada2": 17151,
  "5c503af12e221602b177ca02": 30000,
  "5c5952732e2216398b5abda2": 13472,
  "5c59529a2e221602b177d160": 41532,
  "5c5970672e221602b21d7855": 33672,
  "5c5db5c62e22160012542255": 159576,
  "5c5db5f22e2216000e5e47e8": 9478,
  "5c5db5fc2e2216000f1b2842": 9419,
  "5c5db6302e2216000e5e47f0": 10462,
  "5c5db63a2e2216000f1b284a": 17229,
  "5c5db6552e2216001026119d": 2500,
  "5c5db6652e221600113fba51": 49904,
  "5c5db6742e2216000f1b2852": 76940,
  "5c5db6b32e221600102611a0": 29374,
  "5c5db6ee2e221600113fba54": 20296,
  "5c5db6f82e2216003a0fe914": 24514,
  "5c6161fb2e221600113fbde5": 5525,
  "5c61627a2e22160012542c55": 13931,
  "5c6165902e22160010261b28": 34048,
  "5c617a5f2e2216000f1e81b3": 28817,
  "5c61a40d2e2216001403158d": 26212,
  "5c6592372e221600133e47d7": 67033,
  "5c6beec32e221601da3578f2": 8467,
  "5c6bf4aa2e2216001219b0ae": 43764,
  "5c6c2c9c2e2216000f2002e4": 17002,
  "5c6d10e82e221601da357b07": 17980,
  "5c6d10fa2e221600106f3f23": 18464,
  "5c6d11072e2216000e69d2e4": 11892,
  "5c6d11152e2216000f2003e7": 37255,
  "5c6d42cb2e2216000e69d7d1": 21057,
  "5c6d450c2e221600114c997d": 23662,
  "5c6d46132e221601da357d56": 28199,
  "5c6d5d8b2e221644fc630b39": 28836,
  "5c6d710d2e22165df16b81e7": 21617,
  "5c6d7b3d2e221600114c9b7d": 13511,
  "5c6d85e02e22165df16b81f4": 21203,
  "5c78f2492e221600114c9f04": 115559,
  "5c78f2612e221600114c9f0d": 63970,
  "5c78f26f2e221601da3581d1": 18528,
  "5c78f2792e221600106f4683": 14873,
  "5c78f2882e22165df16b832e": 14421,
  "5c791e872e2216001219c40a": 32463,
  "5c793fb92e221644f31bfb64": 142428,
  "5c793fc42e221600114ca25d": 125020,
  "5c793fde2e221601da358614": 54146,
  "5c7951452e221644f31bfd5c": 15169,
  "5c7954d52e221600106f4cc7": 39149,
  "5c7955c22e221644f31bfd5e": 50247,
  "5c7d55de2e221644f31bff68": 18425,
  "5c7d55f52e221644f31bff6a": 8817,
  "5c7d560b2e22160bc12c6139": 11885,
  "5c7e5f112e221600106f4ede": 17147,
  "5c7e8fab2e22165df16b889b": 28943,
  "5c7fb51d2e2216001219ce11": 38116,
  "5c7fc87d2e221644f31c0298": 21560,
  "5c82342f2e221644f31c060e": 19980,
  "5c82343a2e221644f31c0611": 19148,
  "5c86592b2e2216000e69e77c": 39754,
  "5c878e9d2e2216000f201903": 93289,
  "5c878ebb2e2216001219d48a": 18783,
  "5c87a07c2e2216001219d4a2": 45511,
  "5c87ca002e221600114cb150": 15077,
  "5c88f24b2e22160bc12c69a6": 38235,
  "5c90c3622e221601da359851": 29456,
  "5c920e902e221644f31c3c99": 65041,
  "5c94bbff86f7747ee735c08f": 190660,
  "5c99f3592e221644fc633070": 16948,
  "5c9a07572e221644f31c4b32": 37866,
  "5c9a1c3a2e2216000e69fb6a": 30134,
  "5c9a1c422e221600106f69f0": 19568,
  "5c9a25172e2216000f20314e": 20456,
  "5c9a26332e2216001219ea70": 30057,
  "5ca20abf86f77418567a43f2": 26754,
  "5ca20d5986f774331e7c9602": 26330,
  "5ca2151486f774244a3b8d30": 121624,
  "5cadc190ae921500103bb3b6": 17005,
  "5cadc1c6ae9215000f2775a4": 30021,
  "5cadc2e0ae9215051e1c21e7": 11591,
  "5cadd954ae921500103bb3c2": 6543,
  "5cadf6ddae9215051e1c23b2": 1395,
  "5cadf6e5ae921500113bb973": 420,
  "5cadfbf7ae92152ac412eeef": 71813,
  "5caf1041ae92157c28402e3f": 38911,
  "5caf1109ae9215753c44119f": 72553,
  "5caf16a2ae92152ac412efbc": 13469,
  "5caf17c9ae92150b30006be1": 12555,
  "5caf187cae92157c28402e43": 23699,
  "5cbda392ae92155f3c17c39f": 21820,
  "5cbda9f4ae9215000e5b9bfc": 1123,
  "5cbdaf89ae9215000e5b9c94": 11881,
  "5cbdb1b0ae9215000d50e105": 47222,
  "5cbdc23eae9215001136a407": 37744,
  "5cc6ea85e4a949000e1ea3c3": 53208,
  "5cc70093e4a949033c734312": 36004,
  "5cc700cae4a949035e43ba72": 25000,
  "5cc700d4e4a949000f0f0f28": 34296,
  "5cc700ede4a949033c734315": 35839,
  "5cc7012ae4a949001252b43e": 55742,
  "5cc70146e4a949000d73bf6b": 20092,
  "5cc701d7e4a94900100ac4e7": 99555,
  "5cc80f53e4a949000e1ea4f8": 936,
  "5cc80f79e4a949033c7343b2": 351,
  "5cc80f8fe4a949033b0224a2": 748,
  "5cc82d76e24e8d00134b4b83": 105547,
  "5cc86832d7f00c000d3a6e6c": 358,
  "5cc86840d7f00c002412c56c": 469,
  "5cc9a96cd7f00c011c04e04a": 18362,
  "5cc9ad73d7f00c000e2579d4": 19983,
  "5cc9b815d7f00c000e2579d6": 8222,
  "5cc9bcaed7f00c011c04e179": 22795,
  "5cc9c20cd7f00c001336c65d": 19047,
  "5cda9bcfd7f00c0c0b53e900": 46063,
  "5cdaa99dd7f00c002412d0b2": 15373,
  "5cdd7685d7f00c000f260ed2": 15324,
  "5cdd7693d7f00c0010373aa5": 14938,
  "5cde739cd7f00c0010373bd3": 34538,
  "5cde7afdd7f00c000d36b89d": 70507,
  "5cde7b43d7f00c000d36b93e": 58178,
  "5cdeac22d7f00c000f26168f": 22785,
  "5cdeac42d7f00c000d36ba73": 13961,
  "5cdeac5cd7f00c000f261694": 22248,
  "5cdeaca5d7f00c00b61c4b70": 6667,
  "5ce69cbad7f00c00b61c5098": 23839,
  "5cebec00d7f00c065c53522a": 69251,
  "5cebec38d7f00c00110a652a": 14094,
  "5cf12a15d7f00c05464b293f": 41131,
  "5cf13123d7f00c1085616a50": 21208,
  "5cf4e3f3d7f00c06595bc7f0": 37076,
  "5cf4fb76d7f00c065703d3ac": 8435,
  "5cf50850d7f00c056e24104c": 14825,
  "5cf508bfd7f00c056e24104e": 10055,
  "5cf50fc5d7f00c056c53f83c": 39900,
  "5cf518cfd7f00c065b422214": 30623,
  "5cf54404d7f00c108840b2ef": 20164,
  "5cf638cbd7f00c06595bc936": 17552,
  "5cf656f2d7f00c06585fb6eb": 54023,
  "5cf67a1bd7f00c06585fb6f3": 9527,
  "5cf67cadd7f00c065a5abab7": 18663,
  "5cf6935bd7f00c06585fb791": 23901,
  "5cf6937cd7f00c056c53fb39": 36246,
  "5cf78496d7f00c065703d6ca": 45262,
  "5cf78720d7f00c06595bc93e": 22602,
  "5cf79389d7f00c10941a0c4d": 7290,
  "5cf79599d7f00c10875d9212": 17986,
  "5cf8f3b0d7f00c00217872ef": 53100,
  "5cff9e5ed7ad1a09407397d4": 26265,
  "5cff9e84d7ad1a049e54ed55": 58862,
  "5d00e0cbd7ad1a6c6566a42d": 17162,
  "5d00ec68d7ad1a04a067e5be": 40043,
  "5d00ede1d7ad1a0940739a76": 15377,
  "5d00ef6dd7ad1a0940739b16": 36813,
  "5d00f63bd7ad1a59283b1c1e": 13977,
  "5d010d1cd7ad1a59283b1ce7": 22581,
  "5d0236dad7ad1a0940739d29": 45891,
  "5d023784d7ad1a049d4aa7f2": 15771,
  "5d024f5cd7ad1a04a067e91a": 20324,
  "5d025cc1d7ad1a53845279ef": 84814,
  "5d02676dd7ad1a049e54f6dc": 16588,
  "5d02677ad7ad1a04a15c0f95": 12910,
  "5d026791d7ad1a04a067ea63": 38344,
  "5d02778e86f774203e7dedbe": 45074,
  "5d02797c86f774203f38e30a": 59021,
  "5d0375ff86f774186372f685": 36808,
  "5d0376a486f7747d8050965c": 33225,
  "5d03775b86f774203e7e0c4b": 114939,
  "5d0377ce86f774186372f689": 56184,
  "5d03784a86f774203e7e0c4d": 47083,
  "5d0378d486f77420421a5ff4": 358137,
  "5d03794386f77420415576f5": 218430,
  "5d0379a886f77420407aa271": 35259,
  "5d08d21286f774736e7c94c3": 233486,
  "5d0a29ead7ad1a0026013f27": 12221,
  "5d0a29fed7ad1a002769ad08": 41831,
  "5d0a3a58d7ad1a669c15ca14": 17896,
  "5d0a3e8cd7ad1a6f6a3d35bd": 18940,
  "5d10b49bd7ad1a1a560708b0": 11252,
  "5d120a10d7ad1a4e1026ba85": 20823,
  "5d120a28d7ad1a1c8962e295": 14967,
  "5d122e7bd7ad1a07102d6d7f": 22531,
  "5d123102d7ad1a004e475fe5": 21800,
  "5d133067d7ad1a33013f95b4": 15321,
  "5d1340b3d7ad1a0b52682ed7": 22841,
  "5d1340bdd7ad1a0e8d245aab": 41343,
  "5d1340cad7ad1a0b0b249869": 32691,
  "5d135e83d7ad1a21b83f42d8": 58367,
  "5d135ecbd7ad1a21c176542e": 36866,
  "5d15ce51d7ad1a1eff619092": 10436,
  "5d15cf3bd7ad1a67e71518b2": 39966,
  "5d19cd96d7ad1a4a992c9f52": 17606,
  "5d1b198cd7ad1a604869ad72": 12682,
  "5d1b2f3f86f774252167a52c": 328718,
  "5d1b2fa286f77425227d1674": 95283,
  "5d1b2ffd86f77425243e8d17": 28066,
  "5d1b304286f774253763a528": 31124,
  "5d1b309586f77425227d1676": 27794,
  "5d1b313086f77425227d1678": 21453,
  "5d1b317c86f7742523398392": 39441,
  "5d1b31ce86f7742523398394": 17841,
  "5d1b327086f7742525194449": 47984,
  "5d1b32c186f774252167a530": 29348,
  "5d1b33a686f7742523398398": 192617,
  "5d1b36a186f7742523398433": 277655,
  "5d1b371186f774253763a656": 131889,
  "5d1b376e86f774252519444e": 407177,
  "5d1b385e86f774252167b98a": 193919,
  "5d1b392c86f77425243e98fe": 20144,
  "5d1b39a386f774252339976f": 18082,
  "5d1b3a5d86f774252167ba22": 27274,
  "5d1b3f2d86f774253763b735": 32008,
  "5d1c702ad7ad1a632267f429": 27832,
  "5d1c774f86f7746d6620f8db": 14976,
  "5d1c819a86f774771b0acd6c": 28603,
  "5d1f819086f7744b355c219b": 34406,
  "5d235a5986f77443f6329bc6": 54934,
  "5d235b4d86f7742e017bc88a": 32398,
  "5d235bb686f77443f4331278": 6903145,
  "5d2369418abbc306c62e0c80": 23839,
  "5d25a4a98abbc30b917421a4": 18246,
  "5d25a6538abbc306c62e630d": 34357,
  "5d25a6a48abbc306c62e6310": 31588,
  "5d25a7b88abbc3054f3e60bc": 33256,
  "5d25af8f8abbc3055079fec5": 38824,
  "5d25d0ac8abbc3054f3e61f7": 37924,
  "5d2c76ed48f03532f2136169": 12700,
  "5d2c770c48f0354b4a07c100": 120784,
  "5d2c772c48f0355d95672c25": 22780,
  "5d2c829448f0353a5c7d6674": 5249,
  "5d2da1e948f035477b1ce2ba": 21848,
  "5d2dc3e548f035404a1a4798": 48667,
  "5d2f0d8048f0356c925bc3b0": 21996,
  "5d2f259b48f0355a844acd74": 50000,
  "5d2f25bc48f03502573e5d85": 150000,
  "5d2f261548f03576f500e7b7": 99999,
  "5d3eb3b0a4b93615055e84d2": 35140,
  "5d3eb44aa4b93650d64e4979": 150000,
  "5d3eb4aba4b93650d64e497d": 40061,
  "5d3eb536a4b9363b1f22f8e2": 30717,
  "5d3eb59ea4b9361c284bb4b2": 66826,
  "5d3eb5b6a4b9361eab311902": 33057,
  "5d3eb5eca4b9363b1f22f8e4": 33338,
  "5d3ef698a4b9361182109872": 31962,
  "5d403f9186f7743cac3f229b": 70700,
  "5d40407c86f774318526545a": 25395,
  "5d40412b86f7743cb332ac3a": 31472,
  "5d40419286f774318526545f": 19050,
  "5d4041f086f7743cac3f22a7": 11658,
  "5d40425986f7743185265461": 12900,
  "5d4042a986f7743185265463": 21769,
  "5d43021ca4b9362eab4b5e25": 129310,
  "5d4405aaa4b9361e6a4e6bd3": 22615,
  "5d4405f0a4b9361e6a4e6bd9": 25420,
  "5d440625a4b9361eec4ae6c5": 12543,
  "5d44064fa4b9361e4f6eb8b5": 58684,
  "5d44069ca4b9361ebd26fc37": 54238,
  "5d4406a8a4b9361e4f6eb8b7": 62734,
  "5d440b93a4b9364276578d4b": 66492,
  "5d440b9fa4b93601354d480c": 65586,
  "5d44334ba4b9362b346d1948": 53401,
  "5d443f8fa4b93678dd4a01aa": 19418,
  "5d4aaa54a4b9365392071170": 27205,
  "5d4aaa73a4b9365392071175": 25972,
  "5d4aab30a4b9365435358c55": 72328,
  "5d5d646386f7742797261fd9": 116033,
  "5d5d85c586f774279a21cbdb": 26965,
  "5d5d87f786f77427997cfaef": 67911,
  "5d5d8ca986f7742798716522": 13898,
  "5d5d940f86f7742797262046": 45192,
  "5d5e7d28a4b936645d161203": 63013,
  "5d5e9c74a4b9364855191c40": 63863,
  "5d5fca1ea4b93635fd598c07": 11229,
  "5d63d33b86f7746ea9275524": 9778,
  "5d67abc1a4b93614ec50137f": 58542,
  "5d6d2e22a4b9361bd5780d05": 9505,
  "5d6d2ef3a4b93618084f58bd": 13983,
  "5d6d3716a4b9361bc8618872": 62507,
  "5d6d3829a4b9361bc8618943": 50160,
  "5d6d3943a4b9360dbc46d0cc": 15144,
  "5d6d3be5a4b9361bc73bc763": 27142,
  "5d6e6772a4b936088465b17c": 74,
  "5d6e67fba4b9361bc73bc779": 105,
  "5d6e6806a4b936088465b17e": 958,
  "5d6e6869a4b9361c140bcfde": 91,
  "5d6e689ca4b9361bc8618956": 229,
  "5d6e68c4a4b9361b93413f79": 1065,
  "5d6e68dea4b9361bcc29e659": 89,
  "5d6e68e6a4b9361c140bcfe0": 323,
  "5d6e6911a4b9361bd5780d52": 3116,
  "5d6e695fa4b936359b35d852": 114,
  "5d6e69b9a4b9361bc8618958": 30,
  "5d6e69c7a4b9360b6c0d54e4": 39,
  "5d6e6a05a4b93618084f58d0": 137,
  "5d6e6a42a4b9364f07165f52": 65,
  "5d6e6a53a4b9361bd473feec": 50,
  "5d6e6a5fa4b93614ec501745": 207,
  "5d6fc78386f77449d825f9dc": 45336,
  "5d6fc87386f77449db3db94e": 22255,
  "5d7b6bafa4b93652786f4c76": 28389,
  "5d80c60f86f77440373c4ece": 2180630,
  "5d80c62a86f7744036212b3f": 1948036,
  "5d80c66d86f774405611c7d6": 18071,
  "5d80c6c586f77440351beef1": 271546,
  "5d80c6fc86f774403a401e3c": 28680,
  "5d80c78786f774403a401e3e": 14651,
  "5d80c88d86f77440556dbf07": 35481,
  "5d80c8f586f77440373c4ed0": 25355,
  "5d80c93086f7744036212b41": 18934,
  "5d80c95986f77440351beef3": 25063,
  "5d80ca9086f774403a401e40": 28127,
  "5d80cab086f77440535be201": 32415,
  "5d80cb3886f77440556dbf09": 22064,
  "5d80cb5686f77440545d1286": 27424,
  "5d80cb8786f774405611c7d9": 10622,
  "5d80cbd886f77470855c26c2": 25729,
  "5d80ccac86f77470841ff452": 210849,
  "5d80ccdd86f77474f7575e02": 172547,
  "5d80cd1a86f77402aa362f42": 71062,
  "5d8e0db586f7744450412a42": 28314,
  "5d8e0e0e86f774321140eb56": 72243,
  "5d8e15b686f774445103b190": 26918,
  "5d8e3ecc86f774414c78d05e": 25301,
  "5d947d3886f774447b415893": 179853,
  "5d947d4e86f774447b415895": 181078,
  "5d95d6be86f77424444eb3a7": 25364,
  "5d95d6fa86f77424484aa5e9": 25779,
  "5d96141523f0ea1b7f2aacab": 15836,
  "5d9f1fa686f774726974a992": 70867,
  "5da46e3886f774653b7a83fe": 27959,
  "5da5cdcd86f774529238fb9b": 16128,
  "5da743f586f7744014504f72": 57223,
  "5dcbd6b46ec07c0c4347a564": 138770,
  "5dcbd6dddbd3d91b3e5468de": 42839,
  "5dcbe9431e1f4616d354987e": 229364,
  "5dcbe965e4ed22586443a79d": 12363,
  "5de652c31b7e3716273428be": 27419,
  "5de653abf76fdc1ce94a5a2a": 3118,
  "5de6558e9f98ac2bc65950fc": 2999,
  "5de7bd7bfd6b4e6e2276dc25": 42630,
  "5de8e8dafd6b4e6e2276dc32": 4067,
  "5de8eaadbbaf010b10528a6d": 32136,
  "5de8eac42a78646d96665d91": 48410,
  "5de8f2d5b74cd90030650c72": 31055,
  "5de8fbad2fbe23140d3ee9c4": 49999,
  "5de8fbf2b74cd90030650c79": 36231,
  "5de8fc0b205ddc616a6bc51b": 12308,
  "5df24cf80dee1b22f862e9bc": 66424,
  "5df25b6c0b92095fd441e4cf": 53438,
  "5df35e7f2a78646d96665dd4": 10951,
  "5df35ea9c41b2312ea3334d8": 25869,
  "5df35eb2b11454561e3923e2": 20952,
  "5df38a5fb74cd90030650cb6": 90000,
  "5df8a2ca86f7740bfe6df777": 24291,
  "5df8a42886f77412640e2e75": 43375,
  "5df8a58286f77412631087ed": 11094,
  "5df8e085bb49d91fb446d6a8": 11499,
  "5df8e4080b92095fd441e594": 125138,
  "5df8f535bb49d91fb446d6b0": 14184,
  "5df8f541c41b2312ea3335e3": 24150,
  "5df916dfbb49d91fb446d6b9": 20814,
  "5df917564a9f347bc92edca3": 18786,
  "5dfa397fb11454561e39246c": 34020,
  "5dfa3cd1b33c0951220c079b": 9445,
  "5dfa3d2b0dee1b22f862eade": 70731,
  "5dfa3d45dfc58d14537c20b0": 9746,
  "5dfa3d7ac41b2312ea33362a": 12081,
  "5dfa3d950dee1b22f862eae0": 23620,
  "5dfcd0e547101c39625f66f9": 26051,
  "5dfce88fe9dc277128008b2e": 68416,
  "5dfe14f30b92095fd441edaf": 13862,
  "5dfe6104585a0c3e995c7b82": 40249,
  "5dff772da3651922b360bf91": 16979,
  "5dff77c759400025ea5150cf": 10505,
  "5dff8db859400025ea5150d4": 60890,
  "5e00903ae9dc277128008b87": 42813,
  "5e00cfa786f77469dc6e5685": 109281,
  "5e01e9e273d8eb11426f5bc3": 86615,
  "5e01ea19e9dc277128008c0b": 53899,
  "5e01f31d86f77465cf261343": 111637,
  "5e023cf8186a883be655e54f": 552,
  "5e023e53d4353e3302577c4c": 1105,
  "5e023e6e34d52a55c3304f71": 549,
  "5e023e88277cce2b522ff2b1": 834,
  "5e208b9842457a4a7a33d074": 29979,
  "5e217ba4c1434648c13568cd": 26791,
  "5e2192a498a36665e8337386": 40509,
  "5e21a3c67e40bd02257a008a": 40041,
  "5e21ca18e4d47f0da15e77dd": 20177,
  "5e2aedd986f7746d404f3aa4": 194628,
  "5e2aee0a86f774755a234b62": 59672,
  "5e2aef7986f7746d3f3c33f5": 25412,
  "5e2af00086f7746d3f3c33f7": 15490,
  "5e2af02c86f7746d420957d4": 25712,
  "5e2af22086f7746d3f3c33fa": 13592,
  "5e2af29386f7746d4159f077": 27164,
  "5e2af2bc86f7746d3f3c33fc": 13623,
  "5e2af37686f774755a234b65": 19292,
  "5e2af41e86f774755a234b67": 21115,
  "5e2af47786f7746d404f3aaa": 11734,
  "5e2af4a786f7746d3f3c3400": 36018,
  "5e2af4d286f7746d4159f07a": 20226,
  "5e2af51086f7746d3f3c3402": 22092,
  "5e2af55f86f7746d4159f07c": 321399,
  "5e32f56fcb6d5863cc5e5ee4": 28684,
  "5e340dcdcb6d5863cc5e5efb": 30516,
  "5e42c71586f7747f245e1343": 215572,
  "5e42c81886f7742a01529f57": 65708,
  "5e42c83786f7742a021fdf3c": 41742,
  "5e4abb5086f77406975c9342": 159431,
  "5e4abc1f86f774069619fbaa": 13017,
  "5e4abc6786f77406812bd572": 45679,
  "5e4abfed86f77406a2713cf7": 18609,
  "5e4ac41886f77406a511c9a8": 61634,
  "5e4bfc1586f774264f7582d3": 80750,
  "5e4d34ca86f774264f758330": 31424,
  "5e54f62086f774219b0f1937": 31226,
  "5e54f6af86f7742199090bf3": 32904,
  "5e54f76986f7740366043752": 26765,
  "5e54f79686f7744022011103": 59648,
  "5e56991336989c75ab4f03f6": 21408,
  "5e5699df2161e06ac158df6f": 17136,
  "5e569a0156edd02abe09f27d": 15946,
  "5e569a132642e66b0b68015c": 17434,
  "5e569a2e56edd02abe09f280": 22142,
  "5e71f70186f77429ee09f183": 1138181,
  "5e71fad086f77422443d4604": 237487,
  "5e81c3cbac2bb513793cdc75": 14094,
  "5e81c4ca763d9f754677befa": 6666,
  "5e81ee4dcb2b95385c177582": 8710,
  "5e81f423763d9f754677bf2e": 859,
  "5e831507ea0a7c419c2f9bd9": 6890,
  "5e8488fa988a8701445df1e4": 30794,
  "5e848d51e4dbc5266a4ec63b": 32696,
  "5e848d99865c0f329958c83b": 98413,
  "5e848dc4e4dbc5266a4ec63d": 43143,
  "5e85a9a6eacf8c039e4e2ac1": 454,
  "5e85aa1a988a8701445df1f5": 256,
  "5e870397991fd70db46995c8": 36952,
  "5e87076ce2db31558c75a11d": 19319,
  "5e87080c81c4ed43e83cefda": 37518,
  "5e87114fe2db31558c75a120": 2555,
  "5e87116b81c4ed43e83cefdd": 44444,
  "5e8f3423fd7471236e6e3b64": 35744,
  "5e997f0b86f7741ac73993e2": 34937,
  "5e9dacf986f774054d6b89f4": 172197,
  "5e9db13186f7742f845ee9d3": 46127,
  "5e9dcf5986f7746c417435b3": 26875,
  "5ea034eb5aad6446a939737b": 7407,
  "5ea034f65aad6446a939737e": 43986,
  "5ea03f7400685063ec28bfa8": 31350,
  "5ea058e01dbce517f324b3e2": 178944,
  "5ea05cf85ad9772e6624305d": 27225,
  "5ea16acdfadf1d18c87b0784": 20985,
  "5ea16ada09aa976f2e7a51be": 38144,
  "5ea16d4d5aad6446a939753d": 26745,
  "5ea172e498dacb342978818e": 44072,
  "5ea17bbc09aa976f2e7a51cd": 38371,
  "5ea17ca01412a1425304d1c0": 91078,
  "5ea18c84ecf1982c7712d9a2": 487401,
  "5ea2a8e200685063ec28c05a": 2149,
  "5ed515c8d380ab312177c0fa": 48096,
  "5ed515e03a40a50460332579": 26169,
  "5ed515ece452db0eb56fc028": 25923,
  "5ed515f6915ec335206e4152": 31172,
  "5ed5160a87bb8443d10680b5": 47418,
  "5ed51652f6c34d2cc26336a1": 193595,
  "5ed5166ad380ab312177c100": 38999,
  "5ede4739e0350d05467f73e8": 39899,
  "5ede475339ee016e8c534742": 20837,
  "5ede475b549eed7c6d5c18fb": 35655,
  "5ede7a8229445733cb4c18e2": 298080,
  "5ede7b0c6d23e5473e6e8c66": 49759,
  "5eea21647547d6330471b3c9": 11020,
  "5eea217fc64c5d0dfc05712a": 10056,
  "5eeb2ff5ea4f8b73c827350b": 10058,
  "5ef1b9f0c64c5d0dfc0571a1": 7506,
  "5ef1ba28c64c5d0dfc0571a5": 43621,
  "5ef3448ab37dfd6af863525c": 23558,
  "5ef366938cef260c0642acad": 5510,
  "5ef369b08cef260c0642acaf": 11111,
  "5ef61964ec7f42238c31e0c1": 12590,
  "5efaf417aeb21837e749c7f2": 115362,
  "5efb0d4f4bc50b58e81710f3": 1030,
  "5efb0e16aeb21837e749c7ff": 768,
  "5efb0fc6aeb21837e749c801": 847,
  "5efde6b4f5448336730dbd61": 517148,
  "5eff09cd30a7dc22fd1ddfed": 83201,
  "5f2a9575926fd9352339381f": 44025,
  "5f2aa43ba9b91d26f20ae6d2": 28438,
  "5f2aa4464b50c14bcf07acdb": 13058,
  "5f2aa4559b44de6b1b4e68d1": 11641,
  "5f2aa46b878ef416f538b567": 100000,
  "5f2aa47a200e2c0ee46efa71": 100000,
  "5f36a0e5fbf956000b716b65": 13087,
  "5f3e778efcd9b651187d7201": 45000,
  "5f3e77b26cda304dcc634057": 11547,
  "5f3e77f59103d430b93f94c1": 19021,
  "5f3e7801153b8571434a924c": 14828,
  "5f3e7823ddc4f03b010e2045": 40000,
  "5f4f9eb969cdc30ff33f09db": 40815,
  "5f5e45cc5021ce62144be7aa": 20275,
  "5f5e467b0bc58666c37e7821": 76817,
  "5f5f41476bdad616ad46d631": 94272,
  "5f5f41f56760b4138443b352": 24716,
  "5f60b85bbdb8e27dee3dc985": 48443,
  "5f60bf4558eff926626a60f2": 27477,
  "5f60c076f2bcbb675b00dac2": 35250,
  "5f60cd6cf2bcbb675b00dac6": 95996,
  "5f60e6403b85f6263c14558c": 27677,
  "5f60e7788adaa7100c3adb49": 24214,
  "5f60e784f2bcbb675b00dac7": 17140,
  "5f6331e097199b7db2128dc2": 28308,
  "5f6336bbda967c74a42e9932": 33514,
  "5f6339d53ada5942720e2dc3": 127585,
  "5f633f68f5750b524b45f112": 42223,
  "5f633f791b231926f2329f13": 25571,
  "5f633ff5c444ce7e3c30a006": 45142,
  "5f63405df5750b524b45f114": 25955,
  "5f63407e1b231926f2329f15": 36741,
  "5f6340d3ca442212f4047eb2": 43711,
  "5f6341043ada5942720e2dc5": 40825,
  "5f63418ef5750b524b45f116": 19531,
  "5f6372e2865db925d54f3869": 26214,
  "5f647f31b6238e5dd066e196": 216,
  "5f745ee30acaeb0d490d8c5b": 39311,
  "5f9949d869e2777a0e779ba5": 90162,
  "5fb64bc92b1b027b1f50bcf2": 89270,
  "5fb651b52b1b027b1f50bcff": 21807,
  "5fb651dc85f90547f674b6f4": 64837,
  "5fb653962b1b027b1f50bd03": 18291,
  "5fb6548dd1409e5ca04b54f9": 78162,
  "5fb6558ad6f0b2136f2d7eb7": 14807,
  "5fb655a72b1b027b1f50bd06": 5420,
  "5fb655b748c711690e3a8d5a": 71430,
  "5fb6564947ce63734e3fa1da": 21722,
  "5fb6567747ce63734e3fa1dc": 18032,
  "5fbb976df9986c4cff3fe5f2": 17934,
  "5fbb978207e8a97d1f0902d3": 64450,
  "5fbbaa86f9986c4cff3fe5f6": 18075,
  "5fbbc34106bde7524f03cbe9": 9999,
  "5fbbc366ca32ed67276c1557": 9705,
  "5fbbc383d5cb881a7363194a": 79086,
  "5fbbfabed5cb881a7363194e": 31520,
  "5fbbfacda56d053a3543f799": 47750,
  "5fbc226eca32ed67276c155d": 13740,
  "5fbc227aa56d053a3543f79e": 27644,
  "5fbc22ccf24b94483f726483": 21878,
  "5fbcbcf593164a5b6278efb2": 18708,
  "5fbcbd02900b1d5091531dd3": 25498,
  "5fbcbd10ab884124df0cd563": 16758,
  "5fbcbd6c187fea44d52eda14": 12596,
  "5fbcc1d9016cce60e8341ab3": 63219,
  "5fbcc3e4d6fa9c00c571bb58": 52374,
  "5fbcc429900b1d5091531dd7": 18867,
  "5fbcc437d724d907e2077d5c": 26384,
  "5fbe3ffdf8b6a877a729ea82": 976,
  "5fbe760793164a5b6278efc8": 65228,
  "5fbe7618d6fa9c00c571bb6c": 78765,
  "5fc0f9b5d724d907e2077d82": 24005,
  "5fc0f9cbd6fa9c00c571bb90": 18145,
  "5fc0fa362770a0045c59c677": 19077,
  "5fc23426900b1d5091531e15": 17660,
  "5fc23636016cce60e8341b05": 7875,
  "5fc23678ab884124df0cd590": 69696,
  "5fc2369685fd526b824a5713": 33532,
  "5fc382c1016cce60e8341b20": 1015,
  "5fc3e272f8b6a877a729eac5": 31545,
  "5fc3e466187fea44d52eda90": 30405,
  "5fc3f2d5900b1d5091531e57": 120081,
  "5fc4b97bab884124df0cd5e3": 9312,
  "5fc4b992187fea44d52edaa9": 19585,
  "5fc4b9b17283c4046c5814d7": 35784,
  "5fc53954f8b6a877a729eaeb": 23437,
  "5fc64ea372b0dd78d51159dc": 95755,
  "5fca138c2a7b221b2852a5c6": 50971,
  "5fca13ca637ee0341a484f46": 56999,
  "5fce0cf655375d18a253eff0": 21855,
  "5fce0f9b55375d18a253eff2": 14902,
  "5fce16961f152d4312622bc9": 15722,
  "5fd4c474dd870108a754b241": 95352,
  "5fd4c4fa16cac650092f6771": 13522,
  "5fd4c5477a8d854fa0105061": 11770,
  "5fd4c60f875c30179f5d04c2": 22233,
  "5fd8d28367cb5e077335170f": 28234,
  "60098ad7c2240c0fe85c570a": 36100,
  "60098af40accd37ef2175f27": 14544,
  "60098b1705871270cd5352a1": 27574,
  "601948682627df266209af05": 4516380,
  "60194943740c5d77f6705eea": 1060,
  "602286df23506e50807090c6": 2290,
  "60228a76d62c9b14ed777a66": 12995,
  "60229948cacb6b0506369e27": 7777,
  "602a95fe4e02ce1eaa358729": 15260,
  "602a97060ddce744014caf6f": 20175,
  "602a9740da11d6478d5a06dc": 35474,
  "602e3f1254072b51b239f713": 150000,
  "602e620f9b513876d4338d9a": 21062,
  "602e63fb6335467b0c5ac94d": 71766,
  "602e71bd53a60014f9705bfa": 17297,
  "602f85fd9b513876d4338d9c": 2000,
  "603372b4da11d6478d5a07ff": 85202,
  "60337f5dce399e10262255d1": 7349,
  "60339954d62c9b14ed777c06": 32189,
  "6033fa48ffd42c541047f728": 27401,
  "603409c80ca681766b6a0fb2": 42668,
  "6034cf5fffd42c541047f72e": 25996,
  "6034d0230ca681766b6a0fb5": 12038,
  "6034d103ca006d2dca39b3f0": 36588,
  "6034e3cb0ddce744014cb870": 16878,
  "6034e3d953a60014f970617b": 23569,
  "6034e3e20ddce744014cb878": 28053,
  "603618feffd42c541047f771": 23205,
  "603619720ca681766b6a0fc4": 8800,
  "60361a7497633951dc245eb4": 14017,
  "60361b0b5a45383c122086a1": 6226,
  "60361b5a9a15b10d96792291": 18737,
  "60363c0c92ec1c31037959f5": 59787,
  "603648ff5a45383c122086ac": 33518,
  "6038b4b292ec1c3103795a0b": 166280,
  "6038b4ca92ec1c3103795a0d": 173760,
  "6038d614d10cbf667352dd44": 32220,
  "60391a8b3364dc22b04d0ce5": 50017,
  "60391afc25aff57af81f7085": 78374,
  "60391b0fb847c71012789415": 22569,
  "6040dd4ddcf9592f401632d2": 33381,
  "6040de02647ad86262233012": 15093,
  "60658776f2cb2e02a42ace2b": 17980,
  "6065878ac9cf8012264142fd": 262090,
  "606587d11246154cad35d635": 12423,
  "606587e18900dc2d9a55b65f": 8665,
  "6065880c132d4d12c81fd8da": 11058,
  "6065881d1246154cad35d637": 23938,
  "6065c6e7132d4d12c81fd8e1": 8570,
  "6065dc8a132d4d12c81fd8e3": 29367,
  "606dae0ab0e443224b421bb7": 68501,
  "606ee5c81246154cad35d65e": 15653,
  "606eef46232e5a31c233d500": 32475,
  "606eef756d0bd7580617baf8": 7034,
  "606ef0812535c57a13424d20": 7559,
  "606f262c6d0bd7580617bafa": 11296,
  "606f263a8900dc2d9a55b68d": 12131,
  "606f2696f2cb2e02a42aceb1": 31854,
  "6076c1b9f2cb2e02a42acedc": 11136,
  "60785ce5132d4d12c81fd918": 100000,
  "607f201b3c672b3b3a24a800": 23214,
  "607f20859ee58b18e41ecd90": 39763,
  "607ffb988900dc2d9a55b6e4": 14706,
  "6086b5392535c57a13424d70": 15811,
  "6086b5731246154cad35d6c7": 23850,
  "6087e0336d0bd7580617bb7a": 30381,
  "6087e2a5232e5a31c233d552": 61496,
  "6087e663132d4d12c81fd96b": 136856,
  "609269c3b0e443224b421cc1": 21138,
  "60926df0132d4d12c81fd9df": 71835,
  "609a4b4fe2ff132951242d04": 9048,
  "609a63b6e2ff132951242d09": 14845,
  "609b9e31506cf869cf3eaf41": 11482,
  "609bab8b455afd752b2e6138": 49976,
  "609e8540d5c319764c2bc2e9": 86551,
  "609e860ebd219504d8507525": 123441,
  "60a23797a37c940de7062d02": 31815,
  "60a272cc93ef783291411d8e": 33617,
  "60a2828e8689911a226117f9": 24226,
  "60a3c68c37ea821725773ef5": 132596,
  "60a3c70cde5f453f634816a3": 183542,
  "60a621c49c197e4e8c4455e6": 27496,
  "60a6220e953894617404b00a": 28463,
  "60a7acf20c5cb24b01346648": 17671,
  "60b0f561c4449e4cb624c1d7": 33248,
  "60b0f6c058e0b0481a09ad11": 30824,
  "60b0f7057897d47c5b04ab94": 55015,
  "60b0f93284c20f0feb453da7": 26493,
  "60b0f988c4449e4cb624c1da": 27999,
  "60b52e5bc7d8103275739d67": 7875,
  "60bf74184a63fc79b60c57f6": 37623,
  "60db29ce99594040e04c4a27": 19655,
  "6113c3586c780c1e710c90bc": 20412,
  "6113cc78d3a39d50044c065a": 73338,
  "6113cce3d92c473c770200c7": 48644,
  "6113d6c3290d254f5e6b27db": 7798,
  "612368f58b401f4f51239b33": 76000,
  "612e0cfc8004cc50514c2d9e": 33919,
  "612e0d3767085e45ef14057f": 34328,
  "612e0d81290d254f5e6b291a": 28567,
  "612e0e3c290d254f5e6b291d": 13936,
  "612e0e55a112697a4b3a66e7": 13900,
  "6130c3dffaa1272e43151c7d": 18825,
  "6130c43c67085e45ef1405a1": 112300,
  "6130c4d51cb55961fa0fd49f": 39592,
  "6130ca3fd92c473c77020dbd": 81444,
  "615d8d878004cc50514c3233": 13179,
  "615d8da4d3a39d50044c10e8": 23088,
  "615d8dbd290d254f5e6b2ed6": 7895,
  "615d8df08004cc50514c3236": 18363,
  "615d8e2f1cb55961fa0fd9a4": 22690,
  "615d8e9867085e45ef1409c6": 25212,
  "615d8eb350224f204c1da1cf": 19152,
  "615d8f5dd92c473c770212ef": 21506,
  "615d8f8567085e45ef1409ca": 105435,
  "615d8faecabb9b7ad90f4d5d": 16399,
  "615d8fd3290d254f5e6b2edc": 16173,
  "61605d88ffa6e502ac5e7eeb": 32691,
  "61605e13ffa6e502ac5e7eef": 13196,
  "616442e4faa1272e43152193": 17223,
  "616554fe50224f204c1da2aa": 11220,
  "61657230d92c473c770213d7": 19390,
  "616584766ef05c2ce828ef57": 11178,
  "61659f79d92c473c770213ee": 15188,
  "6165ac8c290d254f5e6b2f6c": 20508,
  "6165adcdd3a39d50044c120f": 66666,
  "6165aeedfaa1272e431521e3": 110704,
  "61695095d92c473c7702147a": 48084,
  "61702be9faa1272e431522c3": 18249,
  "61702d8a67085e45ef140b24": 21996,
  "61702f1b67085e45ef140b26": 20197,
  "61703001d92c473c77021497": 16920,
  "617130016c780c1e710c9a24": 13664,
  "617131a4568c120fdd29482d": 36742,
  "6171367e1cb55961fa0fdb36": 33206,
  "61713a8fd92c473c770214a4": 25258,
  "61713cc4d8e3106d9806c109": 17314,
  "6171407e50224f204c1da3c5": 25825,
  "61714b2467085e45ef140b2c": 9550,
  "61714eec290d254f5e6b2ffc": 48965,
  "617151c1d92c473c770214ab": 164230,
  "617153016c780c1e710c9a2f": 16659,
  "617155ee50224f204c1da3cd": 24178,
  "6176a40f0b8c0312ac75a3d3": 30758,
  "6176a48d732a664031271438": 22235,
  "617aa4dd8166f034d57de9c5": 24612,
  "61816734d8e3106d9806c1f3": 42600,
  "618167441cb55961fa0fdc71": 15197,
  "618167528004cc50514c34f9": 27500,
  "618167616ef05c2ce828f1a8": 8237,
  "6181688c6c780c1e710c9b04": 7003,
  "618168dc8004cc50514c34fc": 36089,
  "61816df1d3a39d50044c139e": 41154,
  "61816dfa6ef05c2ce828f1ad": 10283,
  "61816fcad92c473c770215cc": 11157,
  "61817865d3a39d50044c13a4": 9553,
  "618178aa1cb55961fa0fdc80": 14323,
  "61825d136ef05c2ce828f1cc": 134826,
  "61825d24d3a39d50044c13af": 32567,
  "6183b084a112697a4b3a6e6c": 59936,
  "6183d53f1cb55961fa0fdcda": 37948,
  "6183fc15d3a39d50044c13e9": 52246,
  "6183fd911cb55961fa0fdce9": 54375,
  "6183fd9e8004cc50514c358f": 95271,
  "618405198004cc50514c3594": 76136,
  "6184055050224f204c1da540": 52037,
  "618407a850224f204c1da549": 5000,
  "61840bedd92c473c77021635": 31534,
  "61840d85568c120fdd2962a5": 17240,
  "618426d96c780c1e710c9b9f": 25427,
  "618428466ef05c2ce828f218": 56262,
  "618a5d5852ecee1505530b2a": 7389,
  "618a75f0bd321d49084cd399": 14728,
  "618aef6d0a5a59657e5f55ee": 15253,
  "618b9643526131765025ab35": 38590,
  "618b9671d14d6d5ab879c5ea": 36366,
  "618b9682a3884f56c957ca78": 18047,
  "618ba27d9008e4636a67f61d": 219579,
  "618ba91477b82356f91ae0e8": 36740,
  "618ba92152ecee1505530bd3": 16716,
  "618bab21526131765025ab3f": 30151,
  "618bb76513f5097c8d5aa2d5": 35256,
  "618cfae774bb2d036a049e7c": 49900,
  "619256e5f8af2c1a4e1f5d92": 15781,
  "619386379fb0c665d5490dbe": 52845,
  "6193a720f8ee7e52e42109ed": 20161,
  "6193d3149fb0c665d5490e32": 15209,
  "6193dcd0f8ee7e52e4210a28": 9936,
  "6194ef39de3cdf1d2614a768": 27750,
  "6194efe07c6c7b169525f11b": 56076,
  "6194eff92d2c397d6600348b": 14440,
  "6194f017ed0429009f543eaa": 25356,
  "6194f02d9bb3d20b0946d2f0": 21051,
  "6194f41f9fb0c665d5490e75": 21753,
  "6194f5722d2c397d6600348f": 9319,
  "6194f5a318a3974e5e7421eb": 21010,
  "6194f5d418a3974e5e7421ef": 14483,
  "619621a4de3cdf1d2614a7a7": 9841,
  "619624b26db0f2477964e6b0": 12550,
  "6196255558ef8c428c287d1c": 10615,
  "6196364158ef8c428c287d9f": 593,
  "6196365d58ef8c428c287da1": 298,
  "619636be6db0f2477964e710": 1154,
  "61963a852d2c397d660036ad": 15798,
  "61965d9058ef8c428c287e0d": 16063,
  "619666f4af1f5202c57a952d": 19031,
  "6197b229af1f5202c57a9bea": 14811,
  "619b5db699fb192e7430664f": 17304,
  "619b69037b9de8162902673e": 22064,
  "619bdd8886e01e16f839a99c": 67311,
  "619bde7fc9546643a67df6f4": 101238,
  "619bdef8c9546643a67df6f6": 236135,
  "619bdfd4c9546643a67df6fa": 58948,
  "619cbf476b8a1b37a54eebf8": 20857,
  "619cbf7d23893217ec30b689": 698799,
  "619cbf9e0a7c3a1a2731940a": 296911,
  "619cbfccbedcde2f5b3f7bdd": 83261,
  "619cbfeb6b8a1b37a54eebfa": 66399,
  "619cc01e0a7c3a1a2731940c": 19014,
  "619cf0335771dd3c390269ae": 45105,
  "619d36da53b4d42ee724fae4": 3201,
  "61a4c8884f95bc3b2c5dc96f": 21270,
  "61a64428a8c6aa1b795f0ba1": 13906,
  "61a6444b8c141d68246e2d2f": 25680,
  "61a64492ba05ef10d62adcc1": 27567,
  "61aa5aed32a4743c3453d319": 20220,
  "61aa5b518f5e7a39b41416e2": 33532,
  "61aa5b7db225ac1ead7957c1": 95662,
  "61aa5ba8018e9821b7368da9": 90427,
  "61aa81fcb225ac1ead7957c3": 32145,
  "61bc85697113f767765c7fe7": 28566,
  "61bca7cda0eae612383adf57": 50896,
  "61bcc89aef0f505f0c6cd0fc": 36653,
  "61bf7b6302b3924be92fa8c3": 29179,
  "61bf7c024770ee6f9c6b8b53": 72216,
  "61bf83814088ec1a363d7097": 26692,
  "61c18d83b00456371a66814b": 21792,
  "61c18db6dfd64163ea78fbb4": 25992,
  "61f7b85367ddd414173fdb36": 2000,
  "61f7c9e189e6fb1a5e3ea78d": 23629,
  "61faa91878830f069b6b7967": 10125,
  "6217726288ed9f0845317459": 16167,
  "62178be9d0050232da3485d9": 17478,
  "622b38c56762c718e457e246": 46356,
  "622b397c9a3d4327e41843b6": 23923,
  "622efbcb99f4ea1a4d6c9a15": 5293,
  "622f0ee47762f55aaa68ac87": 22222,
  "622f140da5958f63c67f1735": 14050,
  "622f14e899892a7f9e08f6c5": 25361,
  "623063e994fc3f7b302a9696": 43434,
  "62307b7b10d2321fa8741921": 25243,
  "62330b3ed4dc74626d570b95": 605,
  "62330bfadc5883093563729b": 126,
  "62330c18744e5e31df12f516": 309,
  "62330c40bdd19b369e1e53d1": 145,
  "62389bc9423ed1685422dc57": 23835,
  "62389be94d5d474bf712e709": 3354,
  "623b2e9d11c3296b440d1638": 57787,
  "623c2f4242aee3103f1c44b7": 16479,
  "623c2f652febb22c2777d8d7": 20287,
  "623c3be0484b5003161840dc": 13499,
  "623c3c1f37b4b31470357737": 17126,
  "624c0b3340357b5f566e8766": 11034,
  "624c29ce09cd027dff2f8cd7": 18426,
  "624c2e8614da335f1e034d8c": 15766,
  "6259b864ebedf17603599e88": 28721,
  "6259bdcabd28e4721447a2aa": 27070,
  "6259c2c1d714855d182bad85": 23888,
  "6259c3387d6aab70bc23a18d": 9999,
  "625eb0faa6e3a82193267ad9": 15199,
  "625ed7c64d9b6612df732146": 39999,
  "625ff2ccb8c587128c1a01dd": 1574,
  "625ff2eb9f5537057932257d": 12742,
  "625ff3046d721f05d93bf2ee": 18260,
  "625ff31daaaa8c1130599f64": 14239,
  "626667e87379c44d557b7550": 24145,
  "626673016f1edc06f30cf6d5": 43588,
  "62669bccdb9ebb4daa44cd14": 16945,
  "6267c6396b642f77f56f5c1c": 17112,
  "6269220d70b6c02e665f2635": 33857,
  "6269545d0e57f218e4548ca2": 14649,
  "626a74340be03179a165e30c": 11473,
  "626a8ae89e664a2e2a75f409": 5986,
  "626a9cb151cb5849f6002890": 44993,
  "626bb8532c923541184624b4": 27883,
  "626becf9582c3e319310b837": 30363,
  "6272370ee4013c5d7e31f418": 34143,
  "6272379924e29f06af4d5ecb": 39199,
  "627254cc9c563e6e442c398f": 36567,
  "6272874a6c47bd74f92e2087": 25581,
  "627bce33f21bc425b06ab967": 25807,
  "62811e335631d45211793c95": 24690,
  "62811f461d5df4475f46a332": 21923,
  "62811fa609427b40ab14e765": 70037,
  "628120fd5631d45211793c9f": 17550,
  "6284bd5f95250a29bc628a30": 13735,
  "62850c28da09541f43158cca": 59254,
  "628a664bccaab13006640e47": 26575,
  "628a665a86cbd9750d2ff5e5": 43655,
  "628a6678ccaab13006640e49": 15460,
  "628a66b41d5e41750e314f34": 7371,
  "628a7b23b0f75035732dd565": 67905,
  "628a83c29179c324ed269508": 25442,
  "628a85ee6b1d481ff772e9d5": 10612,
  "628b5638ad252a16da6dd245": 45917,
  "628b916469015a4e1711ed8d": 174330,
  "628b9784bcf6e2659e09b8a2": 92579,
  "628b9be6cff66b70c002b14c": 81579,
  "628b9c37a733087d0d7fe84b": 58868,
  "628b9c7d45122232a872358f": 145684,
  "628baf0b967de16aab5a4f36": 77625,
  "628bc7fb408e2b2e9c0801b1": 111920,
  "628c9ab845c59e5b80768a81": 27404,
  "628cd624459354321c4b7fa2": 79132,
  "628d0618d1ba6e4fa07ce5a4": 200954,
  "628dc750b910320f4c27a732": 70611,
  "628e1ffc83ec92260c0f437f": 57734,
  "628e4dd1f477aa12234918aa": 40756,
  "628e4e576d783146b124c64d": 359151,
  "62987c658081af308d7558c6": 166351,
  "62987cb98081af308d7558c8": 36072,
  "62987da96188c076bc0d8c51": 64171,
  "62987dfc402c7f69bf010923": 280587,
  "62987e26a77ec735f90a2995": 20657,
  "62a08f4c4f842e1bd12d9d62": 56506,
  "62a091170b9d3c46de5b6cf2": 32793,
  "62a09cb7a04c0c5c6e0a84f8": 31510,
  "62a09cfe4f842e1bd12da3e4": 63827,
  "62a09d3bcf4a99369e262447": 50681,
  "62a09d79de7ac81993580530": 54185,
  "62a09dd4621468534a797ac7": 21888,
  "62a09e08de7ac81993580532": 30017,
  "62a09e410b9d3c46de5b6e78": 41956,
  "62a09e73af34e73a266d932a": 29394,
  "62a09e974f842e1bd12da3f0": 36309,
  "62a09ec84f842e1bd12da3f2": 18960,
  "62a09ee4cf4a99369e262453": 9838,
  "62a09f32621468534a797acb": 38959,
  "62a0a043cf4a99369e2624a5": 27792,
  "62a0a098de7ac8199358053b": 20959,
  "62a0a0bb621468534a797ad5": 27661,
  "62a0a124de7ac81993580542": 47600,
  "62a0a16d0b9d3c46de5b6e97": 165940,
  "62a1b7fbc30cfa1d366af586": 91638,
  "62a5c2c98ec41a51b34739c0": 15076,
  "62a5c333ec21e50cad3b5dc6": 16982,
  "62a5c41e8ec41a51b34739c3": 14372,
  "62a61c988ec41a51b34758d5": 38007,
  "62a9cb937377a65d7b070cef": 39706,
  "62e14904c2699c0ec93adc47": 55399,
  "62e153bcdb1a5c41971c1b5b": 56595,
  "62e292e7b6c0ee2f230cee00": 8000,
  "62e2a7138e1ac9380579c122": 31232,
  "62e7c4fba689e8c9c50dfc38": 52459,
  "62e7c7f3c34ea971710c32fc": 37483,
  "62e7c98b550c8218d602cbb4": 43323,
  "62ea7c793043d74a0306e19f": 9180,
  "62ebd290c427473eff0baafb": 19999,
  "62ff9920fe938a24c90c10d2": 16841,
  "63075cc5962d0247b029dc2a": 200000,
  "63076701a987397c0816d21b": 21838,
  "630767c37d50ff5e8a1ea71a": 30746,
  "630769c4962d0247b029dc60": 18154,
  "63088377b5cd696784087147": 22239,
  "630e1adbbd357927e4007c09": 3300,
  "630e295c984633f1fb0e7c30": 59346,
  "630f27f04f3f6281050b94d7": 13152,
  "630f28f0cadb1fe05e06f004": 40774,
  "630f291b9f66a28b37094bb8": 41724,
  "630f2982cdb9e392db0cbcc7": 44588,
  "63171672192e68c5460cebc5": 82967,
  "633a98eab8b0506e48497c1a": 16992,
  "633ec6ee025b096d320a3b15": 250000,
  "633ec7c2a6918cb895019c6c": 62532,
  "634e61b0767cb15c4601a877": 17499,
  "634eba08f69c710e0108d386": 50676,
  "634eff66517ccc8a960fc735": 12146,
  "634f02331f9f536910079b51": 10923,
  "634f03d40384a3ba4f06f874": 19625,
  "634f05ca517ccc8a960fc748": 17764,
  "634f06262e5def262d0b30ca": 14387,
  "634f08a21f9f536910079b5a": 10000,
  "635267ab3c89e2112001f826": 469068,
  "635a758bfefc88a93f021b8a": 14168,
  "63611865ba5b90db0c0399d1": 73184,
  "63626d904aa74b8fe30ab426": 244103,
  "636270263f2495c26f00b007": 54456,
  "63737f448b28897f2802b874": 44387,
  "6374a7e7417239a7bf00f042": 1000,
  "637784c5f7b3f4ac1a0d1a9a": 6856,
  "637b60c3b7afa97bfc3d7001": 77128,
  "637b612fb7afa97bfc3d7005": 111136,
  "637b6179104668754b72f8f5": 41876,
  "637b620db7afa97bfc3d7009": 102946,
  "637b6251104668754b72f8f9": 52030,
  "637b6d610aef6cfc5e02dd14": 16478,
  "637b9c37b7e3bc41b21ce71a": 15420,
  "637f57b78d137b27f70c496a": 13362,
  "637f57c532b66e7e320a6676": 16291,
  "637f57d2f5ef8c33840d36c4": 11617,
  "637f589af5ef8c33840d36d3": 14969,
  "6386120cd6baa055ad1e201c": 19208,
  "638612b607dfed1ccb7206ba": 109486,
  "63877c99e785640d436458ea": 56412,
  "63888bbd28e5cc32cc09d2b6": 34166,
  "6388c4478d895f557a0c6512": 24757,
  "6388c4ac8d895f557a0c6515": 37996,
  "6388c5d19c00405f4717c0f0": 12680,
  "6389c6463485cf0eeb260715": 35915,
  "6389c6c7dbfd5e4b95197e68": 18942,
  "6389c70ca33d8c4cdf4932c6": 12440,
  "6389c8c5dbfd5e4b95197e6b": 25118518,
  "6389f1dfc879ce63f72fc43e": 14797,
  "638db77630c4240f9e06f8b6": 18313,
  "638de3603a1a4031d8260b8c": 20433,
  "638f1ff84822287cad04be9d": 7101,
  "638f2003bbd47aeb9e0ff637": 18611,
  "639343fce101f4caa40a4ef3": 34025,
  "63969c9019971040b005049b": 10925,
  "6396aaa9a52ace83df0840ab": 11633,
  "63a0b208f444d32d6f03ea1e": 155866,
  "63a39667c9b3aa4b61683e98": 29103,
  "63a397d3af870e651d58e65b": 715422,
  "63a399193901f439517cafb6": 49444,
  "63a39c69af870e651d58e6aa": 24262,
  "63a39c7964283b5e9c56b280": 45756,
  "63a39cb1c9b3aa4b61683ee2": 17051,
  "63a39ce4cd6db0635c1975fa": 17038,
  "63a39df18a56922e82001f25": 12400,
  "63a39dfe3901f439517cafba": 13625,
  "63a39e49cd6db0635c1975fc": 17172,
  "63a39f08cd6db0635c197600": 30206,
  "63a39f18c2d53c2c6839c1d3": 22935,
  "63a39f6e64283b5e9c56b289": 47763,
  "63a39fc0af870e651d58e6ae": 3715544,
  "63a39fd1c9b3aa4b61683efb": 18342,
  "63a39fdf1e21260da44a0256": 15122,
  "63a3a93f8a56922e82001f5d": 1813278,
  "63a71e781031ac76fe773c7d": 17664,
  "63a71e86b7f4570d3a293169": 49203,
  "63a71e922b25f7513905ca20": 57805,
  "63a71eb5b7f4570d3a29316b": 25996,
  "63a71ed21031ac76fe773c7f": 37075,
  "63ac5c9658d0485fc039f0b8": 20327,
  "63d114019e35b334d82302f7": 28225,
  "63d3ce0446bd475bcb50f55f": 37731,
  "63d3ce281fe77d0f2801859e": 52856,
  "63d3d44a2a49307baf09386d": 101418,
  "63f4ba71f31d4a33b87bd046": 13183,
  "63f4da90f31d4a33b87bd054": 14099,
  "63f5ed14534b2c3d5479a677": 50796,
  "63f5feead259b42f0b4d6d0f": 59554,
  "6405ff6bd4578826ec3e377a": 17621,
  "640b20359ab20e15ee445fa9": 31488,
  "641074a07fd350b98c0b3f96": 35114,
  "64119d672c6d6f921a0929fb": 10000,
  "6415c694da439c6a97048b56": 40865,
  "6415d33eda439c6a97048b5b": 57037,
  "6422e1ea3c0f06190302161a": 9783,
  "643ea5b23db6f9f57107d9fd": 73015,
  "644674a13d52156624001fbc": 63624,
  "644675573d52156624001fc9": 27083,
  "644a3df63b0b6f03e101e065": 35499,
  "6450ec2e7da7133e5a09ca96": 12448,
  "6450f21a3d52156624001fcf": 17747,
  "6451167ad4928d46d30be3fd": 23088,
  "645122f6d4928d46d30be3ff": 36874,
  "6452519e3d52156624001fd5": 23124,
  "64527a263d52156624001fd7": 13374,
  "64527a3a7da7133e5a09ca99": 44843,
  "645e0c6b3b381ede770e1cc9": 75295,
  "646372518610c40fc20204e8": 14717,
  "64639a9aab86f8fd4300146c": 25644,
  "6464d870bb2c580352070cc4": 11047,
  "646f62fee779812413011ab7": 12325,
  "646f6322f43d0c5d62063715": 20749,
  "64748cb8de82c85eaf0a273a": 27815,
  "6477772ea8a38bb2050ed4db": 18904,
  "64785e7c19d732620e045e15": 61175,
  "647dba3142c479dde701b654": 18221,
  "647dd2b8a12ebf96c3031655": 31852,
  "647de824196bf69818044c93": 13533,
  "647def638295ebcb5b02f05b": 10054,
  "648067db042be0705c0b3009": 9135,
  "64806bdd26c80811d408d37a": 41420,
  "64807a29e5ffe165600abc97": 39399,
  "648ae3e356c6310a830fc291": 17394,
  "648afce7ec6bb25b2608defb": 4049,
  "6491c6f6ef312a876705191b": 29115,
  "6492c6dd60fdb10a020621a2": 7771,
  "6492c8bba6e68e06fb0bae87": 31272,
  "6492d7847363b8a52206bc52": 21483,
  "6492ef63cfcf7c89e701abf1": 13256,
  "6494094948796d891603e59f": 37395,
  "64942bfc6ee699f6890dff95": 33214,
  "64943b74e9998d641b0412ed": 20019,
  "6499849fc93611967b034949": 93907,
  "649ec127c93611967b034957": 16917,
  "649ec2af961514b22506b10f": 33329,
  "649ec2f3961514b22506b111": 64216,
  "649ec30cb013f04a700e60fb": 26251,
  "64a536392d2c4e6e970f4121": 42764,
  "64a5366719bab53bd203bf33": 31444,
  "64abd93857958b4249003418": 50356,
  "64ace9d9b5bf5e95f50a4c1d": 5218,
  "64ace9f9c4eda9354b0226aa": 142213,
  "64acea2c03378853630da53e": 2000,
  "64aceab0426a303417060654": 41166,
  "64aceac0c4eda9354b0226b3": 75651,
  "64aceaecc4eda9354b0226b6": 21925,
  "64aceafcb5bf5e95f50a4c20": 19999,
  "64acee6903378853630da544": 22882,
  "64afd81707e2cf40e903a316": 75678,
  "64afdb577bb3bfe8fe03fd1d": 139983,
  "64b6979341772715af0f9c39": 577,
  "64b7af434b75259c590fa893": 3048,
  "64b7af5a8532cf95ee0a0dbd": 254,
  "64b7af734b75259c590fa895": 240,
  "64b7bbb74b75259c590fa897": 516,
  "64b8725c4b75259c590fa899": 3923,
  "64b8ee384b75259c590fa89b": 891,
  "64b8f7968532cf95ee0a0dbf": 323,
  "64b8f7b5389d7ffd620ccba2": 328,
  "64b8f7c241772715af0f9c3d": 253,
  "64b9cf0ac12b9c38db26923a": 8782,
  "64b9e2037fdfb81df81e3c25": 11332,
  "64b9e265c94d0d15c5027e35": 3420,
  "64be7095047e826eae02b0c1": 14025,
  "64be7110bf597ba84a0a41ea": 14528,
  "64be79c487d1510151095552": 46568,
  "64be79e2bf8412471d0d9bcc": 40931,
  "64c196ad26a15b84aa07132f": 108193,
  "64ccc1d4a0f13c24561edf27": 29948,
  "64ccc1ec1779ad6ba200a137": 27957,
  "64ccc1f4ff54fb38131acf27": 30306,
  "64ccc1fe088064307e14a6f7": 35547,
  "64ccc206793ca11c8f450a38": 34854,
  "64ccc2111779ad6ba200a139": 36419,
  "64ccc246ff54fb38131acf29": 50657,
  "64ccc24de61ea448b507d34d": 56172,
  "64ccc25f95763a1ae376e447": 997061,
  "64ccc268c41e91416064ebc7": 10741,
  "64ce572331dd890873175115": 82553,
  "6513eff1e06849f06c0957d4": 40300,
  "6513f037e06849f06c0957d7": 10000,
  "6513f0a194c72326990a3868": 32975,
  "6513f153e63f29908d0ffaba": 29687,
  "6513f1798cb24472490ee331": 16462,
  "651580dc71a4f10aec4b6056": 41354,
  "65169d5b30425317755f8e25": 25038,
  "6516b129609aaf354b34b3a8": 25099,
  "6516e91f609aaf354b34b3e2": 24246,
  "6516e971a3d4c6497930b450": 18942,
  "6516e9bc5901745209404287": 36696,
  "6516e9d7e239bd0c487e3766": 86632,
  "651a8bf3a8520e48047bf708": 21041,
  "651a8e529829226ceb67c319": 14362,
  "651bf5617b3b552ef6712cb7": 19082,
  "651bfe4d1065f87f082e7209": 8495,
  "65290f395ae2ae97b80fdf2d": 608313,
  "652910565ae2ae97b80fdf35": 299995,
  "6529109524cbe3c74a05e5b7": 59480,
  "652910ef50dc782999054b97": 89318,
  "6529113b5ae2ae97b80fdf39": 35976,
  "652911675ae2ae97b80fdf3c": 18580,
  "6529119424cbe3c74a05e5bb": 93117,
  "652911e650dc782999054b9d": 30517,
  "6529302b8c26af6326029fb7": 4114,
  "6529366450dc782999054ba0": 28808,
  "6529370c405a5f51dd023db8": 20365,
  "65293c38fc460e50a509cb25": 24642,
  "65293c7a17e14363030ad308": 98981,
  "65392f611406374f82152ba5": 11450,
  "653931da5db71d30ab1d6296": 10099,
  "653ecef836fae5a82f02b869": 28646,
  "653ed132896b99b40a0292e6": 49470,
  "6540d2162ae6d96b540afcaf": 46710,
  "6544d4187c5457729210d277": 9248,
  "654a4dea7c17dec2f50cc86a": 12369,
  "654a4f8bc721968a4404ef18": 20274,
  "6557458f83942d705f0c4962": 27139,
  "655c652d60d0ac437100fed7": 47394,
  "655c663a6689c676ce57af85": 47441,
  "655c669103999d3c810c025b": 63073,
  "655c66e40b2de553b618d4b8": 63000,
  "655c673673a43e23e857aebd": 31754,
  "655c67782a1356436041c9c5": 31749,
  "655c67ab0d37ca5135388f4b": 63000,
  "655cb6b5d680a544f30607fa": 13795,
  "655dccfdbdcc6b5df71382b6": 21134,
  "655df24fdf80b12750626d0a": 73294,
  "655f13e0a246670fb0373245": 80383,
  "6567e751a715f85433025998": 32962,
  "6567e7681265c8a131069b0f": 172966,
  "656ddcf0f02d7bcea90bf395": 27249,
  "656df4fec921ad01000481a2": 11991,
  "656e0436d44a1bb4220303a0": 101073,
  "656efd66034e8e01c407f35c": 45937,
  "656f198fb27298d6fd005466": 29452,
  "656f57dc27aed95beb08f628": 25823,
  "656f603f94b480b8a500c0d6": 27682,
  "656f9d5900d62bcd2e02407c": 26641,
  "656f9fa0498d1b7e3e071d98": 27140,
  "656fa0fb498d1b7e3e071d9c": 35126,
  "656fa25e94b480b8a500c0e0": 66875,
  "656fac30c6baea13cd07e10c": 25588,
  "656fad8c498d1b7e3e071da0": 28990,
  "656fb0bd7c2d57afe200c0dc": 32844,
  "656fb21fa0dce000a2020f7c": 26695,
  "657089638db3adca1009f4ca": 299058,
  "6570a88c8f221f3b210353b7": 565307,
  "6570aead4d84f81fd002a033": 112355,
  "6571bde39837cc51b800c212": 23993,
  "65749cb8e0423b9ebe0c79c9": 47047,
  "65749ccf33fdc9c0cf06d3ca": 36311,
  "6576f93989f0062e741ba952": 1727,
  "6576f96220d53a5b8f3e395e": 228,
  "657b22485f444d6dff0c6c2f": 29722,
  "65815f0e647e3d7246384e14": 20519,
  "6581998038c79576a2569e11": 7501,
  "658199972dc4e60f6d556a2f": 9362,
  "6582dbe43a2e5248357dbe9a": 10445,
  "6582dbf0b8d7830efc45016f": 92897,
  "6582dc4b6ba9e979af6b79f4": 19935,
  "6582dc5740562727a654ebb1": 38103,
  "560d75f54bdc2da74d8b4573": 27280,
  "5649ed104bdc2d3d1c8b458b": 17100,
  "573724b42459776125652ac2": 272,
  "5737256c2459776125652acd": 1984,
  "5737260b24597761224311f2": 1728,
  "5737266524597761006c6a8c": 800,
  "573727c624597765cc785b5b": 800,
  "5737280e24597765cc785b5c": 2464,
  "5737287724597765e1625ae2": 5888,
  "573728f324597765e5728561": 4304,
  "5737292724597765e5728562": 75600,
  "57372a7f24597766fe0de0c1": 75600,
  "57372ac324597767001bc261": 18900,
  "57372b832459776701014e41": 93600,
  "57372bad245977670b7cd242": 93600,
  "57372bd3245977670b7cd243": 23400,
  "57372c21245977670937c6c2": 64800,
  "57372c56245977685e584582": 64800,
  "57372c89245977685d4159b1": 16200,
  "57372d1b2459776862260581": 104280,
  "57372e1924597768553071c1": 11400,
  "57372e94245977685648d3e1": 44640,
  "57372f2824597769a270a191": 41280,
  "57372f5c24597769917c0131": 10320,
  "57372f7d245977699b53e301": 14760,
  "573733c72459776b0b7b51b0": 2070,
  "5739d41224597779c3645501": 7264,
  "5c1127d0d174af29be75cf68": 1995,
  "5c1260dc86f7746b106e8748": 10400,
  "5c12619186f7743f871c8a32": 3520,
  "5c1262a286f7743f8a69aab2": 37200,
  "648983d6b5a2df1c815a04ec": 9000,
  "6489848173c462723909a14b": 91600,
  "648984b8d5b4df6140000a1a": 39600,
  "648984e3f09d032aa9399d53": 34460,
  "6489851fc827d4637f01791b": 28000,
  "6489854673c462723909a14e": 26000,
  "64898583d5b4df6140000a1d": 76250,
  "648985c074a806211e4fb682": 43500,
  "64898602f09d032aa9399d56": 27000,
  "648986bbc827d4637f01791e": 23000,
  "6489870774a806211e4fb685": 29800,
  "6489875745f9ca4ba51c4808": 16740,
  "6489879db5a2df1c815a04ef": 33500,
  "648987d673c462723909a151": 30000,
  "64898838d5b4df6140000a20": 22250,
  "64ace9ff03378853630da538": 4800,
  "64acea09c4eda9354b0226ad": 9600,
  "64acea0d03378853630da53b": 11500,
  "64acea16c4eda9354b0226b0": 22220,
  "657023a9126cc4a57d0e17a6": 196150,
  "657023b1cfc010a0f50069e5": 57700,
  "657023b71419851aef03e6e8": 29650,
  "657023bebfc87b3a34093207": 48800,
  "657023c61419851aef03e6eb": 14900,
  "657023ccbfc87b3a3409320a": 36000,
  "657023d6cfc010a0f50069e9": 13600,
  "657023dabfc87b3a3409320d": 20300,
  "657023decfc010a0f50069ec": 15125,
  "657023e31419851aef03e6ee": 3150,
  "657023e7c5d7d4cb4d078552": 7725,
  "657023eccfc010a0f50069ef": 3625,
  "657023f1bfc87b3a34093210": 5000,
  "657023f81419851aef03e6f1": 14400,
  "657023fcbfc87b3a34093213": 4240,
  "657024011419851aef03e6f4": 15780,
  "65702406bfc87b3a34093216": 42350,
  "6570240a1419851aef03e6f7": 51500,
  "6570240ecfc010a0f50069f2": 42950,
  "65702414c5d7d4cb4d078555": 107450,
  "6570241bcfc010a0f50069f5": 13950,
  "65702420bfc87b3a34093219": 4200,
  "65702426cfc010a0f50069f8": 1850,
  "65702432bfc87b3a3409321c": 2625,
  "657024361419851aef03e6fa": 975,
  "6570243bbfc87b3a3409321f": 23950,
  "6570243fcfc010a0f50069fb": 2225,
  "657024431419851aef03e6fd": 22275,
  "65702449bfc87b3a34093223": 8075,
  "6570244ec5d7d4cb4d078558": 2275,
  "65702452cfc010a0f50069fe": 1275,
  "657024581419851aef03e700": 5725,
  "65702469c5d7d4cb4d07855b": 26625,
  "6570246fcfc010a0f5006a01": 4225,
  "65702474bfc87b3a34093226": 77900,
  "65702479c5d7d4cb4d07855e": 2050,
  "6570247ebfc87b3a34093229": 4800,
  "657024831419851aef03e703": 2850,
  "6570248dcfc010a0f5006a04": 750,
  "657024921419851aef03e706": 975,
  "65702495c5d7d4cb4d078561": 2950,
  "6570249bcfc010a0f5006a07": 5175,
  "6570249f1419851aef03e709": 3425,
  "657024a4bfc87b3a3409322c": 1250,
  "657024a91419851aef03e70c": 1625,
  "657024aebfc87b3a3409322f": 2270,
  "657024b31419851aef03e70f": 1080,
  "657024b8bfc87b3a34093232": 1280,
  "657024bdc5d7d4cb4d078564": 4900,
  "657024c81419851aef03e712": 3840,
  "657024cecfc010a0f5006a0a": 134600,
  "657024d2bfc87b3a34093235": 4000,
  "657024d8c5d7d4cb4d078567": 26400,
  "657024debfc87b3a34093238": 13550,
  "657024e3c5d7d4cb4d07856a": 35500,
  "657024e8cfc010a0f5006a0d": 36350,
  "657024ecc5d7d4cb4d07856d": 21300,
  "657024f01419851aef03e715": 61500,
  "657024f5cfc010a0f5006a10": 19550,
  "657024f9bfc87b3a3409323b": 53000,
  "657025161419851aef03e718": 46800,
  "6570251ccfc010a0f5006a13": 17900,
  "65702520bfc87b3a3409323e": 23450,
  "65702524cfc010a0f5006a16": 13500,
  "657025281419851aef03e71b": 37400,
  "6570252dbfc87b3a34093241": 17550,
  "65702532cfc010a0f5006a19": 4175,
  "65702536c5d7d4cb4d078570": 6850,
  "6570253acfc010a0f5006a1c": 4975,
  "6570253ec5d7d4cb4d078573": 1225,
  "657025421419851aef03e71e": 1350,
  "65702546cfc010a0f5006a1f": 1750,
  "6570254abfc87b3a34093244": 1575,
  "6570254fcfc010a0f5006a22": 24800,
  "65702554bfc87b3a34093247": 12000,
  "65702558cfc010a0f5006a25": 8400,
  "6570255dbfc87b3a3409324a": 16680,
  "65702561cfc010a0f5006a28": 22100,
  "65702566bfc87b3a3409324d": 10980,
  "65702572c5d7d4cb4d078576": 23600,
  "65702577cfc010a0f5006a2c": 19000,
  "6570257cc5d7d4cb4d078579": 62940,
  "65702584cfc010a0f5006a2f": 11040,
  "65702591c5d7d4cb4d07857c": 10500,
  "657025961419851aef03e721": 11100,
  "6570259bc5d7d4cb4d07857f": 23600,
  "6570259fcfc010a0f5006a32": 38400,
  "657025a4bfc87b3a34093250": 2450,
  "657025a81419851aef03e724": 22700,
  "657025bbcfc010a0f5006a35": 6630,
  "657025c4c5d7d4cb4d078582": 24960,
  "657025c9cfc010a0f5006a38": 3570,
  "657025cfbfc87b3a34093253": 13400,
  "657025d4c5d7d4cb4d078585": 9980,
  "657025dabfc87b3a34093256": 18400,
  "657025dfcfc010a0f5006a3b": 8800,
  "657025ebc5d7d4cb4d078588": 148800,
  "65702606cfc010a0f5006a3e": 7250,
  "6570260c1419851aef03e727": 850,
  "65702610cfc010a0f5006a41": 18550,
  "65702614c5d7d4cb4d07858b": 5400,
  "65702619bfc87b3a34093259": 2750,
  "6570261dc5d7d4cb4d07858e": 2500,
  "65702621cfc010a0f5006a44": 1500,
  "657026251419851aef03e72a": 7700,
  "65702629cfc010a0f5006a47": 1100,
  "6570262d1419851aef03e72d": 2500,
  "65702630cfc010a0f5006a4a": 18400,
  "657026341419851aef03e730": 25450,
  "65702639bfc87b3a3409325c": 13450,
  "65702640cfc010a0f5006a4d": 6200,
  "657026451419851aef03e733": 52800,
  "6570264acfc010a0f5006a50": 27100,
  "6570264d1419851aef03e736": 94900,
  "65702652cfc010a0f5006a53": 71000,
  "65702656c5d7d4cb4d078591": 72700,
  "6570265bcfc010a0f5006a56": 42600,
  "6570265f1419851aef03e739": 123000,
  "65702664cfc010a0f5006a59": 39100,
  "6570266bc5d7d4cb4d078594": 106000,
  "65702681bfc87b3a3409325f": 152500,
  "6570900858b315e8b70a8a98": 108000,
  "6579846c1ec1943afb14c15a": 51810,
  "6579847c5a0e5879d12f2873": 23640,
  "657984a50fbff513dd435765": 4560,
  "627e14b21713922ded6f2c15": 250000,
  "634959225289190e5e773b3b": 15000
}
