{
    "BodyParts": {
        "Chest": {
            "Health": {
                "Current": 360,
                "Maximum": 360
            }
        },
        "Head": {
            "Health": {
                "Current": 125,
                "Maximum": 125
            }
        },
        "LeftArm": {
            "Health": {
                "Current": 150,
                "Maximum": 150
            }
        },
        "LeftLeg": {
            "Health": {
                "Current": 150,
                "Maximum": 150
            }
        },
        "RightArm": {
            "Health": {
                "Current": 150,
                "Maximum": 150
            }
        },
        "RightLeg": {
            "Health": {
                "Current": 150,
                "Maximum": 150
            }
        },
        "Stomach": {
            "Health": {
                "Current": 220,
                "Maximum": 220
            }
        }
    }
}
