<svg xmlns="http://www.w3.org/2000/svg" width="14.16" height="14.16" viewBox="0 0 14.16 14.16">
  <metadata><?xpacket begin="﻿" id="W5M0MpCehiHzreSzNTczkc9d"?>
<x:xmpmeta xmlns:x="adobe:ns:meta/" x:xmptk="Adobe XMP Core 5.6-c142 79.160924, 2017/07/13-01:06:39        ">
   <rdf:RDF xmlns:rdf="http://www.w3.org/1999/02/22-rdf-syntax-ns#">
      <rdf:Description rdf:about=""/>
   </rdf:RDF>
</x:xmpmeta>
                                                                                                    
                                                                                                    
                                                                                                    
                                                                                                    
                                                                                                    
                                                                                                    
                                                                                                    
                                                                                                    
                                                                                                    
                                                                                                    
                                                                                                    
                                                                                                    
                                                                                                    
                                                                                                    
                                                                                                    
                                                                                                    
                                                                                                    
                                                                                                    
                                                                                                    
                                                                                                    
                           
<?xpacket end="w"?></metadata>
<defs>
    <style>
      .cls-1 {
        fill: #fff;
        fill-rule: evenodd;
      }
    </style>
  </defs>
  <path id="instagram" class="cls-1" d="M1491,2578.83a0.359,0.359,0,0,0-.36-0.36h-1.43a0.347,0.347,0,0,0-.33.36v1.43a0.333,0.333,0,0,0,.33.33h1.43a0.347,0.347,0,0,0,.36-0.33v-1.43Zm-0.36,10.99a0.359,0.359,0,0,0,.36-0.36v-6.01h-1.49a3.884,3.884,0,0,1,.06.7,4.243,4.243,0,0,1-7.25,3,4.227,4.227,0,0,1-1.25-3,3.861,3.861,0,0,1,.07-0.7h-1.49v6.01a0.359,0.359,0,0,0,.36.36h10.63Zm-7.31-7.67a2.786,2.786,0,1,0,3.99,0A2.813,2.813,0,0,0,1483.33,2582.15Zm8.67-4.68a1.389,1.389,0,0,1,.4,1v11.35a1.372,1.372,0,0,1-.4,1,1.349,1.349,0,0,1-1,.4h-11.35a1.349,1.349,0,0,1-1-.4,1.372,1.372,0,0,1-.4-1v-11.35a1.367,1.367,0,0,1,1.4-1.4H1491A1.389,1.389,0,0,1,1492,2577.47Z" transform="translate(-1478.25 -2577.06)"/>
</svg>
