CLOSE;HIGH;LOW;OPEN;OPENTIME;SYMBOL
3274.14;3285.85;3253.0;3275.29;2024-03-19T21:15;ETHUSDT
3284.06;3285.3;3260.89;3274.13;2024-03-19T21:30;ETHUSDT
3290.88;3298.9;3276.17;3284.05;2024-03-19T21:45;ETHUSDT
3251.93;3296.43;3251.93;3290.88;2024-03-19T22:00;ETHUSDT
3226.39;3259.09;3225.2;3251.93;2024-03-19T22:15;ETHUSDT
3212.0;3250.9;3210.13;3226.4;2024-03-19T22:30;ETHUSDT
3211.29;3223.4;3188.47;3212.0;2024-03-19T22:45;ETHUSDT
3171.14;3218.44;3165.62;3211.28;2024-03-19T23:00;ETHUSDT
3158.99;3182.99;3150.88;3171.14;2024-03-19T23:15;ETHUSDT
3163.33;3179.72;3158.53;3158.99;2024-03-19T23:30;ETHUSDT
3158.64;3179.53;3155.0;3163.34;2024-03-19T23:45;ETHUSDT
3169.6;3179.47;3156.02;3158.65;2024-03-20T00:00;ETHUSDT
3206.61;3214.88;3158.59;3169.6;2024-03-20T00:15;ETHUSDT
3215.14;3224.4;3186.37;3206.61;2024-03-20T00:30;ETHUSDT
3235.11;3238.9;3207.18;3215.13;2024-03-20T00:45;ETHUSDT
3211.9;3236.42;3201.51;3235.11;2024-03-20T01:00;ETHUSDT
3188.8;3215.4;3162.57;3211.91;2024-03-20T01:15;ETHUSDT
3163.6;3191.3;3160.22;3188.8;2024-03-20T01:30;ETHUSDT
3175.38;3190.6;3162.73;3163.59;2024-03-20T01:45;ETHUSDT
3202.8;3206.0;3166.08;3175.37;2024-03-20T02:00;ETHUSDT
3219.01;3221.12;3200.54;3202.8;2024-03-20T02:15;ETHUSDT
3221.65;3223.9;3206.0;3219.0;2024-03-20T02:30;ETHUSDT
3224.32;3228.73;3211.87;3221.62;2024-03-20T02:45;ETHUSDT
3224.57;3235.0;3222.0;3224.33;2024-03-20T03:00;ETHUSDT
3263.99;3266.01;3220.6;3224.57;2024-03-20T03:15;ETHUSDT
3232.74;3264.25;3231.32;3263.98;2024-03-20T03:30;ETHUSDT
3161.02;3236.66;3153.26;3232.73;2024-03-20T03:45;ETHUSDT
3191.38;3194.24;3154.4;3161.02;2024-03-20T04:00;ETHUSDT
3159.85;3191.68;3157.05;3191.38;2024-03-20T04:15;ETHUSDT
3120.23;3161.01;3099.99;3159.84;2024-03-20T04:30;ETHUSDT
3129.11;3137.38;3116.7;3120.22;2024-03-20T04:45;ETHUSDT
3101.7;3140.65;3089.43;3129.1;2024-03-20T05:00;ETHUSDT
3074.22;3108.08;3056.56;3101.7;2024-03-20T05:15;ETHUSDT
3098.59;3100.0;3060.0;3074.22;2024-03-20T05:30;ETHUSDT
3109.96;3132.0;3083.72;3098.6;2024-03-20T05:45;ETHUSDT
3128.15;3131.87;3108.23;3109.95;2024-03-20T06:00;ETHUSDT
3143.08;3144.0;3120.53;3128.14;2024-03-20T06:15;ETHUSDT
3144.62;3147.48;3131.48;3143.09;2024-03-20T06:30;ETHUSDT
3141.18;3148.38;3133.84;3144.63;2024-03-20T06:45;ETHUSDT
3160.52;3164.24;3140.34;3141.19;2024-03-20T07:00;ETHUSDT
3184.03;3188.23;3153.92;3160.52;2024-03-20T07:15;ETHUSDT
3210.28;3214.47;3173.3;3184.02;2024-03-20T07:30;ETHUSDT
3218.48;3226.0;3197.6;3210.27;2024-03-20T07:45;ETHUSDT
3220.27;3232.2;3205.1;3218.47;2024-03-20T08:00;ETHUSDT
3224.61;3226.56;3210.42;3220.27;2024-03-20T08:15;ETHUSDT
3211.81;3232.53;3206.38;3224.6;2024-03-20T08:30;ETHUSDT
3207.79;3234.19;3205.84;3211.82;2024-03-20T08:45;ETHUSDT
3212.42;3227.91;3205.6;3207.78;2024-03-20T09:00;ETHUSDT
3228.37;3233.92;3212.42;3212.43;2024-03-20T09:15;ETHUSDT
3234.85;3246.0;3225.0;3228.36;2024-03-20T09:30;ETHUSDT
3235.18;3244.95;3225.0;3234.86;2024-03-20T09:45;ETHUSDT
3225.17;3235.19;3223.0;3235.19;2024-03-20T10:00;ETHUSDT
3247.19;3250.0;3216.6;3225.18;2024-03-20T10:15;ETHUSDT
3221.99;3254.26;3221.02;3247.2;2024-03-20T10:30;ETHUSDT
3231.18;3234.83;3221.32;3221.99;2024-03-20T10:45;ETHUSDT
3245.66;3248.26;3225.0;3231.19;2024-03-20T11:00;ETHUSDT
3292.02;3296.72;3239.96;3245.66;2024-03-20T11:15;ETHUSDT
3278.55;3295.53;3274.81;3292.03;2024-03-20T11:30;ETHUSDT
3293.26;3294.99;3264.27;3278.54;2024-03-20T11:45;ETHUSDT
3322.42;3330.68;3275.35;3293.26;2024-03-20T12:00;ETHUSDT
3336.44;3348.04;3319.0;3322.42;2024-03-20T12:15;ETHUSDT
3346.08;3355.77;3334.29;3336.43;2024-03-20T12:30;ETHUSDT
3354.75;3357.0;3336.9;3346.07;2024-03-20T12:45;ETHUSDT
3341.29;3356.92;3337.01;3354.83;2024-03-20T13:00;ETHUSDT
3347.48;3356.52;3340.06;3341.28;2024-03-20T13:15;ETHUSDT
3360.59;3372.4;3324.21;3347.48;2024-03-20T13:30;ETHUSDT
3346.09;3370.6;3337.51;3360.59;2024-03-20T13:45;ETHUSDT
3340.0;3352.72;3329.51;3346.09;2024-03-20T14:00;ETHUSDT
3357.13;3362.89;3333.89;3340.0;2024-03-20T14:15;ETHUSDT
3363.72;3369.56;3345.93;3357.13;2024-03-20T14:30;ETHUSDT
3385.59;3388.0;3357.55;3363.72;2024-03-20T14:45;ETHUSDT
3377.52;3397.0;3375.0;3385.59;2024-03-20T15:00;ETHUSDT
3336.41;3378.16;3321.41;3377.52;2024-03-20T15:15;ETHUSDT
3295.0;3341.97;3293.27;3336.4;2024-03-20T15:30;ETHUSDT
3292.55;3316.36;3283.65;3295.01;2024-03-20T15:45;ETHUSDT
3300.48;3315.51;3270.59;3292.54;2024-03-20T16:00;ETHUSDT
3196.47;3305.6;3149.35;3300.49;2024-03-20T16:15;ETHUSDT
3226.29;3238.39;3140.71;3196.46;2024-03-20T16:30;ETHUSDT
3241.21;3267.05;3223.15;3226.29;2024-03-20T16:45;ETHUSDT
3280.91;3281.29;3226.53;3241.21;2024-03-20T17:00;ETHUSDT
3306.62;3340.69;3280.39;3280.9;2024-03-20T17:15;ETHUSDT
3301.6;3326.59;3297.02;3306.62;2024-03-20T17:30;ETHUSDT
3299.19;3307.52;3275.66;3301.6;2024-03-20T17:45;ETHUSDT
3342.9;3349.24;3299.19;3299.19;2024-03-20T18:00;ETHUSDT
3323.46;3342.9;3299.23;3342.9;2024-03-20T18:15;ETHUSDT
3327.2;3334.57;3295.42;3323.46;2024-03-20T18:30;ETHUSDT
3397.6;3405.78;3322.88;3327.19;2024-03-20T18:45;ETHUSDT
3388.6;3398.28;3368.35;3397.59;2024-03-20T19:00;ETHUSDT
3367.0;3391.6;3354.32;3388.61;2024-03-20T19:15;ETHUSDT
3373.54;3378.22;3357.6;3367.0;2024-03-20T19:30;ETHUSDT
3379.01;3388.88;3368.69;3373.53;2024-03-20T19:45;ETHUSDT
3403.51;3416.17;3370.91;3379.0;2024-03-20T20:00;ETHUSDT
3458.29;3463.6;3403.45;3403.51;2024-03-20T20:15;ETHUSDT
3474.96;3487.82;3455.7;3458.3;2024-03-20T20:30;ETHUSDT
3460.73;3492.56;3453.13;3474.97;2024-03-20T20:45;ETHUSDT
3487.61;3488.46;3456.43;3460.74;2024-03-20T21:00;ETHUSDT
3498.53;3518.75;3480.78;3487.61;2024-03-20T21:15;ETHUSDT
3487.14;3507.28;3480.18;3498.53;2024-03-20T21:30;ETHUSDT
3498.53;3500.01;3477.22;3487.14;2024-03-20T21:45;ETHUSDT
3510.21;3519.91;3495.0;3498.52;2024-03-20T22:00;ETHUSDT
3504.77;3524.97;3491.49;3510.21;2024-03-20T22:15;ETHUSDT
3507.35;3519.93;3498.19;3504.78;2024-03-20T22:30;ETHUSDT
3520.46;3525.0;3493.68;3507.35;2024-03-20T22:45;ETHUSDT
3522.94;3528.64;3503.6;3520.47;2024-03-20T23:00;ETHUSDT
3526.7;3533.4;3512.91;3522.94;2024-03-20T23:15;ETHUSDT
3516.14;3535.24;3515.49;3526.69;2024-03-20T23:30;ETHUSDT
3516.53;3519.39;3506.13;3516.15;2024-03-20T23:45;ETHUSDT
3505.16;3519.72;3497.77;3516.53;2024-03-21T00:00;ETHUSDT
3508.59;3524.44;3494.79;3505.16;2024-03-21T00:15;ETHUSDT
3537.21;3550.81;3503.3;3508.6;2024-03-21T00:30;ETHUSDT
3516.36;3549.6;3516.36;3537.2;2024-03-21T00:45;ETHUSDT
3523.6;3529.91;3514.6;3516.36;2024-03-21T01:00;ETHUSDT
3529.94;3529.99;3519.7;3523.6;2024-03-21T01:15;ETHUSDT
3512.37;3530.17;3508.64;3529.95;2024-03-21T01:30;ETHUSDT
3526.05;3528.47;3511.85;3512.37;2024-03-21T01:45;ETHUSDT
3532.48;3541.8;3526.05;3526.05;2024-03-21T02:00;ETHUSDT
3546.15;3558.99;3531.91;3532.47;2024-03-21T02:15;ETHUSDT
3553.02;3556.85;3542.61;3546.14;2024-03-21T02:30;ETHUSDT
3540.25;3554.6;3535.4;3553.02;2024-03-21T02:45;ETHUSDT
3537.23;3555.0;3537.23;3540.24;2024-03-21T03:00;ETHUSDT
3531.2;3546.6;3526.79;3537.48;2024-03-21T03:15;ETHUSDT
3527.8;3544.39;3525.0;3531.19;2024-03-21T03:30;ETHUSDT
3510.59;3527.8;3493.4;3527.79;2024-03-21T03:45;ETHUSDT
3502.59;3521.6;3495.75;3510.59;2024-03-21T04:00;ETHUSDT
3512.94;3518.59;3502.59;3502.6;2024-03-21T04:15;ETHUSDT
3489.61;3516.84;3486.56;3512.94;2024-03-21T04:30;ETHUSDT
3494.3;3504.31;3485.94;3489.62;2024-03-21T04:45;ETHUSDT
3479.21;3494.3;3468.0;3494.29;2024-03-21T05:00;ETHUSDT
3467.56;3479.29;3446.47;3479.21;2024-03-21T05:15;ETHUSDT
3470.74;3480.41;3459.87;3467.55;2024-03-21T05:30;ETHUSDT
3510.08;3511.27;3469.87;3470.75;2024-03-21T05:45;ETHUSDT
3522.6;3533.57;3506.26;3510.09;2024-03-21T06:00;ETHUSDT
3517.57;3532.59;3508.6;3522.61;2024-03-21T06:15;ETHUSDT
3505.43;3524.41;3502.0;3517.56;2024-03-21T06:30;ETHUSDT
3507.16;3517.3;3502.0;3505.43;2024-03-21T06:45;ETHUSDT
3509.15;3516.45;3502.05;3507.16;2024-03-21T07:00;ETHUSDT
3534.2;3537.2;3508.6;3509.14;2024-03-21T07:15;ETHUSDT
3519.01;3535.69;3519.0;3534.21;2024-03-21T07:30;ETHUSDT
3516.03;3520.53;3509.69;3519.01;2024-03-21T07:45;ETHUSDT
3540.98;3550.0;3516.03;3516.04;2024-03-21T08:00;ETHUSDT
3542.76;3550.0;3530.34;3540.98;2024-03-21T08:15;ETHUSDT
3553.23;3555.99;3533.53;3542.76;2024-03-21T08:30;ETHUSDT
3569.46;3585.76;3552.09;3553.23;2024-03-21T08:45;ETHUSDT
3570.2;3587.32;3566.12;3569.45;2024-03-21T09:00;ETHUSDT
3560.26;3570.2;3558.2;3570.19;2024-03-21T09:15;ETHUSDT
3530.99;3561.19;3527.28;3560.25;2024-03-21T09:30;ETHUSDT
3536.96;3541.68;3523.77;3531.0;2024-03-21T09:45;ETHUSDT
3548.39;3549.95;3530.52;3536.96;2024-03-21T10:00;ETHUSDT
3537.67;3550.0;3533.39;3548.38;2024-03-21T10:15;ETHUSDT
3529.22;3539.95;3525.55;3537.67;2024-03-21T10:30;ETHUSDT
3541.98;3550.0;3529.21;3529.21;2024-03-21T10:45;ETHUSDT
3547.03;3549.8;3540.95;3541.98;2024-03-21T11:00;ETHUSDT
3526.25;3548.59;3520.14;3547.03;2024-03-21T11:15;ETHUSDT
3537.08;3544.58;3520.53;3526.24;2024-03-21T11:30;ETHUSDT
3531.18;3539.47;3527.28;3537.08;2024-03-21T11:45;ETHUSDT
3544.83;3548.6;3531.18;3531.18;2024-03-21T12:00;ETHUSDT
3547.99;3548.68;3535.49;3544.83;2024-03-21T12:15;ETHUSDT
3535.19;3565.73;3535.1;3547.99;2024-03-21T12:30;ETHUSDT
3541.6;3551.83;3523.44;3535.18;2024-03-21T12:45;ETHUSDT
3549.7;3558.25;3540.12;3541.6;2024-03-21T13:00;ETHUSDT
3554.23;3557.33;3538.66;3549.71;2024-03-21T13:15;ETHUSDT
3538.61;3574.41;3533.07;3554.23;2024-03-21T13:30;ETHUSDT
3519.85;3540.59;3515.01;3538.61;2024-03-21T13:45;ETHUSDT
3543.5;3547.99;3511.0;3519.84;2024-03-21T14:00;ETHUSDT
3546.43;3564.84;3535.85;3543.5;2024-03-21T14:15;ETHUSDT
3535.05;3548.56;3530.73;3546.44;2024-03-21T14:30;ETHUSDT
3529.52;3538.39;3521.38;3535.04;2024-03-21T14:45;ETHUSDT
3498.72;3533.2;3491.17;3529.53;2024-03-21T15:00;ETHUSDT
3490.76;3510.43;3486.46;3498.73;2024-03-21T15:15;ETHUSDT
3499.18;3508.76;3479.47;3490.75;2024-03-21T15:30;ETHUSDT
3497.6;3499.99;3478.73;3499.19;2024-03-21T15:45;ETHUSDT
3502.43;3506.14;3484.94;3497.59;2024-03-21T16:00;ETHUSDT
3522.39;3527.86;3495.21;3502.44;2024-03-21T16:15;ETHUSDT
3508.99;3522.39;3504.5;3522.39;2024-03-21T16:30;ETHUSDT
3528.56;3530.41;3502.79;3508.98;2024-03-21T16:45;ETHUSDT
3527.15;3545.99;3515.71;3528.56;2024-03-21T17:00;ETHUSDT
3489.24;3527.16;3488.0;3527.15;2024-03-21T17:15;ETHUSDT
3477.82;3500.16;3475.05;3489.23;2024-03-21T17:30;ETHUSDT
3472.99;3488.35;3462.1;3477.81;2024-03-21T17:45;ETHUSDT
3436.43;3481.14;3432.1;3473.0;2024-03-21T18:00;ETHUSDT
3446.69;3450.0;3427.27;3436.42;2024-03-21T18:15;ETHUSDT
3413.51;3446.69;3412.22;3446.68;2024-03-21T18:30;ETHUSDT
3421.71;3430.78;3412.23;3413.5;2024-03-21T18:45;ETHUSDT
3433.49;3437.08;3416.94;3421.72;2024-03-21T19:00;ETHUSDT
3430.85;3435.0;3418.09;3433.5;2024-03-21T19:15;ETHUSDT
3447.22;3452.43;3429.66;3430.86;2024-03-21T19:30;ETHUSDT
3441.38;3451.27;3432.95;3447.23;2024-03-21T19:45;ETHUSDT
3474.52;3476.04;3412.0;3441.37;2024-03-21T20:00;ETHUSDT
3483.3;3500.0;3466.18;3474.51;2024-03-21T20:15;ETHUSDT
3472.99;3486.91;3465.42;3483.29;2024-03-21T20:30;ETHUSDT
3484.27;3486.7;3452.37;3472.99;2024-03-21T20:45;ETHUSDT
3477.98;3489.97;3474.8;3484.26;2024-03-21T21:00;ETHUSDT
3472.58;3489.79;3468.36;3477.97;2024-03-21T21:15;ETHUSDT
3487.37;3489.82;3472.57;3472.58;2024-03-21T21:30;ETHUSDT
3503.75;3507.36;3487.25;3487.37;2024-03-21T21:45;ETHUSDT
3517.76;3521.91;3500.6;3503.74;2024-03-21T22:00;ETHUSDT
3503.01;3519.49;3491.6;3517.76;2024-03-21T22:15;ETHUSDT
3497.99;3506.99;3490.29;3503.0;2024-03-21T22:30;ETHUSDT
3483.2;3501.57;3482.68;3498.0;2024-03-21T22:45;ETHUSDT
3489.02;3491.88;3480.6;3483.19;2024-03-21T23:00;ETHUSDT
3485.93;3492.91;3482.18;3489.01;2024-03-21T23:15;ETHUSDT
3487.16;3494.6;3480.8;3485.93;2024-03-21T23:30;ETHUSDT
3492.85;3500.0;3487.04;3487.16;2024-03-21T23:45;ETHUSDT
3515.76;3516.3;3491.0;3492.84;2024-03-22T00:00;ETHUSDT
3505.11;3519.8;3504.3;3515.76;2024-03-22T00:15;ETHUSDT
3491.61;3505.12;3472.95;3505.12;2024-03-22T00:30;ETHUSDT
3495.32;3503.4;3477.4;3491.61;2024-03-22T00:45;ETHUSDT
3508.41;3510.0;3480.24;3495.33;2024-03-22T01:00;ETHUSDT
3498.39;3511.38;3492.86;3508.42;2024-03-22T01:15;ETHUSDT
3486.47;3498.4;3482.7;3498.4;2024-03-22T01:30;ETHUSDT
3463.21;3496.18;3460.0;3486.47;2024-03-22T01:45;ETHUSDT
3460.5;3474.5;3454.01;3463.22;2024-03-22T02:00;ETHUSDT
3469.2;3478.3;3454.61;3460.49;2024-03-22T02:15;ETHUSDT
3467.81;3474.4;3464.0;3469.2;2024-03-22T02:30;ETHUSDT
3478.02;3481.5;3460.45;3467.81;2024-03-22T02:45;ETHUSDT
3477.99;3488.44;3475.86;3478.01;2024-03-22T03:00;ETHUSDT
3501.45;3501.45;3477.46;3477.99;2024-03-22T03:15;ETHUSDT
3506.97;3518.23;3500.9;3501.45;2024-03-22T03:30;ETHUSDT
3522.01;3527.61;3506.61;3506.97;2024-03-22T03:45;ETHUSDT
3516.89;3525.84;3508.0;3522.0;2024-03-22T04:00;ETHUSDT
3509.25;3518.0;3505.2;3516.9;2024-03-22T04:15;ETHUSDT
3503.16;3512.0;3502.0;3509.25;2024-03-22T04:30;ETHUSDT
3511.12;3527.0;3502.0;3503.17;2024-03-22T04:45;ETHUSDT
3503.5;3519.32;3500.95;3511.13;2024-03-22T05:00;ETHUSDT
3514.26;3516.72;3500.63;3503.5;2024-03-22T05:15;ETHUSDT
3523.82;3524.99;3510.15;3514.26;2024-03-22T05:30;ETHUSDT
3531.81;3533.49;3521.2;3523.81;2024-03-22T05:45;ETHUSDT
3534.99;3542.52;3526.1;3531.8;2024-03-22T06:00;ETHUSDT
3526.55;3537.36;3524.0;3534.99;2024-03-22T06:15;ETHUSDT
3530.49;3534.61;3521.27;3526.55;2024-03-22T06:30;ETHUSDT
3532.18;3533.0;3522.1;3530.5;2024-03-22T06:45;ETHUSDT
3524.73;3532.19;3518.17;3532.19;2024-03-22T07:00;ETHUSDT
3522.24;3526.0;3515.6;3524.73;2024-03-22T07:15;ETHUSDT
3523.39;3533.0;3518.5;3522.24;2024-03-22T07:30;ETHUSDT
3511.4;3523.39;3509.45;3523.39;2024-03-22T07:45;ETHUSDT
3519.75;3520.36;3510.0;3511.39;2024-03-22T08:00;ETHUSDT
3512.5;3523.8;3510.3;3519.75;2024-03-22T08:15;ETHUSDT
3490.98;3515.92;3486.17;3512.51;2024-03-22T08:30;ETHUSDT
3483.0;3501.1;3476.6;3490.98;2024-03-22T08:45;ETHUSDT
3483.39;3494.04;3481.69;3483.0;2024-03-22T09:00;ETHUSDT
3484.26;3490.33;3483.39;3483.39;2024-03-22T09:15;ETHUSDT
3457.83;3487.45;3457.5;3484.26;2024-03-22T09:30;ETHUSDT
3466.49;3467.8;3455.71;3457.82;2024-03-22T09:45;ETHUSDT
3453.5;3473.0;3444.01;3466.5;2024-03-22T10:00;ETHUSDT
3437.0;3459.24;3430.0;3453.5;2024-03-22T10:15;ETHUSDT
3441.22;3448.0;3428.0;3436.99;2024-03-22T10:30;ETHUSDT
3433.01;3446.89;3429.38;3441.23;2024-03-22T10:45;ETHUSDT
3436.67;3442.0;3428.16;3433.01;2024-03-22T11:00;ETHUSDT
3434.12;3441.21;3425.0;3436.66;2024-03-22T11:15;ETHUSDT
3433.0;3441.54;3427.6;3434.12;2024-03-22T11:30;ETHUSDT
3405.19;3436.34;3394.42;3433.0;2024-03-22T11:45;ETHUSDT
3412.89;3425.84;3381.18;3405.18;2024-03-22T12:00;ETHUSDT
3415.86;3420.49;3406.05;3416.09;2024-03-22T12:15;ETHUSDT
3411.6;3419.5;3407.95;3415.86;2024-03-22T12:30;ETHUSDT
3412.16;3419.0;3411.0;3418.99;2024-03-22T12:45;ETHUSDT
3403.85;3419.5;3403.62;3411.51;2024-03-22T13:00;ETHUSDT
3408.88;3411.8;3380.68;3401.4;2024-03-22T13:15;ETHUSDT
3376.5;3410.64;3366.0;3408.89;2024-03-22T13:30;ETHUSDT
3350.49;3377.36;3338.73;3376.51;2024-03-22T13:45;ETHUSDT
3333.0;3360.86;3329.4;3340.35;2024-03-22T14:00;ETHUSDT
3323.03;3334.44;3323.0;3332.5;2024-03-22T14:15;ETHUSDT
3315.02;3317.28;3305.88;3310.59;2024-03-22T14:30;ETHUSDT
3302.17;3302.17;3300.12;3300.12;2024-03-22T14:45;ETHUSDT
3297.26;3301.0;3281.12;3287.4;2024-03-22T15:00;ETHUSDT
3316.61;3317.22;3316.61;3317.22;2024-03-22T15:15;ETHUSDT
3367.32;3367.32;3365.18;3365.18;2024-03-22T15:30;ETHUSDT
3344.55;3344.55;3344.54;3344.55;2024-03-22T15:45;ETHUSDT
3337.25;3349.7;3332.09;3349.3;2024-03-22T16:00;ETHUSDT
3335.76;3337.51;3335.76;3337.5;2024-03-22T16:15;ETHUSDT
3315.5;3325.0;3312.0;3323.06;2024-03-22T16:30;ETHUSDT
3294.81;3314.22;3294.69;3303.97;2024-03-22T16:45;ETHUSDT
3313.87;3313.87;3312.65;3312.8;2024-03-22T17:00;ETHUSDT
3331.13;3336.4;3322.16;3326.01;2024-03-22T17:15;ETHUSDT
3323.16;3324.94;3323.15;3324.93;2024-03-22T17:30;ETHUSDT
3334.91;3344.4;3333.02;3340.46;2024-03-22T17:45;ETHUSDT
3336.39;3337.08;3335.96;3335.97;2024-03-22T18:00;ETHUSDT
3326.58;3333.49;3322.78;3333.22;2024-03-22T18:15;ETHUSDT
3325.19;3325.21;3324.18;3325.21;2024-03-22T18:30;ETHUSDT
3342.5;3349.26;3334.67;3344.11;2024-03-22T18:45;ETHUSDT
3327.61;3349.41;3326.6;3342.49;2024-03-22T19:00;ETHUSDT
3332.5;3334.98;3321.53;3327.61;2024-03-22T19:15;ETHUSDT
3332.75;3348.16;3324.77;3328.15;2024-03-22T19:30;ETHUSDT
3340.46;3358.99;3330.28;3332.75;2024-03-22T19:45;ETHUSDT
3323.37;3345.59;3323.36;3340.46;2024-03-22T20:00;ETHUSDT
3320.01;3325.5;3314.01;3315.34;2024-03-22T20:15;ETHUSDT
3321.41;3323.5;3318.51;3320.01;2024-03-22T20:30;ETHUSDT
3308.94;3319.67;3305.46;3316.35;2024-03-22T20:45;ETHUSDT
3317.49;3317.5;3317.49;3317.5;2024-03-22T21:00;ETHUSDT
