{
  "log-path": "/home/bso/tmp/",
  "clear-log": true,
  "input_line": "b+a+b",
  "lang": [
    {
      "rule": "B",
      "alternative": "T+B",
      "number_alt": 1
    },
    {
      "rule": "B",
      "alternative": "T",
      "number_alt": 2
    },
    {
      "rule": "T",
      "alternative": "M",
      "number_alt": 1
    },
    {
      "rule": "T",
      "alternative": "M*T",
      "number_alt": 2
    },
    {
      "rule": "M",
      "alternative": "a",
      "number_alt": 1
    },
    {
      "rule": "M",
      "alternative": "b",
      "number_alt": 2
    }
  ],
  "terminals": [
    "+",
    "*",
    "a",
    "b"
  ],
  "precedence-matrix": {
    "row-num": 5,
    "column-num": 5,
    "ratios": [
      {
        "F1G1": 3
      },
      {
        "F1G2": 3
      },
      {
        "F1G3": 1
      },
      {
        "F1G5": 3
      },
      {
        "F2G3": 2
      },
      {
        "F2G4": 3
      },
      {
        "F2G5": 1
      },
      {
        "F3G1": 3
      },
      {
        "F3G3": 2
      },
      {
        "F3G4": 1
      },
      {
        "F4G2": 3
      },
      {
        "F4G3": 2
      },
      {
        "F5G4": 2
      },
      {
        "F5G5": 2
      }
    ]
  }
}
