@startuml
entity Item {
    id: Integer() - primary key
    quantity: Integer()
    **receipt: FK**
    **ingredient: FK**

}

entity Ingredient {
    name: String(255)
}

entity Receipt {
    id: Integer() - primary key
    name: String(255)
}


Receipt --{ Item
Item }- Ingredient
@enduml