<svg width="55" height="55" viewBox="0 0 55 55" fill="none" xmlns="http://www.w3.org/2000/svg">
<path d="M23.8159 32.0572C23.6375 31.9386 23.4548 31.8101 23.2631 31.6805C22.7059 31.5099 22.1144 31.4213 21.5085 31.4136H21.4354C18.6506 31.4136 16.2092 33.0984 16.2092 35.0214C16.2092 37.115 18.3017 38.751 20.9713 38.751C24.4927 38.751 26.2772 37.5348 26.2772 35.1421C26.2772 34.9162 26.2506 34.6813 26.1941 34.4454C25.956 33.5171 25.1041 32.9378 23.8159 32.0572Z" fill="#B30000"/>
<path d="M21.8428 24.7594C21.845 24.7594 21.845 24.7594 21.845 24.7594C22.5108 24.7594 23.0724 24.4969 23.5077 23.9985C24.19 23.2208 24.4924 21.9448 24.313 20.59C23.9973 18.1686 22.266 16.1525 20.4593 16.1005L20.3873 16.0983C19.7481 16.0983 19.1777 16.3619 18.7445 16.8582C18.0722 17.6258 17.7875 18.8421 17.9636 20.1946C18.2804 22.6138 20.0483 24.7041 21.8173 24.7594H21.8428Z" fill="#B30000"/>
<path d="M27.5 0C12.3366 0 0 12.3366 0 27.5C0 42.6623 12.3366 55 27.5 55C42.6623 55 55 42.6623 55 27.5C55 12.3366 42.6645 0 27.5 0ZM24.3297 40.8911C23.2907 41.1913 22.1664 41.343 20.9867 41.343C19.6729 41.343 18.4101 41.1924 17.2326 40.8944C14.9541 40.3195 13.2704 39.2295 12.4839 37.825C12.1449 37.2179 11.9732 36.571 11.9732 35.9009C11.9732 35.2108 12.1383 34.5107 12.4639 33.8173C13.7123 31.1565 17.0033 29.3665 20.6488 29.3665C20.6854 29.3665 20.7197 29.3665 20.7529 29.3665C20.4572 28.8448 20.3143 28.3042 20.3143 27.7359C20.3143 27.4535 20.3519 27.1655 20.4273 26.8719C16.6035 26.7855 13.7422 23.9852 13.7422 20.2932C13.7422 17.6868 15.8258 15.1468 18.8056 14.1211C19.6973 13.8131 20.6067 13.6558 21.5006 13.6558H29.6778C29.9558 13.6558 30.2028 13.8364 30.2892 14.1011C30.3756 14.3648 30.2803 14.655 30.0555 14.8178L28.2267 16.1415C28.117 16.2191 27.9852 16.2612 27.8489 16.2612H27.1943C28.0395 17.2747 28.5346 18.7203 28.5346 20.3431C28.5346 22.1343 27.6285 23.8279 25.9791 25.1184C24.7052 26.1109 24.6554 26.3845 24.6554 26.9506C24.6709 27.2618 25.5582 28.2776 26.5374 28.9699C28.8182 30.5828 29.6667 32.1657 29.6667 34.8065C29.6656 37.5658 27.5709 39.9496 24.3297 40.8911ZM42.7964 26.8653C42.7964 27.2197 42.5073 27.5078 42.1539 27.5078H37.507V32.1568C37.507 32.5113 37.2179 32.7993 36.8668 32.7993H35.5431C35.1864 32.7993 34.8984 32.5113 34.8984 32.1568V27.5078H30.2549C29.9004 27.5078 29.6124 27.222 29.6124 26.8653V25.5438C29.6124 25.1893 29.9004 24.8991 30.2549 24.8991H34.8984V20.2545C34.8984 19.8989 35.1864 19.612 35.5431 19.612H36.8668C37.2179 19.612 37.507 19.8989 37.507 20.2545V24.8991H42.1528C42.5061 24.8991 42.7953 25.1871 42.7953 25.5416V26.8653H42.7964Z" fill="#B30000"/>
</svg>
