<svg width="64" height="64" viewBox="0 0 64 64" fill="none" xmlns="http://www.w3.org/2000/svg">
<g id="logo/1">
<g id="Group 30">
<path id="Subtract" fill-rule="evenodd" clip-rule="evenodd" d="M55.7608 7.37549H45.4905C44.325 7.37549 43.3801 8.30684 43.3801 9.45572V15.003H16.6491C15.4836 15.003 14.5387 15.9343 14.5387 17.0832V31.0901H6.80078V32.4769H14.5387V46.4838C14.5387 47.6326 15.4836 48.564 16.6491 48.564H43.3801V54.1113C43.3801 55.2601 44.325 56.1915 45.4905 56.1915H55.7608V54.8047H45.4905C45.102 54.8047 44.787 54.4942 44.787 54.1113V41.6299C44.787 41.2469 45.102 40.9365 45.4905 40.9365H55.7608V39.5497H45.4905C44.325 39.5497 43.3801 40.481 43.3801 41.6299V47.1772H16.6491C16.2606 47.1772 15.9456 46.8667 15.9456 46.4838V17.0832C15.9456 16.7003 16.2606 16.3898 16.6491 16.3898H43.3801V21.9371C43.3801 23.086 44.325 24.0173 45.4905 24.0173H55.7608V22.6305H45.4905C45.102 22.6305 44.787 22.32 44.787 21.9371V9.45572C44.787 9.07276 45.102 8.76231 45.4905 8.76231H55.7608V7.37549Z" fill="#625B71"/>
<rect id="Rectangle 2" x="3.20117" y="25.6636" width="7.92001" height="12.24" rx="1.44" fill="#E15B5A"/>
<g id="Group 28">
<rect id="Rectangle 5" x="51.5859" y="3.19971" width="9.21601" height="9.216" rx="1.44" fill="#FFCC66"/>
<rect id="Rectangle 6" x="51.5859" y="18.6074" width="9.21601" height="9.216" rx="1.44" fill="#FFCC66"/>
</g>
<g id="Group 27">
<rect id="Rectangle 7" x="51.5859" y="35.5996" width="9.21601" height="9.216" rx="1.44" fill="#56C24E"/>
<rect id="Rectangle 8" x="51.5859" y="51.5835" width="9.21601" height="9.216" rx="1.44" fill="#56C24E"/>
</g>
<g id="Group 29">
<rect id="Rectangle 3" x="19.3301" y="3.77588" width="17.568" height="24.336" rx="1.44" fill="#4AB9F5"/>
<rect id="Rectangle 4" x="19.3301" y="35.8882" width="17.568" height="24.336" rx="1.44" fill="#4AB9F5"/>
</g>
</g>
</g>
</svg>
