<svg width="12" height="12" viewBox="0 0 12 12" fill="none" xmlns="http://www.w3.org/2000/svg">
<path d="M4.125 0.375V1.875H9.0675L0.375 10.5675L1.4325 11.625L10.125 2.9325V7.875H11.625V0.375H4.125Z" fill="white"/>
</svg>
