{
    "name": "Magic Music Store",
    "products": [
        {
            "name": "ESP E-II Guitar",
            "price": "2000$",
            "image": "https://jam.ua/images/item/ESP%20E-II_M-II_Neck-Thru_BK.608ad4a93c918.jpg",
            "article": "0001",
            "color": "black"
        },
        {
            "name": "Warwick Bass",
            "price": "1100$",
            "image": "https://jam.ua/images/item/1504030100CAALDAWW-main.607edc36253c8.jpg",
            "article": "0002",
            "color": "dark-red"
        }, 
        {
            "name": "NYXL Strings",
            "price": "15$",
            "image": "https://jam.ua/images/item/ds_nyxl1046_detail1_transparent.jpg.5f771e3a0a9b3.jpg.png",
            "article": "0003",
            "color": "chrome"
        },
        {
            "name": "Snare Drum",
            "price": "800$",
            "image": "https://jam.ua/images/item/AMS1460VN.jpg",
            "article": "0004",
            "color": "vintage-natural"
        }, 
        {
            "name": "Kick Drum",
            "price": "1400$",
            "image": "https://jam.ua/images/item/AMB2218-VN-yamaha.jpg",
            "article": "0005",
            "color": "vintage-natural"
        }, 
        {
            "name": "Floor Tom",
            "price": "900$",
            "image": "https://jam.ua/images/item/AMF1615-VN-yamaha.jpg",
            "article": "0006",
            "color": "vintage-natural"
        }, 
        {
            "name": "HiHat",
            "price": "350$",
            "image": "https://jam.ua/images/item/14-aax-fast-hats.jpg",
            "article": "0007",
            "color": "brass"
        },
        {
            "name": "Crash Cymbal",
            "price": "300$",
            "image": "https://jam.ua/images/item/21809B-18-inch-aa-rock-crash_full.62f11ad8de59a.jpg",
            "article": "0008",
            "color": "brass"
        }, 
        {
            "name": "Ride Cymbal",
            "price": "370$",
            "image": "https://jam.ua/images/item/sabian-hhx-stage-ride-20-brill.jpg",
            "article": "0009",
            "color": "black"
        }, 
        {
            "name": "Bass Drum Pedal",
            "price": "330$",
            "image": "https://jam.ua/images/item/FP9C-main-yamaha.jpg",
            "article": "0010",
            "color": "chrome"
        },
        {
            "name": "Drum Sticks",
            "price": "15$",
            "image": "https://jam.ua/images/item/Promark%20rbh565aw%201.jpg",
            "article": "0011",
            "color": "wood"
        },
        {
            "name": "Instrumental Cable",
            "price": "25$",
            "image": "https://jam.ua/images/item/da_pw-ag-10_main.png.5e9710aba695f.png",
            "article": "0012",
            "color": "black"
        },
        {
            "name": "Stompbox",
            "price": "75$",
            "image": "https://jam.ua/images/item/echolizer.625d49823854a.jpg",
            "article": "0013",
            "color": "purple"
        }, 
        {
            "name": "Microphone",
            "price": "170$",
            "image": "https://jam.ua/images/item/Audix%20OM5.jpg",
            "article": "0014",
            "color": "black"
        },
        {
            "name": "Studio  Monitor",
            "price": "750$",
            "image": "https://jam.ua/images/item/yamaha_hs8i_qtr_left.jpg",
            "article": "0015",
            "color": "black"
        }, 
        {
            "name": "Sound Interface",
            "price": "300$",
            "image": "https://jam.ua/images/item/mgame-dual-studio-01.6318a6da3848f.jpg",
            "article": "0016",
            "color": "black"
        }
    ]
}