<?xml version="1.0" encoding="UTF-8" standalone="no"?>
<svg
   xmlns:dc="http://purl.org/dc/elements/1.1/"
   xmlns:cc="http://creativecommons.org/ns#"
   xmlns:rdf="http://www.w3.org/1999/02/22-rdf-syntax-ns#"
   xmlns:svg="http://www.w3.org/2000/svg"
   xmlns="http://www.w3.org/2000/svg"
   xmlns:sodipodi="http://sodipodi.sourceforge.net/DTD/sodipodi-0.dtd"
   xmlns:inkscape="http://www.inkscape.org/namespaces/inkscape"
   version="1.1"
   inkscape:output_extension="org.inkscape.output.svg.inkscape"
   sodipodi:docname="interpolate-f16.svg"
   inkscape:version="1.0beta1 (08a003b, 2019-11-10)"
   sodipodi:version="0.32"
   viewBox="0 0 300 37"
   id="svg15699"
   height="37"
   width="300">
  <defs
     id="defs15701" />
  <sodipodi:namedview
     inkscape:lockguides="true"
     id="base"
     pagecolor="#ffffff"
     bordercolor="#666666"
     borderopacity="1.0"
     inkscape:pageopacity="0.0"
     inkscape:pageshadow="2"
     inkscape:zoom="1.4"
     inkscape:cx="250.24065"
     inkscape:cy="-5.2582214"
     inkscape:document-units="px"
     inkscape:current-layer="layer1"
     inkscape:document-rotation="0"
     showgrid="false"
     units="px"
     showguides="true"
     inkscape:guide-bbox="true"
     inkscape:window-width="1866"
     inkscape:window-height="1016"
     inkscape:window-x="54"
     inkscape:window-y="27"
     inkscape:window-maximized="1" />
  <metadata
     id="metadata15704">
    <rdf:RDF>
      <cc:Work
         rdf:about="">
        <dc:format>image/svg+xml</dc:format>
        <dc:type
           rdf:resource="http://purl.org/dc/dcmitype/StillImage" />
        <dc:title></dc:title>
      </cc:Work>
    </rdf:RDF>
  </metadata>
  <g
     id="layer1"
     inkscape:groupmode="layer"
     inkscape:label="Layer 1">
    <g
       transform="translate(-11.811549,-16.97341)"
       id="g2861">
      <path
         inkscape:connector-curvature="0"
         style="fill:#ffcc00;fill-opacity:1;stroke:none;stroke-width:4.475;stroke-linejoin:round;stroke-miterlimit:4;stroke-opacity:1"
         id="path13980"
         d="m 52.663225,48.162539 c -2.997633,2.9047 -3.507079,-5.427 -7.120666,-3.1925 -3.684923,2.2787 1.132577,7.9413 -3.227658,8.4695 -4.275827,0.518 1.544089,-6.9599 -2.677711,-7.5296 -4.305143,-0.581 -3.831019,7.2721 -7.907862,5.6902 -3.99792,-1.5513 4.538079,-5.7159 1.629621,-8.8711 -2.965875,-3.2174 -6.213294,5.7226 -8.462887,1.9619 -2.206044,-3.6879 5.568058,-2.5544 4.95876,-6.6857 -0.621326,-4.2129 -8.402865,-0.204 -8.030318,-4.4441 0.365336,-4.1581 8.015332,2.7473 9.900609,-1.0625 1.922494,-3.8849 -6.953244,-4.6723 -4.276714,-7.8973 2.624715,-3.1626 4.670778,4.5784 8.370782,2.3642 3.773046,-2.2578 -2.706716,-7.438 1.458203,-8.4264 4.084291,-0.9693 0.183675,7.8024 4.350054,8.2857 4.248626,0.4929 2.824686,-8.4766 6.659535,-6.6728 3.760611,1.769 -3.61308,6.4805 -0.833854,9.63 2.834091,3.2116 5.587332,-5.8283 7.762386,-2.1005 2.132947,3.6555 -5.515222,3.2348 -4.863467,7.5015 0.664621,4.351 8.878341,0.2244 8.028527,4.4871 -0.833362,4.1802 -8.372195,-3.7561 -9.994112,0.2035 -1.653934,4.0378 7.33358,5.3268 4.276772,8.2889 z" />
      <path
         inkscape:connector-curvature="0"
         style="fill:#d40000;fill-opacity:1;stroke:none;stroke-width:4.475;stroke-linejoin:round;stroke-miterlimit:4;stroke-opacity:1"
         id="path13984"
         d="m 276.69524,46.671439 c -2.99763,2.9048 -3.50708,-5.4269 -7.12067,-3.1924 -3.68492,2.2786 1.13258,7.9413 -3.22766,8.4695 -4.27582,0.518 1.5441,-6.96 -2.6777,-7.5297 -4.30515,-0.5809 -3.83102,7.2721 -7.90787,5.6902 -3.99792,-1.5512 4.53808,-5.7159 1.62963,-8.871 -2.96588,-3.2174 -6.2133,5.7225 -8.46289,1.9618 -2.20605,-3.6879 5.56805,-2.5543 4.95876,-6.6857 -0.62133,-4.2129 -8.40287,-0.2039 -8.03032,-4.4441 0.36534,-4.158 8.01533,2.7474 9.90061,-1.0624 1.92249,-3.885 -6.95325,-4.6724 -4.27671,-7.8974 2.62471,-3.1626 4.67077,4.5785 8.37077,2.3643 3.77305,-2.2578 -2.70671,-7.438 1.45821,-8.4264 4.08429,-0.9693 0.18367,7.8024 4.35005,8.2857 4.24863,0.4928 2.82469,-8.4766 6.65954,-6.6728 3.76061,1.7689 -3.61308,6.4805 -0.83385,9.6299 2.83409,3.2117 5.58732,-5.8282 7.76238,-2.1005 2.13295,3.6556 -5.51522,3.2348 -4.86347,7.5016 0.66462,4.351 8.87834,0.2244 8.02853,4.4871 -0.83336,4.1802 -8.37219,-3.7561 -9.99411,0.2035 -1.65393,4.0378 7.33358,5.3268 4.27677,8.2888 z" />
      <g
         id="g14129"
         transform="matrix(0.5218716,0,0,0.5218716,16.740257,-799.45519)">
        <path
           inkscape:connector-curvature="0"
           style="opacity:1;fill:#da1d00;fill-opacity:1;stroke:none;stroke-width:4.475;stroke-linejoin:round;stroke-miterlimit:4;stroke-opacity:1"
           id="path14131"
           d="m 436.79407,1621.7394 c -5.744,5.566 -6.7202,-10.399 -13.64448,-6.1173 -1.9e-4,10e-5 -3.7e-4,2e-4 -5.5e-4,3e-4 -7.05995,4.3665 2.17055,15.2167 -6.18423,16.2288 -4e-5,0 -7e-5,0 -1.1e-4,0 -8.19304,0.9924 2.95883,-13.3365 -5.13086,-14.4282 -2.2e-4,-10e-5 -4.3e-4,-10e-5 -6.5e-4,-10e-5 -8.24873,-1.1124 -7.34048,13.9347 -15.15224,10.9036 -3e-5,-10e-5 -7e-5,-10e-5 -10e-5,-10e-5 -7.6605,-2.9725 8.69585,-10.9527 3.12275,-16.9984 -3e-5,-10e-5 -5e-5,-10e-5 -8e-5,-10e-5 -5.68313,-6.165 -11.90574,10.9654 -16.21634,3.7593 -2e-5,-10e-5 -4e-5,-10e-5 -6e-5,-10e-5 -4.22699,-7.0666 10.66945,-4.8946 9.50194,-12.8109 -1e-5,-10e-5 -1e-5,-10e-5 -2e-5,-10e-5 -1.19069,-8.0726 -16.10139,-0.3908 -15.38752,-8.5156 0,-1e-4 10e-6,-1e-4 10e-6,-1e-4 0.70017,-7.9674 15.35883,5.2644 18.97134,-2.0357 2e-5,-10e-5 3e-5,-10e-5 5e-5,-10e-5 3.68365,-7.4443 -13.3237,-8.9531 -8.195,-15.1327 2e-5,-10e-5 4e-5,-10e-5 6e-5,-10e-5 5.02939,-6.0599 8.95002,8.7731 16.03986,4.5305 3e-5,-10e-5 6e-5,-10e-5 9e-5,-10e-5 7.22964,-4.3264 -5.18661,-14.2526 2.79409,-16.1465 3e-5,-10e-5 7e-5,-10e-5 10e-5,-10e-5 7.82607,-1.8571 0.35189,14.9509 8.33539,15.877 3e-5,0 7e-5,0 1.1e-4,0 8.141,0.9442 5.41253,-16.2427 12.76076,-12.7862 3e-5,0 6e-5,0 9e-5,0 7.2058,3.3896 -6.92338,12.4177 -1.5979,18.4527 2e-5,0 5e-5,0 7e-5,0 5.4306,6.1539 10.70628,-11.168 14.87406,-4.025 1.1e-4,1e-4 2.1e-4,3e-4 3.2e-4,5e-4 4.08602,7.0041 -10.56845,6.1982 -9.3196,14.3739 3e-5,2e-4 7e-5,4e-4 1e-4,6e-4 1.27425,8.3361 17.01236,0.4295 15.384,8.5974 -4e-5,2e-4 -8e-5,4e-4 -1.3e-4,6e-4 -1.5975,8.0087 -16.04258,-7.1977 -19.15039,0.3894 -8e-5,2e-4 -1.7e-4,4e-4 -2.5e-4,6e-4 -3.16808,7.7367 14.05257,10.2066 8.19532,15.8823 0,0 0,0 0,0" />
        <path
           inkscape:connector-curvature="0"
           style="opacity:1;fill:#e03a00;fill-opacity:1;stroke:none;stroke-width:4.475;stroke-linejoin:round;stroke-miterlimit:4;stroke-opacity:1"
           id="path14133"
           d="m 375.46754,1622.1475 c -5.744,5.566 -6.7202,-10.399 -13.64448,-6.1173 -1.6e-4,10e-5 -3.1e-4,2e-4 -4.6e-4,3e-4 -7.06012,4.3665 2.1705,15.2167 -6.18432,16.2288 -7e-5,0 -1.4e-4,0 -2.1e-4,0 -8.19285,0.9924 2.9589,-13.3365 -5.13076,-14.4282 -1.8e-4,0 -3.6e-4,0 -5.4e-4,-1e-4 -8.24885,-1.1124 -7.34055,13.9347 -15.15235,10.9036 -7e-5,0 -1.4e-4,0 -2e-4,-10e-5 -7.66026,-2.9725 8.69593,-10.9526 3.12285,-16.9984 -5e-5,0 -1e-4,-10e-5 -1.5e-4,-10e-5 -5.68312,-6.1648 -11.90569,10.9655 -16.21627,3.7593 -4e-5,0 -8e-5,-10e-5 -1.1e-4,-2e-4 -4.22681,-7.0664 10.6695,-4.8945 9.50199,-12.8108 -1e-5,-10e-5 -2e-5,-10e-5 -3e-5,-2e-4 -1.19081,-8.0724 -16.10137,-0.3907 -15.38751,-8.5155 0,-10e-5 10e-6,-10e-5 2e-5,-2e-4 0.70028,-7.9672 15.35883,5.2646 18.97133,-2.0356 3e-5,-10e-5 6e-5,-10e-5 10e-5,-2e-4 3.68345,-7.4441 -13.32373,-8.9529 -8.19505,-15.1326 4e-5,0 9e-5,-10e-5 1.3e-4,-10e-5 5.02936,-6.0597 8.94998,8.7732 16.03979,4.5305 6e-5,0 1.3e-4,-1e-4 1.9e-4,-1e-4 7.22943,-4.3265 -5.18667,-14.2525 2.79399,-16.1465 7e-5,0 1.4e-4,0 2e-4,0 7.82591,-1.857 0.35183,14.9508 8.33529,15.8769 7e-5,0 1.4e-4,0 2.1e-4,0 8.14088,0.9441 5.41246,-16.2427 12.76066,-12.7862 6e-5,0 1.2e-4,10e-5 1.9e-4,10e-5 7.20557,3.3897 -6.92346,12.4177 -1.598,18.4526 5e-5,10e-5 9e-5,10e-5 1.4e-4,2e-4 5.43058,6.1536 10.70623,-11.1681 14.87399,-4.0252 9e-5,2e-4 1.8e-4,3e-4 2.7e-4,5e-4 4.0862,7.0042 -10.5684,6.1982 -9.31955,14.3739 3e-5,2e-4 5e-5,4e-4 8e-5,6e-4 1.27414,8.3363 17.01238,0.4295 15.38402,8.5974 -4e-5,2e-4 -7e-5,4e-4 -1e-4,5e-4 -1.5974,8.009 -16.0426,-7.1976 -19.15042,0.3895 -7e-5,2e-4 -1.4e-4,4e-4 -2.1e-4,5e-4 -3.16827,7.7368 14.05255,10.2067 8.19528,15.8824 0,0 0,0 0,0" />
        <path
           inkscape:connector-curvature="0"
           style="opacity:1;fill:#e65700;fill-opacity:1;stroke:none;stroke-width:4.475;stroke-linejoin:round;stroke-miterlimit:4;stroke-opacity:1"
           id="path14135"
           d="m 314.14101,1622.5557 c -5.744,5.566 -6.7202,-10.399 -13.64448,-6.1173 -1.3e-4,0 -2.5e-4,10e-5 -3.7e-4,2e-4 -7.06029,4.3664 2.17044,15.2168 -6.18441,16.2289 -1.1e-4,0 -2.1e-4,0 -3.2e-4,0 -8.19264,0.9922 2.95897,-13.3365 -5.13065,-14.4282 -1.5e-4,0 -2.9e-4,-10e-5 -4.3e-4,-10e-5 -8.24897,-1.1126 -7.34063,13.9347 -15.15246,10.9036 -1e-4,-10e-5 -2e-4,-10e-5 -3e-4,-10e-5 -7.66001,-2.9726 8.696,-10.9527 3.12295,-16.9984 -8e-5,-10e-5 -1.5e-4,-2e-4 -2.3e-4,-3e-4 -5.68309,-6.1645 -11.90563,10.9656 -16.21619,3.7595 -6e-5,-10e-5 -1.1e-4,-2e-4 -1.7e-4,-3e-4 -4.22662,-7.0664 10.66955,-4.8944 9.50205,-12.8107 -2e-5,-10e-5 -3e-5,-2e-4 -5e-5,-3e-4 -1.19092,-8.0722 -16.10135,-0.3906 -15.38749,-8.5154 1e-5,-10e-5 2e-5,-2e-4 3e-5,-3e-4 0.7004,-7.967 15.35884,5.2646 18.97132,-2.0355 5e-5,-10e-5 9e-5,-2e-4 1.4e-4,-3e-4 3.68326,-7.4441 -13.32374,-8.9529 -8.19509,-15.1325 6e-5,-10e-5 1.3e-4,-2e-4 1.9e-4,-3e-4 5.02933,-6.0594 8.94995,8.7733 16.03973,4.5307 9e-5,-10e-5 1.9e-4,-10e-5 2.8e-4,-2e-4 7.22923,-4.3265 -5.18673,-14.2525 2.7939,-16.1464 1e-4,-10e-5 2e-4,-10e-5 3.1e-4,-10e-5 7.82573,-1.8568 0.35175,14.9509 8.33518,15.877 1e-4,0 2.1e-4,0 3.2e-4,0 8.14074,0.9439 5.41238,-16.2427 12.76055,-12.7862 9e-5,0 1.9e-4,10e-5 2.8e-4,10e-5 7.20536,3.3897 -6.92352,12.4177 -1.59809,18.4526 7e-5,10e-5 1.4e-4,10e-5 2.1e-4,2e-4 5.43055,6.1534 10.70617,-11.1681 14.87392,-4.0252 7e-5,10e-5 1.4e-4,2e-4 2.1e-4,3e-4 4.08639,7.0043 -10.56835,6.1983 -9.31949,14.3741 2e-5,10e-5 4e-5,3e-4 6e-5,4e-4 1.27402,8.3365 17.01241,0.4296 15.38404,8.5976 -3e-5,10e-5 -6e-5,3e-4 -8e-5,4e-4 -1.5973,8.0091 -16.04261,-7.1976 -19.15044,0.3896 -6e-5,10e-5 -1.1e-4,2e-4 -1.7e-4,4e-4 -3.16846,7.7369 14.05253,10.2068 8.19524,15.8825 0,0 0,0 0,0" />
        <path
           inkscape:connector-curvature="0"
           style="opacity:1;fill:#ec7400;fill-opacity:1;stroke:none;stroke-width:4.475;stroke-linejoin:round;stroke-miterlimit:4;stroke-opacity:1"
           id="path14137"
           d="m 252.81448,1622.9638 c -5.74401,5.566 -6.7202,-10.399 -13.64448,-6.1173 -10e-5,10e-5 -1.9e-4,10e-5 -2.8e-4,2e-4 -7.06046,4.3664 2.17039,15.2168 -6.1845,16.2289 -1.4e-4,0 -2.9e-4,1e-4 -4.3e-4,1e-4 -8.19243,0.992 2.95904,-13.3366 -5.13054,-14.4283 -1.1e-4,0 -2.2e-4,0 -3.3e-4,0 -8.24908,-1.1128 -7.3407,13.9347 -15.15256,10.9035 -1.4e-4,0 -2.7e-4,-10e-5 -4e-4,-10e-5 -7.65977,-2.9726 8.69608,-10.9527 3.12304,-16.9984 -9e-5,-10e-5 -1.9e-4,-2e-4 -2.9e-4,-3e-4 -5.68308,-6.1643 -11.90558,10.9656 -16.21612,3.7595 -8e-5,-10e-5 -1.5e-4,-2e-4 -2.3e-4,-3e-4 -4.22643,-7.0663 10.66961,-4.8944 9.50211,-12.8107 -3e-5,-10e-5 -5e-5,-3e-4 -7e-5,-4e-4 -1.19103,-8.072 -16.10133,-0.3905 -15.38747,-8.5153 1e-5,-10e-5 2e-5,-2e-4 3e-5,-4e-4 0.70053,-7.9667 15.35885,5.2647 18.97132,-2.0354 6e-5,-10e-5 1.3e-4,-2e-4 1.9e-4,-4e-4 3.68306,-7.4439 -13.32377,-8.9528 -8.19515,-15.1324 9e-5,-10e-5 1.8e-4,-2e-4 2.7e-4,-3e-4 5.0293,-6.0593 8.94991,8.7734 16.03966,4.5307 1.3e-4,0 2.5e-4,-10e-5 3.8e-4,-2e-4 7.22902,-4.3265 -5.18679,-14.2524 2.7938,-16.1464 1.4e-4,0 2.7e-4,0 4.1e-4,-10e-5 7.82557,-1.8566 0.35169,14.9509 8.33508,15.877 1.4e-4,0 2.8e-4,10e-5 4.2e-4,10e-5 8.14062,0.9437 5.41231,-16.2427 12.76045,-12.7863 1.2e-4,10e-5 2.5e-4,10e-5 3.8e-4,2e-4 7.20513,3.3897 -6.9236,12.4176 -1.59819,18.4525 9e-5,10e-5 1.8e-4,2e-4 2.8e-4,4e-4 5.43053,6.1531 10.70612,-11.1682 14.87385,-4.0254 5e-5,10e-5 1e-4,2e-4 1.6e-4,3e-4 4.08656,7.0044 -10.56831,6.1983 -9.31944,14.3741 1e-5,10e-5 3e-5,2e-4 5e-5,4e-4 1.27389,8.3366 17.01243,0.4296 15.38405,8.5976 -2e-5,10e-5 -4e-5,2e-4 -6e-5,3e-4 -1.59719,8.0094 -16.04261,-7.1975 -19.15046,0.3897 -4e-5,10e-5 -8e-5,2e-4 -1.2e-4,3e-4 -3.16866,7.737 14.05251,10.2069 8.19519,15.8826 0,0 0,0 0,0" />
        <path
           inkscape:connector-curvature="0"
           style="opacity:1;fill:#f29100;fill-opacity:1;stroke:none;stroke-width:4.475;stroke-linejoin:round;stroke-miterlimit:4;stroke-opacity:1"
           id="path14139"
           d="m 191.48795,1623.372 c -5.74401,5.566 -6.7202,-10.399 -13.64448,-6.1173 -7e-5,0 -1.3e-4,10e-5 -1.9e-4,10e-5 -7.06063,4.3664 2.17033,15.2169 -6.18459,16.229 -1.8e-4,0 -3.6e-4,0 -5.4e-4,10e-5 -8.19223,0.9919 2.95912,-13.3366 -5.13044,-14.4283 -7e-5,0 -1.4e-4,0 -2.1e-4,0 -8.2492,-1.113 -7.34078,13.9347 -15.15267,10.9035 -1.7e-4,-10e-5 -3.4e-4,-10e-5 -5.1e-4,-2e-4 -7.65952,-2.9727 8.69616,-10.9526 3.12315,-16.9983 -1.2e-4,-1e-4 -2.4e-4,-3e-4 -3.7e-4,-4e-4 -5.68305,-6.1641 -11.90551,10.9656 -16.21604,3.7596 -1e-4,-2e-4 -1.9e-4,-3e-4 -2.8e-4,-5e-4 -4.22625,-7.0661 10.66965,-4.8943 9.50215,-12.8105 -2e-5,-2e-4 -5e-5,-4e-4 -7e-5,-5e-4 -1.19115,-8.0719 -16.10132,-0.3905 -15.38746,-8.5152 1e-5,-2e-4 3e-5,-4e-4 4e-5,-5e-4 0.70064,-7.9665 15.35886,5.2647 18.97131,-2.0353 8e-5,-2e-4 1.6e-4,-3e-4 2.4e-4,-5e-4 3.68286,-7.4439 -13.3238,-8.9527 -8.1952,-15.1323 1.1e-4,-10e-5 2.2e-4,-3e-4 3.3e-4,-4e-4 5.02927,-6.0591 8.94988,8.7734 16.0396,4.5308 1.6e-4,-10e-5 3.1e-4,-2e-4 4.7e-4,-3e-4 7.22883,-4.3265 -5.18685,-14.2524 2.79371,-16.1463 1.7e-4,-1e-4 3.4e-4,-1e-4 5.1e-4,-1e-4 7.8254,-1.8565 0.35162,14.9509 8.33498,15.877 1.7e-4,0 3.5e-4,0 5.3e-4,0 8.14048,0.9436 5.41224,-16.2426 12.76034,-12.7862 1.5e-4,10e-5 3.1e-4,10e-5 4.7e-4,2e-4 7.20492,3.3898 -6.92367,12.4176 -1.59829,18.4525 1.2e-4,1e-4 2.4e-4,3e-4 3.6e-4,4e-4 5.4305,6.1529 10.70607,-11.1683 14.87378,-4.0254 3e-5,0 7e-5,10e-5 1e-4,2e-4 4.08675,7.0045 -10.56825,6.1984 -9.31938,14.3742 1e-5,10e-5 2e-5,10e-5 3e-5,2e-4 1.27377,8.3368 17.01245,0.4298 15.38407,8.5978 -1e-5,1e-4 -3e-5,1e-4 -4e-5,2e-4 -1.59708,8.0096 -16.04262,-7.1974 -19.15048,0.3898 -3e-5,10e-5 -6e-5,10e-5 -8e-5,2e-4 -3.16886,7.737 14.05249,10.2069 8.19515,15.8827 0,0 0,0 0,0" />
        <path
           inkscape:connector-curvature="0"
           style="opacity:1;fill:#f8ae00;fill-opacity:1;stroke:none;stroke-width:4.475;stroke-linejoin:round;stroke-miterlimit:4;stroke-opacity:1"
           id="path14141"
           d="m 130.16141,1623.7801 c -5.744,5.566 -6.72019,-10.399 -13.64448,-6.1173 -3e-5,10e-5 -6e-5,10e-5 -9e-5,10e-5 -7.0608,4.3663 2.17028,15.2169 -6.18468,16.229 -2.2e-4,10e-5 -4.3e-4,10e-5 -6.4e-4,10e-5 -8.19203,0.9918 2.95918,-13.3366 -5.13034,-14.4283 -3e-5,0 -7e-5,0 -10e-5,0 -8.249318,-1.113 -7.340853,13.9347 -15.152785,10.9035 -2.01e-4,0 -4.01e-4,-10e-5 -6.01e-4,-2e-4 -7.659281,-2.9727 8.696233,-10.9526 3.123247,-16.9983 -1.48e-4,-10e-5 -2.97e-4,-3e-4 -4.46e-4,-4e-4 -5.683031,-6.1639 -11.905459,10.9657 -16.215971,3.7596 -1.11e-4,-10e-5 -2.21e-4,-3e-4 -3.32e-4,-5e-4 -4.226067,-7.066 10.669704,-4.8943 9.502211,-12.8105 -3.1e-5,-2e-4 -6.2e-5,-4e-4 -9.3e-5,-6e-4 -1.191261,-8.0717 -16.101294,-0.3904 -15.387444,-8.5151 1.8e-5,-2e-4 3.6e-5,-4e-4 5.5e-5,-6e-4 0.70076,-7.9663 15.358859,5.2649 18.971296,-2.0352 9.6e-5,-2e-4 1.92e-4,-3e-4 2.89e-4,-5e-4 3.682667,-7.4438 -13.323824,-8.9527 -8.195244,-15.1323 1.32e-4,-10e-5 2.63e-4,-3e-4 3.95e-4,-4e-4 5.029236,-6.0589 8.949844,8.7734 16.039532,4.5308 1.89e-4,-10e-5 3.78e-4,-2e-4 5.67e-4,-3e-4 7.228624,-4.3266 -5.186913,-14.2523 2.793614,-16.1463 2e-4,0 4.1e-4,-10e-5 6.1e-4,-10e-5 7.82524,-1.8563 0.35155,14.951 8.33488,15.877 2.1e-4,10e-5 4.2e-4,10e-5 6.4e-4,10e-5 8.14035,0.9434 5.41216,-16.2427 12.76023,-12.7863 1.9e-4,10e-5 3.7e-4,2e-4 5.6e-4,3e-4 7.20471,3.3898 -6.92374,12.4176 -1.59838,18.4524 1.5e-4,2e-4 2.9e-4,4e-4 4.3e-4,5e-4 5.43048,6.1527 10.70602,-11.1683 14.8737,-4.0255 2e-5,1e-4 4e-5,1e-4 6e-5,1e-4 4.08693,7.0046 -10.56821,6.1985 -9.31934,14.3743 1e-5,10e-5 2e-5,10e-5 2e-5,2e-4 1.27366,8.337 17.01248,0.4298 15.38409,8.5978 -1e-5,10e-5 -1e-5,10e-5 -2e-5,10e-5 -1.59698,8.0099 -16.04263,-7.1973 -19.1505,0.3899 -1e-5,10e-5 -3e-5,10e-5 -4e-5,10e-5 -3.16905,7.7372 14.05248,10.2071 8.1951,15.8828 0,0 0,0 0,0" />
      </g>
    </g>
  </g>
</svg>
