<?xml version="1.0" encoding="UTF-8" standalone="no"?>
<svg
   xmlns:dc="http://purl.org/dc/elements/1.1/"
   xmlns:cc="http://creativecommons.org/ns#"
   xmlns:rdf="http://www.w3.org/1999/02/22-rdf-syntax-ns#"
   xmlns:svg="http://www.w3.org/2000/svg"
   xmlns="http://www.w3.org/2000/svg"
   xmlns:xlink="http://www.w3.org/1999/xlink"
   xmlns:sodipodi="http://sodipodi.sourceforge.net/DTD/sodipodi-0.dtd"
   xmlns:inkscape="http://www.inkscape.org/namespaces/inkscape"
   sodipodi:docname="shapes-f08.svg"
   inkscape:version="1.0beta1 (a4ee55bc41, 2019-11-15)"
   sodipodi:version="0.32"
   id="svg3997"
   viewBox="0 0 300 114"
   height="114"
   width="300"
   version="1.1">
  <defs
     id="defs3">
    <linearGradient
       id="linearGradient2321">
      <stop
         id="stop2322"
         offset="0"
         style="stop-color:#e08f0d;stop-opacity:1;" />
      <stop
         id="stop2323"
         offset="1"
         style="stop-color:#e08f0d;stop-opacity:0;" />
    </linearGradient>
    <linearGradient
       gradientUnits="userSpaceOnUse"
       y2="-406.24228"
       x2="2389.061"
       y1="-406.24228"
       x1="2298.4407"
       gradientTransform="matrix(0.148969,-7.928818e-8,2.041633e-7,0.441755,2592.988,-3996.382)"
       id="linearGradient2324"
       xlink:href="#linearGradient2321"
       inkscape:collect="always" />
    <linearGradient
       id="linearGradient2317">
      <stop
         id="stop2318"
         offset="0"
         style="stop-color:#e08f0d;stop-opacity:1;" />
      <stop
         id="stop2319"
         offset="1"
         style="stop-color:#e08f0d;stop-opacity:0;" />
    </linearGradient>
    <linearGradient
       gradientUnits="userSpaceOnUse"
       y2="-750.32343"
       x2="1342.9664"
       y1="-750.32343"
       x1="1237.0406"
       gradientTransform="matrix(0.265008,-1.410491e-7,1.147669e-7,0.248324,2592.988,-3996.382)"
       id="linearGradient2320"
       xlink:href="#linearGradient2317"
       inkscape:collect="always" />
    <linearGradient
       id="linearGradient2313">
      <stop
         id="stop2314"
         offset="0"
         style="stop-color:#e08f0d;stop-opacity:1;" />
      <stop
         id="stop2315"
         offset="1"
         style="stop-color:#e08f0d;stop-opacity:0;" />
    </linearGradient>
    <linearGradient
       gradientUnits="userSpaceOnUse"
       y2="-923.98456"
       x2="1197.9237"
       y1="-923.98456"
       x1="1090.1497"
       gradientTransform="matrix(0.307909,-1.63882e-7,9.877614e-8,0.213725,2592.988,-3996.382)"
       id="linearGradient2316"
       xlink:href="#linearGradient2313"
       inkscape:collect="always" />
    <linearGradient
       id="linearGradient2309">
      <stop
         id="stop2310"
         offset="0"
         style="stop-color:#e08f0d;stop-opacity:1;" />
      <stop
         id="stop2311"
         offset="1"
         style="stop-color:#e08f0d;stop-opacity:0;" />
    </linearGradient>
    <linearGradient
       gradientUnits="userSpaceOnUse"
       y2="-506.85541"
       x2="2318.4165"
       y1="-506.85541"
       x1="2203.8625"
       gradientTransform="matrix(0.159096,-8.46779e-8,1.911677e-7,0.413636,2592.988,-3996.382)"
       id="linearGradient2312"
       xlink:href="#linearGradient2309"
       inkscape:collect="always" />
    <linearGradient
       id="linearGradient2305">
      <stop
         id="stop2306"
         offset="0"
         style="stop-color:#e08f0d;stop-opacity:1;" />
      <stop
         id="stop2307"
         offset="1"
         style="stop-color:#e08f0d;stop-opacity:0;" />
    </linearGradient>
    <linearGradient
       gradientUnits="userSpaceOnUse"
       y2="-754.11359"
       x2="1699.0203"
       y1="-754.11359"
       x1="1634.6169"
       gradientTransform="matrix(0.212049,-1.128628e-7,1.434289e-7,0.310341,2592.988,-3996.382)"
       id="linearGradient2308"
       xlink:href="#linearGradient2305"
       inkscape:collect="always" />
    <linearGradient
       id="linearGradient2301">
      <stop
         id="stop2302"
         offset="0"
         style="stop-color:#e08f0d;stop-opacity:1;" />
      <stop
         id="stop2303"
         offset="1"
         style="stop-color:#e08f0d;stop-opacity:0;" />
    </linearGradient>
    <linearGradient
       gradientUnits="userSpaceOnUse"
       y2="-699.84039"
       x2="1520.0875"
       y1="-699.84039"
       x1="1457.028"
       gradientTransform="matrix(0.247634,-1.318013e-7,1.228196e-7,0.265748,2592.988,-3996.382)"
       id="linearGradient2304"
       xlink:href="#linearGradient2301"
       inkscape:collect="always" />
    <linearGradient
       id="linearGradient2297">
      <stop
         id="stop2298"
         offset="0"
         style="stop-color:#e08f0d;stop-opacity:1;" />
      <stop
         id="stop2299"
         offset="1"
         style="stop-color:#e08f0d;stop-opacity:0;" />
    </linearGradient>
    <linearGradient
       gradientUnits="userSpaceOnUse"
       y2="-913.09082"
       x2="1034.4882"
       y1="-913.09082"
       x1="902.98676"
       gradientTransform="matrix(0.337024,-1.793832e-7,9.024314e-8,0.195262,2592.988,-3996.382)"
       id="linearGradient2300"
       xlink:href="#linearGradient2297"
       inkscape:collect="always" />
    <linearGradient
       id="linearGradient2293">
      <stop
         id="stop2294"
         offset="0"
         style="stop-color:#e08f0d;stop-opacity:1;" />
      <stop
         id="stop2295"
         offset="1"
         style="stop-color:#e08f0d;stop-opacity:0;" />
    </linearGradient>
    <linearGradient
       gradientUnits="userSpaceOnUse"
       y2="-613.84406"
       x2="1468.066"
       y1="-613.84406"
       x1="1403.6628"
       gradientTransform="matrix(0.212049,-1.128628e-7,1.434289e-7,0.310341,2592.988,-3996.382)"
       id="linearGradient2296"
       xlink:href="#linearGradient2293"
       inkscape:collect="always" />
    <linearGradient
       id="linearGradient2289">
      <stop
         id="stop2290"
         offset="0"
         style="stop-color:#e08f0d;stop-opacity:1;" />
      <stop
         id="stop2291"
         offset="1"
         style="stop-color:#e08f0d;stop-opacity:0;" />
    </linearGradient>
    <linearGradient
       gradientUnits="userSpaceOnUse"
       y2="-405.69092"
       x2="1847.2607"
       y1="-405.69092"
       x1="1751.0344"
       gradientTransform="matrix(0.170017,-9.049121e-8,1.78888e-7,0.387066,2592.988,-3996.382)"
       id="linearGradient2292"
       xlink:href="#linearGradient2289"
       inkscape:collect="always" />
    <linearGradient
       id="linearGradient2363">
      <stop
         id="stop2364"
         offset="0"
         style="stop-color:#1c3e8b;stop-opacity:1;" />
      <stop
         id="stop2365"
         offset="1"
         style="stop-color:#1c3e8b;stop-opacity:0;" />
    </linearGradient>
    <linearGradient
       gradientUnits="userSpaceOnUse"
       y2="2797.5332"
       x2="3752.344"
       y1="2797.5332"
       x1="3510.8435"
       gradientTransform="matrix(0.471219,-2.453493e-7,-2.617424e-8,0.530544,11864.54,11901.51)"
       id="linearGradient2366"
       xlink:href="#linearGradient2363"
       inkscape:collect="always" />
    <linearGradient
       id="linearGradient2359">
      <stop
         id="stop2360"
         offset="0"
         style="stop-color:#1c3e8b;stop-opacity:1;" />
      <stop
         id="stop2361"
         offset="1"
         style="stop-color:#1c3e8b;stop-opacity:0;" />
    </linearGradient>
    <linearGradient
       gradientUnits="userSpaceOnUse"
       y2="2131.1328"
       x2="4643.3325"
       y1="2131.1328"
       x1="4567.0376"
       gradientTransform="matrix(0.367977,-1.915944e-7,-3.351836e-8,0.679399,11965.28,11995.58)"
       id="linearGradient2362"
       xlink:href="#linearGradient2359"
       inkscape:collect="always" />
    <linearGradient
       id="linearGradient2355">
      <stop
         id="stop2356"
         offset="0"
         style="stop-color:#1c3e8b;stop-opacity:1;" />
      <stop
         id="stop2357"
         offset="1"
         style="stop-color:#1c3e8b;stop-opacity:0;" />
    </linearGradient>
    <linearGradient
       gradientUnits="userSpaceOnUse"
       y2="3355.886"
       x2="2930.7437"
       y1="3355.886"
       x1="2819.9553"
       gradientTransform="matrix(0.573292,-2.984954e-7,-2.15142e-8,0.436082,11833.63,11924.33)"
       id="linearGradient2358"
       xlink:href="#linearGradient2355"
       inkscape:collect="always" />
    <linearGradient
       id="linearGradient2347">
      <stop
         id="stop2348"
         offset="0"
         style="stop-color:#1c3e8b;stop-opacity:1;" />
      <stop
         id="stop2349"
         offset="1"
         style="stop-color:#1c3e8b;stop-opacity:0;" />
    </linearGradient>
    <linearGradient
       gradientUnits="userSpaceOnUse"
       y2="2637.3257"
       x2="3327.6196"
       y1="2637.3257"
       x1="3268.3347"
       gradientTransform="matrix(0.484667,-2.523513e-7,-2.5448e-8,0.515823,11864.54,11901.51)"
       id="linearGradient2350"
       xlink:href="#linearGradient2347"
       inkscape:collect="always" />
    <linearGradient
       gradientUnits="userSpaceOnUse"
       y2="3040.8999"
       x2="2679.741"
       y1="3040.8999"
       x1="2642.4226"
       gradientTransform="matrix(0.57632,-3.00072e-7,-2.140105e-8,0.433791,11864.54,11901.51)"
       id="linearGradient2346"
       xlink:href="#linearGradient2343"
       inkscape:collect="always" />
    <linearGradient
       id="linearGradient2351">
      <stop
         id="stop2352"
         offset="0"
         style="stop-color:#1c3e8b;stop-opacity:1;" />
      <stop
         id="stop2353"
         offset="1"
         style="stop-color:#1c3e8b;stop-opacity:0;" />
    </linearGradient>
    <linearGradient
       gradientUnits="userSpaceOnUse"
       y2="2983.051"
       x2="3164.0901"
       y1="2983.051"
       x1="3063.7444"
       gradientTransform="matrix(0.525523,-2.736232e-7,-2.346968e-8,0.475722,11845.87,11880.86)"
       id="linearGradient2354"
       xlink:href="#linearGradient2351"
       inkscape:collect="always" />
    <linearGradient
       id="linearGradient2343">
      <stop
         id="stop2344"
         offset="0"
         style="stop-color:#1c3e8b;stop-opacity:1;" />
      <stop
         id="stop2345"
         offset="1"
         style="stop-color:#1c3e8b;stop-opacity:0;" />
    </linearGradient>
    <linearGradient
       y2="3040.8999"
       x2="2679.741"
       y1="3040.8999"
       x1="2642.4226"
       gradientTransform="matrix(0.57632,-3.00072e-7,-2.14011e-8,0.433791,11834.73,11861.02)"
       gradientUnits="userSpaceOnUse"
       id="linearGradient5741"
       xlink:href="#linearGradient2343"
       inkscape:collect="always" />
    <linearGradient
       y2="-406.24228"
       x2="2389.061"
       y1="-406.24228"
       x1="2298.4407"
       gradientTransform="matrix(0.148969,-7.928818e-8,2.041633e-7,0.441755,2592.988,-3996.382)"
       gradientUnits="userSpaceOnUse"
       id="linearGradient4114"
       xlink:href="#linearGradient2321"
       inkscape:collect="always" />
    <linearGradient
       y2="-750.32343"
       x2="1342.9664"
       y1="-750.32343"
       x1="1237.0406"
       gradientTransform="matrix(0.265008,-1.410491e-7,1.147669e-7,0.248324,2592.988,-3996.382)"
       gradientUnits="userSpaceOnUse"
       id="linearGradient4116"
       xlink:href="#linearGradient2317"
       inkscape:collect="always" />
    <linearGradient
       y2="-923.98456"
       x2="1197.9237"
       y1="-923.98456"
       x1="1090.1497"
       gradientTransform="matrix(0.307909,-1.63882e-7,9.877614e-8,0.213725,2592.988,-3996.382)"
       gradientUnits="userSpaceOnUse"
       id="linearGradient4118"
       xlink:href="#linearGradient2313"
       inkscape:collect="always" />
    <linearGradient
       y2="-506.85541"
       x2="2318.4165"
       y1="-506.85541"
       x1="2203.8625"
       gradientTransform="matrix(0.159096,-8.46779e-8,1.911677e-7,0.413636,2592.988,-3996.382)"
       gradientUnits="userSpaceOnUse"
       id="linearGradient4120"
       xlink:href="#linearGradient2309"
       inkscape:collect="always" />
    <linearGradient
       y2="-754.11359"
       x2="1699.0203"
       y1="-754.11359"
       x1="1634.6169"
       gradientTransform="matrix(0.212049,-1.128628e-7,1.434289e-7,0.310341,2592.988,-3996.382)"
       gradientUnits="userSpaceOnUse"
       id="linearGradient4122"
       xlink:href="#linearGradient2305"
       inkscape:collect="always" />
    <linearGradient
       y2="-699.84039"
       x2="1520.0875"
       y1="-699.84039"
       x1="1457.028"
       gradientTransform="matrix(0.247634,-1.318013e-7,1.228196e-7,0.265748,2592.988,-3996.382)"
       gradientUnits="userSpaceOnUse"
       id="linearGradient4124"
       xlink:href="#linearGradient2301"
       inkscape:collect="always" />
    <linearGradient
       y2="-913.09082"
       x2="1034.4882"
       y1="-913.09082"
       x1="902.98676"
       gradientTransform="matrix(0.337024,-1.793832e-7,9.024314e-8,0.195262,2592.988,-3996.382)"
       gradientUnits="userSpaceOnUse"
       id="linearGradient4126"
       xlink:href="#linearGradient2297"
       inkscape:collect="always" />
    <linearGradient
       y2="-613.84406"
       x2="1468.066"
       y1="-613.84406"
       x1="1403.6628"
       gradientTransform="matrix(0.212049,-1.128628e-7,1.434289e-7,0.310341,2592.988,-3996.382)"
       gradientUnits="userSpaceOnUse"
       id="linearGradient4128"
       xlink:href="#linearGradient2293"
       inkscape:collect="always" />
    <linearGradient
       y2="-405.69092"
       x2="1847.2607"
       y1="-405.69092"
       x1="1751.0344"
       gradientTransform="matrix(0.170017,-9.049121e-8,1.78888e-7,0.387066,2592.988,-3996.382)"
       gradientUnits="userSpaceOnUse"
       id="linearGradient4130"
       xlink:href="#linearGradient2289"
       inkscape:collect="always" />
    <linearGradient
       y2="2797.5332"
       x2="3752.344"
       y1="2797.5332"
       x1="3510.8435"
       gradientTransform="matrix(0.471219,-2.453493e-7,-2.617424e-8,0.530544,11864.54,11901.51)"
       gradientUnits="userSpaceOnUse"
       id="linearGradient4132"
       xlink:href="#linearGradient2363"
       inkscape:collect="always" />
    <linearGradient
       y2="2131.1328"
       x2="4643.3325"
       y1="2131.1328"
       x1="4567.0376"
       gradientTransform="matrix(0.367977,-1.915944e-7,-3.351836e-8,0.679399,11965.28,11995.58)"
       gradientUnits="userSpaceOnUse"
       id="linearGradient4134"
       xlink:href="#linearGradient2359"
       inkscape:collect="always" />
    <linearGradient
       y2="3355.886"
       x2="2930.7437"
       y1="3355.886"
       x1="2819.9553"
       gradientTransform="matrix(0.573292,-2.984954e-7,-2.15142e-8,0.436082,11833.63,11924.33)"
       gradientUnits="userSpaceOnUse"
       id="linearGradient4136"
       xlink:href="#linearGradient2355"
       inkscape:collect="always" />
    <linearGradient
       y2="2637.3257"
       x2="3327.6196"
       y1="2637.3257"
       x1="3268.3347"
       gradientTransform="matrix(0.484667,-2.523513e-7,-2.5448e-8,0.515823,11864.54,11901.51)"
       gradientUnits="userSpaceOnUse"
       id="linearGradient4138"
       xlink:href="#linearGradient2347"
       inkscape:collect="always" />
    <linearGradient
       y2="3040.8999"
       x2="2679.741"
       y1="3040.8999"
       x1="2642.4226"
       gradientTransform="matrix(0.57632,-3.00072e-7,-2.140105e-8,0.433791,11864.54,11901.51)"
       gradientUnits="userSpaceOnUse"
       id="linearGradient4140"
       xlink:href="#linearGradient2343"
       inkscape:collect="always" />
    <linearGradient
       y2="2983.051"
       x2="3164.0901"
       y1="2983.051"
       x1="3063.7444"
       gradientTransform="matrix(0.525523,-2.736232e-7,-2.346968e-8,0.475722,11845.87,11880.86)"
       gradientUnits="userSpaceOnUse"
       id="linearGradient4142"
       xlink:href="#linearGradient2351"
       inkscape:collect="always" />
    <linearGradient
       y2="3040.8999"
       x2="2679.741"
       y1="3040.8999"
       x1="2642.4226"
       gradientTransform="matrix(0.57632,-3.00072e-7,-2.14011e-8,0.433791,11834.73,11861.02)"
       gradientUnits="userSpaceOnUse"
       id="linearGradient4144"
       xlink:href="#linearGradient2343"
       inkscape:collect="always" />
    <linearGradient
       y2="3040.8999"
       x2="2679.741"
       y1="3040.8999"
       x1="2642.4226"
       gradientTransform="matrix(0.57632027,-3.0007198e-7,-2.140112e-8,0.43379098,-1184.2987,-1141.1416)"
       gradientUnits="userSpaceOnUse"
       id="linearGradient4147"
       xlink:href="#linearGradient2343"
       inkscape:collect="always" />
    <linearGradient
       y2="2983.051"
       x2="3164.0901"
       y1="2983.051"
       x1="3063.7444"
       gradientTransform="matrix(0.52552325,-2.7362319e-7,-2.3469701e-8,0.47572198,-1173.1587,-1121.3016)"
       gradientUnits="userSpaceOnUse"
       id="linearGradient4150"
       xlink:href="#linearGradient2351"
       inkscape:collect="always" />
    <linearGradient
       y2="3040.8999"
       x2="2679.741"
       y1="3040.8999"
       x1="2642.4226"
       gradientTransform="matrix(0.57632027,-3.0007198e-7,-2.140107e-8,0.43379098,-1154.4887,-1100.6516)"
       gradientUnits="userSpaceOnUse"
       id="linearGradient4153"
       xlink:href="#linearGradient2343"
       inkscape:collect="always" />
    <linearGradient
       y2="2637.3257"
       x2="3327.6196"
       y1="2637.3257"
       x1="3268.3347"
       gradientTransform="matrix(0.48466723,-2.5235129e-7,-2.5448022e-8,0.51582297,-1154.4887,-1100.6516)"
       gradientUnits="userSpaceOnUse"
       id="linearGradient4156"
       xlink:href="#linearGradient2347"
       inkscape:collect="always" />
    <linearGradient
       y2="3355.886"
       x2="2930.7437"
       y1="3355.886"
       x1="2819.9553"
       gradientTransform="matrix(0.57329227,-2.9849538e-7,-2.151422e-8,0.43608198,-1185.3987,-1077.8316)"
       gradientUnits="userSpaceOnUse"
       id="linearGradient4159"
       xlink:href="#linearGradient2355"
       inkscape:collect="always" />
    <linearGradient
       y2="2131.1328"
       x2="4643.3325"
       y1="2131.1328"
       x1="4567.0376"
       gradientTransform="matrix(0.36797717,-1.9159439e-7,-3.3518396e-8,0.67939897,-1053.7486,-1006.5816)"
       gradientUnits="userSpaceOnUse"
       id="linearGradient4162"
       xlink:href="#linearGradient2359"
       inkscape:collect="always" />
    <linearGradient
       y2="2797.5332"
       x2="3752.344"
       y1="2797.5332"
       x1="3510.8435"
       gradientTransform="matrix(0.47121922,-2.4534929e-7,-2.6174262e-8,0.53054397,-1154.4887,-1100.6516)"
       gradientUnits="userSpaceOnUse"
       id="linearGradient4165"
       xlink:href="#linearGradient2363"
       inkscape:collect="always" />
    <linearGradient
       y2="-405.69092"
       x2="1847.2607"
       y1="-405.69092"
       x1="1751.0344"
       gradientTransform="matrix(0.17001708,-9.0491111e-8,1.7888818e-7,0.38706579,-548.7641,144.10559)"
       gradientUnits="userSpaceOnUse"
       id="linearGradient4168"
       xlink:href="#linearGradient2289"
       inkscape:collect="always" />
    <linearGradient
       y2="-613.84406"
       x2="1468.066"
       y1="-613.84406"
       x1="1403.6628"
       gradientTransform="matrix(0.2120491,-1.1286264e-7,1.4342907e-7,0.31034083,-548.7641,144.10559)"
       gradientUnits="userSpaceOnUse"
       id="linearGradient4171"
       xlink:href="#linearGradient2293"
       inkscape:collect="always" />
    <linearGradient
       y2="-913.09082"
       x2="1034.4882"
       y1="-913.09082"
       x1="902.98676"
       gradientTransform="matrix(0.33702416,-1.79383e-7,9.0243221e-8,0.19526189,-548.7641,144.10559)"
       gradientUnits="userSpaceOnUse"
       id="linearGradient4174"
       xlink:href="#linearGradient2297"
       inkscape:collect="always" />
    <linearGradient
       y2="-699.84039"
       x2="1520.0875"
       y1="-699.84039"
       x1="1457.028"
       gradientTransform="matrix(0.24763411,-1.3180113e-7,1.2281976e-7,0.26574786,-548.7641,144.10559)"
       gradientUnits="userSpaceOnUse"
       id="linearGradient4177"
       xlink:href="#linearGradient2301"
       inkscape:collect="always" />
    <linearGradient
       y2="-754.11359"
       x2="1699.0203"
       y1="-754.11359"
       x1="1634.6169"
       gradientTransform="matrix(0.2120491,-1.1286264e-7,1.4342907e-7,0.31034083,-548.7641,144.10559)"
       gradientUnits="userSpaceOnUse"
       id="linearGradient4180"
       xlink:href="#linearGradient2305"
       inkscape:collect="always" />
    <linearGradient
       y2="-506.85541"
       x2="2318.4165"
       y1="-506.85541"
       x1="2203.8625"
       gradientTransform="matrix(0.15909607,-8.4677804e-8,1.9116789e-7,0.41363578,-548.7641,144.10559)"
       gradientUnits="userSpaceOnUse"
       id="linearGradient4183"
       xlink:href="#linearGradient2309"
       inkscape:collect="always" />
    <linearGradient
       y2="-923.98456"
       x2="1197.9237"
       y1="-923.98456"
       x1="1090.1497"
       gradientTransform="matrix(0.30790914,-1.6388181e-7,9.8776235e-8,0.21372488,-548.7641,144.10559)"
       gradientUnits="userSpaceOnUse"
       id="linearGradient4186"
       xlink:href="#linearGradient2313"
       inkscape:collect="always" />
    <linearGradient
       y2="-750.32343"
       x2="1342.9664"
       y1="-750.32343"
       x1="1237.0406"
       gradientTransform="matrix(0.26500812,-1.4104892e-7,1.1476705e-7,0.24832386,-548.7641,144.10559)"
       gradientUnits="userSpaceOnUse"
       id="linearGradient4189"
       xlink:href="#linearGradient2317"
       inkscape:collect="always" />
    <linearGradient
       y2="-406.24228"
       x2="2389.061"
       y1="-406.24228"
       x1="2298.4407"
       gradientTransform="matrix(0.14896907,-7.9288097e-8,2.0416349e-7,0.44175476,-548.7641,144.10559)"
       gradientUnits="userSpaceOnUse"
       id="linearGradient4192"
       xlink:href="#linearGradient2321"
       inkscape:collect="always" />
  </defs>
  <sodipodi:namedview
     inkscape:window-maximized="0"
     inkscape:window-y="27"
     inkscape:window-x="54"
     inkscape:window-height="1053"
     inkscape:window-width="1866"
     inkscape:guide-bbox="true"
     showguides="true"
     units="px"
     showgrid="false"
     inkscape:document-rotation="0"
     inkscape:current-layer="layer1"
     inkscape:document-units="px"
     inkscape:cy="75"
     inkscape:cx="160"
     inkscape:zoom="1.4"
     inkscape:pageshadow="2"
     inkscape:pageopacity="0.0"
     borderopacity="1.0"
     bordercolor="#666666"
     pagecolor="#ffffff"
     id="base"
     inkscape:lockguides="true" />
  <metadata
     id="metadata4">
    <rdf:RDF>
      <cc:Work
         rdf:about="">
        <dc:format>image/svg+xml</dc:format>
        <dc:type
           rdf:resource="http://purl.org/dc/dcmitype/StillImage" />
        <dc:title />
      </cc:Work>
    </rdf:RDF>
  </metadata>
  <g
     id="layer1"
     inkscape:groupmode="layer"
     inkscape:label="Layer 1">
    <rect
       transform="matrix(0.98328669,0.18206394,-0.62938422,0.77709427,0,0)"
       rx="7.9945707"
       ry="7.9253578"
       y="26.204"
       x="46.692619"
       height="42.483524"
       width="14.215002"
       id="rect1001"
       style="color:#000000;opacity:0.27541;fill:#1c768b;fill-opacity:1;fill-rule:evenodd;stroke:none;stroke-width:0.0125;stroke-linecap:butt;stroke-linejoin:miter;stroke-miterlimit:4;stroke-dashoffset:0;stroke-opacity:1;marker:none;marker-start:none;marker-mid:none;marker-end:none" />
    <rect
       transform="matrix(0.98328669,0.18206394,-0.62938422,0.77709427,0,0)"
       rx="6.9707336"
       ry="7.925364"
       y="10.601472"
       x="67.379646"
       height="83.704872"
       width="13.941468"
       id="rect1002"
       style="color:#000000;opacity:0.27541;fill:#1c768b;fill-opacity:1;fill-rule:evenodd;stroke:none;stroke-width:0.0125;stroke-linecap:butt;stroke-linejoin:miter;stroke-miterlimit:4;stroke-dashoffset:0;stroke-opacity:1;marker:none;marker-start:none;marker-mid:none;marker-end:none" />
    <rect
       transform="matrix(0.98328669,0.18206394,-0.62938422,0.77709427,0,0)"
       rx="7.994566"
       ry="7.925364"
       y="-21.468819"
       x="87.731339"
       height="90.342201"
       width="15.751305"
       id="rect1003"
       style="color:#000000;opacity:0.27541;fill:#1c768b;fill-opacity:1;fill-rule:evenodd;stroke:none;stroke-width:0.0125;stroke-linecap:butt;stroke-linejoin:miter;stroke-miterlimit:4;stroke-dashoffset:0;stroke-opacity:1;marker:none;marker-start:none;marker-mid:none;marker-end:none" />
    <rect
       transform="matrix(0.98328669,0.18206394,-0.62938422,0.77709427,0,0)"
       rx="7.994566"
       ry="7.925364"
       y="-0.86165535"
       x="110.15408"
       height="69.735107"
       width="15.688386"
       id="rect1004"
       style="color:#000000;opacity:0.27541;fill:#1c768b;fill-opacity:1;fill-rule:evenodd;stroke:none;stroke-width:0.0125;stroke-linecap:butt;stroke-linejoin:miter;stroke-miterlimit:4;stroke-dashoffset:0;stroke-opacity:1;marker:none;marker-start:none;marker-mid:none;marker-end:none" />
    <rect
       transform="matrix(0.59704488,-0.80220784,-0.98591112,-0.16727002,0,0)"
       rx="7.9959278"
       ry="7.9131041"
       y="-128.98383"
       x="-64.835403"
       height="87.652527"
       width="12.887198"
       id="rect1005"
       style="color:#000000;opacity:0.27541;fill:#1c768b;fill-opacity:1;fill-rule:evenodd;stroke:none;stroke-width:0.0125;stroke-linecap:butt;stroke-linejoin:miter;stroke-miterlimit:4;stroke-dashoffset:0;stroke-opacity:1;marker:none;marker-start:none;marker-mid:none;marker-end:none" />
    <rect
       transform="matrix(0.59704488,-0.80220784,-0.98591112,-0.16727002,0,0)"
       rx="7.9959278"
       ry="7.9131041"
       y="-128.98383"
       x="-43.539253"
       height="87.652519"
       width="13.112827"
       id="rect1006"
       style="color:#000000;opacity:0.27541;fill:#1c768b;fill-opacity:1;fill-rule:evenodd;stroke:none;stroke-width:0.0125;stroke-linecap:butt;stroke-linejoin:miter;stroke-miterlimit:4;stroke-dashoffset:0;stroke-opacity:1;marker:none;marker-start:none;marker-mid:none;marker-end:none" />
    <rect
       transform="matrix(-0.99986954,-0.0161525,-0.76040741,-0.64944635,0,0)"
       y="-55.255356"
       x="-206.25278"
       height="39.812401"
       width="13.271339"
       id="rect1628"
       style="color:#000000;fill:url(#linearGradient4192);fill-opacity:1;fill-rule:evenodd;stroke:#000000;stroke-width:0.399351;stroke-linecap:butt;stroke-linejoin:miter;stroke-miterlimit:4;stroke-dashoffset:0;stroke-opacity:1;marker:none;marker-start:none;marker-mid:none;marker-end:none" />
    <rect
       transform="matrix(-0.99986954,-0.0161525,-0.76040741,-0.64944635,0,0)"
       y="-55.255356"
       x="-220.82408"
       height="26.084297"
       width="27.842894"
       id="rect1629"
       style="color:#000000;fill:url(#linearGradient4189);fill-opacity:1;fill-rule:evenodd;stroke:#000000;stroke-width:0.399351;stroke-linecap:butt;stroke-linejoin:miter;stroke-miterlimit:4;stroke-dashoffset:0;stroke-opacity:1;marker:none;marker-start:none;marker-mid:none;marker-end:none" />
    <rect
       transform="matrix(-0.99986954,-0.0161525,-0.76040741,-0.64944635,0,0)"
       y="-64.775848"
       x="-212.98277"
       height="22.814444"
       width="32.956345"
       id="rect1630"
       style="color:#000000;fill:url(#linearGradient4186);fill-opacity:1;fill-rule:evenodd;stroke:#000000;stroke-width:0.399351;stroke-linecap:butt;stroke-linejoin:miter;stroke-miterlimit:4;stroke-dashoffset:0;stroke-opacity:1;marker:none;marker-start:none;marker-mid:none;marker-end:none" />
    <rect
       transform="matrix(-0.99986954,-0.0161525,-0.76040741,-0.64944635,0,0)"
       y="-89.124954"
       x="-198.02327"
       height="47.163994"
       width="17.996771"
       id="rect1631"
       style="color:#000000;fill:url(#linearGradient4183);fill-opacity:1;fill-rule:evenodd;stroke:#000000;stroke-width:0.399351;stroke-linecap:butt;stroke-linejoin:miter;stroke-miterlimit:4;stroke-dashoffset:0;stroke-opacity:1;marker:none;marker-start:none;marker-mid:none;marker-end:none" />
    <rect
       transform="matrix(-0.99986954,-0.0161525,-0.76040741,-0.64944635,0,0)"
       y="-99.805603"
       x="-202.02864"
       height="19.767437"
       width="13.42842"
       id="rect1632"
       style="color:#000000;fill:url(#linearGradient4180);fill-opacity:1;fill-rule:evenodd;stroke:#000000;stroke-width:0.399351;stroke-linecap:butt;stroke-linejoin:miter;stroke-miterlimit:4;stroke-dashoffset:0;stroke-opacity:1;marker:none;marker-start:none;marker-mid:none;marker-end:none" />
    <rect
       transform="matrix(-0.99986954,-0.0161525,-0.76040741,-0.64944635,0,0)"
       y="-50.139641"
       x="-187.84114"
       height="16.538382"
       width="15.387305"
       id="rect1633"
       style="color:#000000;fill:url(#linearGradient4177);fill-opacity:1;fill-rule:evenodd;stroke:#000000;stroke-width:0.399351;stroke-linecap:butt;stroke-linejoin:miter;stroke-miterlimit:4;stroke-dashoffset:0;stroke-opacity:1;marker:none;marker-start:none;marker-mid:none;marker-end:none" />
    <rect
       transform="matrix(-0.99986954,-0.0161525,-0.76040741,-0.64944635,0,0)"
       y="-46.910149"
       x="-244.32118"
       height="25.457571"
       width="44.090965"
       id="rect1634"
       style="color:#000000;fill:url(#linearGradient4174);fill-opacity:1;fill-rule:evenodd;stroke:#000000;stroke-width:0.399351;stroke-linecap:butt;stroke-linejoin:miter;stroke-miterlimit:4;stroke-dashoffset:0;stroke-opacity:1;marker:none;marker-start:none;marker-mid:none;marker-end:none" />
    <rect
       transform="matrix(-0.99986954,-0.0161525,-0.76040741,-0.64944635,0,0)"
       y="-56.274399"
       x="-251.0033"
       height="19.767437"
       width="13.42842"
       id="rect1635"
       style="color:#000000;fill:url(#linearGradient4171);fill-opacity:1;fill-rule:evenodd;stroke:#000000;stroke-width:0.399351;stroke-linecap:butt;stroke-linejoin:miter;stroke-miterlimit:4;stroke-dashoffset:0;stroke-opacity:1;marker:none;marker-start:none;marker-mid:none;marker-end:none" />
    <rect
       transform="matrix(-0.99986954,-0.0161525,-0.76040741,-0.64944635,0,0)"
       y="-31.431652"
       x="-270.80069"
       height="37.026424"
       width="35.988609"
       id="rect2258"
       style="color:#000000;fill:url(#linearGradient4168);fill-opacity:1;fill-rule:evenodd;stroke:#000000;stroke-width:0.399352;stroke-linecap:butt;stroke-linejoin:miter;stroke-miterlimit:4;stroke-dashoffset:0;stroke-opacity:1;marker:none;marker-start:none;marker-mid:none;marker-end:none" />
    <rect
       transform="matrix(0.99446853,0.10503495,-0.99521205,0.09773932,0,0)"
       ry="7.8878307"
       rx="13.385939"
       y="319.77811"
       x="500.16495"
       height="127.64034"
       width="113.3167"
       id="rect2260"
       style="color:#000000;fill:url(#linearGradient4165);fill-opacity:1;fill-rule:evenodd;stroke:#000000;stroke-width:0.971766;stroke-linecap:butt;stroke-linejoin:miter;stroke-miterlimit:4;stroke-dashoffset:0;stroke-opacity:1;marker:none;marker-start:none;marker-mid:none;marker-end:none" />
    <rect
       transform="matrix(0.99446853,0.10503495,-0.99521205,0.09773932,0,0)"
       ry="7.8878508"
       rx="12.530851"
       y="415.66678"
       x="627.086"
       height="51.348541"
       width="27.589571"
       id="rect2261"
       style="color:#000000;fill:url(#linearGradient4162);fill-opacity:1;fill-rule:evenodd;stroke:#000000;stroke-width:0.971764;stroke-linecap:butt;stroke-linejoin:miter;stroke-miterlimit:4;stroke-dashoffset:0;stroke-opacity:1;marker:none;marker-start:none;marker-mid:none;marker-end:none" />
    <rect
       transform="matrix(0.99446853,0.10503495,-0.99521205,0.09773932,0,0)"
       ry="17.916412"
       rx="9.9613953"
       y="360.87869"
       x="454.6366"
       height="64.786018"
       width="33.879734"
       id="rect2262"
       style="color:#000000;fill:url(#linearGradient4159);fill-opacity:1;fill-rule:evenodd;stroke:#000000;stroke-width:0.971766;stroke-linecap:butt;stroke-linejoin:miter;stroke-miterlimit:4;stroke-dashoffset:0;stroke-opacity:1;marker:none;marker-start:none;marker-mid:none;marker-end:none" />
    <rect
       transform="matrix(0.99446853,0.10503495,-0.99521205,0.09773932,0,0)"
       ry="7.8878512"
       rx="12.636627"
       y="244.72928"
       x="429.83969"
       height="30.094517"
       width="28.248293"
       id="rect2263"
       style="color:#000000;fill:url(#linearGradient4156);fill-opacity:1;fill-rule:evenodd;stroke:#000000;stroke-width:0.971764;stroke-linecap:butt;stroke-linejoin:miter;stroke-miterlimit:4;stroke-dashoffset:0;stroke-opacity:1;marker:none;marker-start:none;marker-mid:none;marker-end:none" />
    <rect
       transform="matrix(0.99446853,0.10503495,-0.99521205,0.09773932,0,0)"
       ry="7.8878512"
       rx="10.936831"
       y="210.64627"
       x="368.6658"
       height="15.702374"
       width="21.021881"
       id="rect2264"
       style="color:#000000;fill:url(#linearGradient4153);fill-opacity:1;fill-rule:evenodd;stroke:#000000;stroke-width:0.971764;stroke-linecap:butt;stroke-linejoin:miter;stroke-miterlimit:4;stroke-dashoffset:0;stroke-opacity:1;marker:none;marker-start:none;marker-mid:none;marker-end:none" />
    <rect
       transform="matrix(0.99446853,0.10503495,-0.99521205,0.09773932,0,0)"
       ry="7.8878508"
       rx="13.385855"
       y="274.20877"
       x="437.19418"
       height="47.250496"
       width="52.249279"
       id="rect2259"
       style="color:#000000;fill:url(#linearGradient4150);fill-opacity:1;fill-rule:evenodd;stroke:#000000;stroke-width:0.971764;stroke-linecap:butt;stroke-linejoin:miter;stroke-miterlimit:4;stroke-dashoffset:0;stroke-opacity:1;marker:none;marker-start:none;marker-mid:none;marker-end:none" />
    <rect
       transform="matrix(0.99446853,0.10503495,-0.99521205,0.09773932,0,0)"
       ry="5.0297089"
       rx="4.8633003"
       y="174.40021"
       x="350.07108"
       height="11.478855"
       width="9.8363628"
       id="rect5740"
       style="color:#000000;fill:url(#linearGradient4147);fill-opacity:1;fill-rule:evenodd;stroke:#000000;stroke-width:0.971765;stroke-linecap:butt;stroke-linejoin:miter;stroke-miterlimit:4;stroke-dashoffset:0;stroke-opacity:1;marker:none;marker-start:none;marker-mid:none;marker-end:none" />
  </g>
</svg>
