Name,Equipment,Event,Sex,BirthDate,BodyweightKg,Age,Division,WeightClassKg,State,Team,Squat1Kg,Squat2Kg,Squat3Kg,Squat4Kg,Best3SquatKg,Bench1Kg,Bench2Kg,Bench3Kg,Bench4Kg,Best3BenchKg,Deadlift1Kg,Deadlift2Kg,Deadlift3Kg,Deadlift4Kg,Best3DeadliftKg,TotalKg,Place
Maria Ramos #1,Wraps,SBD,F,1990-04-20,46,24,Open,48,JY,Colosos Gym,120,135,-142.5,,135,50,55,-60,,55,115,130,135,,135,325,1
Fernanda Vaccaro,Wraps,SBD,F,1979-01-23,46.4,35,Open,48,CB,Soria,100,107.5,112.5,,112.5,47.5,-52.5,-52.5,,47.5,117.5,125,-132.5,,125,285,2
Veronica Garcia #2,Wraps,SBD,F,1976-08-31,51,37,Open,52,SC,La Bestia,105,112.5,-115,,112.5,65,70,75.5,,75.5,105,112.5,-117.5,,112.5,300.5,1
Fernanda Vaccaro,Wraps,SBD,F,1979-01-23,46.4,35,SubM,48,CB,Soria,100,107.5,112.5,,112.5,47.5,-52.5,-52.5,,47.5,117.5,125,-132.5,,125,285,1
Veronica Garcia #2,Wraps,SBD,F,1976-08-31,51,37,SubM,52,SC,La Bestia,105,112.5,-115,,112.5,65,70,75.5,,75.5,105,112.5,-117.5,,112.5,300.5,1
Sandra Pagliariche,Wraps,SBD,F,1987-04-04,56,27,Open,56,BA,SpinardiTeam,135,145.5,155,,155,80,85,92.5,,92.5,117.5,125,-132.5,,125,372.5,1
Macarena Bracco,Wraps,SBD,F,1988-03-03,63.3,26,Open,67.5,BA,Indiana,120,127.5,132.5,,132.5,57.5,60,62.5,,62.5,120,130,135,,135,330,1
Lorena Pareja,Wraps,SBD,F,1982-11-06,67,31,Open,67.5,SC,La Bestia,105,115,120,,120,55,60,-62.5,,60,105,120,145,,145,325,2
Yanina Vera,Wraps,SBD,F,1989-01-14,67.6,25,Open,75,BA,Indiana,65,72.5,-77.5,,72.5,37.5,40,-42.5,,40,80,90,95,,95,207.5,1
Maria Batallanes,Multi-ply,SBD,F,1997-03-29,66.3,17,Tn 16-17,67.5,JY,Titos Gym,60,-100,100,,100,40,55,65,,65,70,85,-100,,85,250,1
Alicia Hernandez,Multi-ply,SBD,F,1976-02-02,77,38,Open,82.5,SA,Amino Gym,-200,200,-215,,200,100,112.5,120,,120,140,-165,165,,165,485,1
Leonel Ledesma,Multi-ply,SBD,M,1995-04-25,60,19,Tn 18-19,60,JY,Titos Gym,130,145,-170,,145,65,70,80,,80,170,180,195,,195,420,1
Dario Navarro,Wraps,SBD,M,1997-05-30,73.4,17,Tn 16-17,75,BA,F Sagrado,140,145,150,,150,70,75,-80,,75,150,160,165,,165,390,1
Fabio Rodriguez,Wraps,SBD,M,1996-07-26,65.2,17,Tn 16-17,67.5,BA,F Sagrado,150,-165,170,,170,90,100,105,,105,-135,135,145,,145,420,1
Ezequiel Mosquera,Wraps,SBD,M,1994-10-05,74,19,Tn 18-19,75,SC,La Bestia,190,205.5,-210,,205.5,95,102.5,107.5,,107.5,175,190,200,,200,513,1
Fernando Soria,Wraps,SBD,M,1993-08-08,69.7,20,Jun,75,BA,NeoFitnnes,-150,-155,-155,,,,,,,,,,,,,,DQ
Jose Salgado,Wraps,SBD,M,1993-08-10,72.7,20,Open,75,NQ,NeoSport,235,250,260,-266,260,125,-135,,,125,235,-245,245,,245,630,1
Jose Salgado,Wraps,SBD,M,1993-08-10,72.7,20,Jun,75,NQ,NeoSport,235,250,260,-266,260,125,-135,,,125,235,-245,245,,245,630,1
Hernan Silva,Wraps,SBD,M,1987-12-06,59.8,26,Open,60,BA,SportsGym,120,137.5,146,,146,90,100,105,,105,160,170,180,,180,431,1
Gabriel Garrido,Multi-ply,SBD,M,1984-08-14,66.8,29,Open,67.5,SL,Pringles,190,-200,202.5,,202.5,102.5,110,-117.5,,110,195,202.5,210,,210,522.5,1
Martin Mattos,Multi-ply,SBD,M,1980-09-27,65.5,33,Open,67.5,JY,MEF,180,200,210,,210,100,-110,110,,110,180,-200,200,,200,520,2
Santiago Minciacca,Multi-ply,SBD,M,1990-01-22,74.4,24,Open,75,CB,Soria,260,280,-292.5,,280,-192.5,192.5,-200,,192.5,255,-270,-270,,255,727.5,1
Aldo Pirantonelli,Multi-ply,SBD,M,1966-06-07,67,48,M 45-49,67.5,CB,Soria,150,165,-175,,165,87.5,95,-100,,95,170,185,-195,,185,445,1
Raul Amil,Wraps,SBD,M,1963-01-05,74.1,51,M 50-54,75,BA,SpinardiTeam,-170,-170,170,,170,100,,,,100,175,185,195,,195,465,1
Jose Mata,Multi-ply,SBD,M,1941-04-29,62.9,73,M 70-74,67.5,BA,Vulcano,120,130,135,,135,70,75,-80,,75,130,145,155,,155,365,1
Pablo Correa,Wraps,SBD,M,1986-04-15,88.6,28,Open,90,CB,SpinardiTeam,170,-180,-180,,170,100,110,117.5,,117.5,185,200,210,,210,497.5,4
Agustin Lupidi,Multi-ply,SBD,M,1997-09-16,91.9,16,Tn 16-17,100,CB,Soria,195,210,-220,,210,100,110,115,,115,155,165,175,,175,500,1
Lucas Diosquez,Wraps,SBD,M,1990-02-24,86.5,24,Open,90,JY,MEF,225,-245,-260,,225,155,-165,165,,165,-220,220,235,,235,625,3
Cristian Centeno,Multi-ply,SBD,M,1991-11-12,80.9,22,Jun,82.5,JY,MEF,230,250,-270,,250,120,-150,150,,150,230,-240,-240,,230,630,1
Francis Vilte,Wraps,SBD,M,1996-03-06,75.9,18,Open,82.5,SC,La Bestia,190,200,-205,,200,-90,-90,-90,,,,,,,,,DQ
Francis Vilte,Wraps,SBD,M,1996-03-06,75.9,18,Tn 18-19,82.5,SC,La Bestia,190,200,-205,,200,-90,-90,-90,,,,,,,,,DQ
Fredy Vedia,Wraps,SBD,M,1989-08-03,79.5,24,Open,82.5,SC,La Bestia,180,190,195,,195,100,115,122.5,,122.5,190,205,210,,210,527.5,1
Sergio Barrientos,Multi-ply,SBD,M,1978-09-03,82.1,35,SubM,82.5,SL,Pringles,220,230,240,,240,165,175,-185,,175,200,210,217.5,,217.5,632.5,1
Martin Amaya,Wraps,SBD,M,1984-12-01,84.1,29,Open,90,BA,NeoFitnnes,200,-220,220,,220,160,170,-175,,170,210,230,240,,240,630,2
Yonathan Rondon,Wraps,SBD,M,1989-08-04,86.6,24,Open,90,BA,Indiana,265,-275,-275,,265,160,170,175,,175,260,270,280,-285,280,720,1
Erik Mateyka,Multi-ply,SBD,M,1993-06-13,86.5,21,Open,90,BA,Indiana,265,275,280,,280,-185,-185,185,,185,250,-265,-275,,250,715,2
Erik Mateyka,Multi-ply,SBD,M,1993-06-13,86.5,21,Jun,90,BA,Indiana,265,275,280,,280,-185,-185,185,,185,250,-265,-275,,250,715,1
Matias Flores,Multi-ply,SBD,M,1985-05-04,89,29,Open,90,JY,MEF,270,-290,300.5,,300.5,160,172.5,182.5,,182.5,250,265,-275,,265,748,1
Luis Comelli,Multi-ply,SBD,M,1942-04-30,88.8,72,M 70-74,90,BA,Comellli,-130,-130,130,,130,80,-92.5,-92.5,,80,140,150,160,,160,370,1
Franco Ruiz,Wraps,SBD,M,1995-12-16,106.3,18,Tn 18-19,110,JY,MEF,-190,190,-210,,190,-115,115,125,,125,190,200,210,,210,525,1
Pablo Perin,Multi-ply,SBD,M,1994-07-07,93.4,19,Tn 18-19,100,CB,Soria,190,210,225,,225,140,150,-165,,150,185,200,210,,210,585,1
Franco Carreras,Wraps,SBD,M,1993-01-08,106.6,21,Jun,110,CB,Olympia,225,235,-250,,235,120,130,140,,140,220,-230,230,,230,605,1
Juan Corvalan,Wraps,SBD,M,1972-06-20,89.1,41,M 40-44,90,BA,NeoFitnnes,170,190,-200,,190,120,-130,130,,130,180,190,200,,200,520,1
Augusto Ramos,Wraps,SBD,M,1969-04-09,96.6,45,M 45-49,100,JY,MEF,150,170,-190,,170,100,120,135,,135,150,170,185,,185,490,2
Sergio Cousau,Multi-ply,SBD,M,1964-03-16,89.4,50,M 50-54,90,BA,Vulcano,180,200,205,,205,90,95,100,,100,180,202.5,210,,210,515,1
Cesar Castaño,Multi-ply,SBD,M,1964-12-05,93.4,49,M 45-49,100,JY,MEF,250,270,280.5,,280.5,90,100,,,100,250,-270,-270,,250,630.5,1
Antonio Liendo,Multi-ply,SBD,M,1966-04-22,106.3,48,M 45-49,110,CB,Olimpus,-180,190,200,,200,150,160,-170,,160,190,200,-210,,200,560,1
Júlio Chavez #1,Wraps,SBD,M,1952-08-19,87.2,61,M 60-64,90,CB,Chavez,140,160,-175,,160,75,80,85,,85,190,-210,,,190,435,1
Leandro Fernandez #2,Wraps,SBD,M,1939-03-10,107.3,75,M 75-79,110,CB,Soria,107.5,-117.5,117.5,,117.5,107.5,115,-122.5,,115,175,190,-205,,190,422.5,1
Gabriel Reynoso,Wraps,SBD,M,1971-10-17,116.9,42,M 40-44,125,BA,Vulcano,-110,110,130,150.5,130,75,85,95,,95,140,165,175,,175,400,1
Hector Kloster,Wraps,SBD,M,1977-09-04,85.2,36,SubM,90,BA,Vulcano,140,155,-165,,155,90,100,102.5,,102.5,175,195,205,,205,462.5,1
Ramiro Chavez,Wraps,SBD,M,1997-12-24,98.1,16,Tn 16-17,100,JY,MEF,150,170,190.5,,190.5,100,115,120,,120,200,220,240,,240,550.5,1
Oscar Soria,Multi-ply,SBD,M,1948-02-02,151,66,M 65-69,140+,CB,Soria,110,120,130,,130,-100,100,120,,120,120,140,150,,150,400,1
Gustavo Coronel,Wraps,SBD,M,1967-09-29,100,46,M 45-49,100,CB,Soria,170,185,,,185,95,105,110,,110,180,,,,180,475,3
Javier Villaverde,Wraps,SBD,M,1969-03-11,99.3,45,M 45-49,100,BA,Indiana,230,240,250,,250,150,157.5,-162.5,,157.5,250,257.5,265,,265,672.5,1
Javier Villaverde,Wraps,SBD,M,1969-03-11,99.3,45,Open,100,BA,Indiana,230,240,250,,250,150,157.5,-162.5,,157.5,250,257.5,265,,265,672.5,2
Ramiro Mosquera,Wraps,SBD,M,1979-01-26,97,35,Open,100,SC,La Bestia,270,280,292.5,,292.5,145,155,162.5,,162.5,240,250,260,,260,715,1
Martin Cousau,Wraps,SBD,M,1987-03-04,94.5,27,Open,100,BA,Vulcano,150,165,180,,180,95,102.5,-110,,102.5,197.5,205,215,,215,497.5,3
Elvio Tolaba,Wraps,SBD,M,1980-04-13,111.3,34,Open,125,BA,Vulcano,200,220,235,,235,130,142.5,-145,,142.5,210,230,-262.5,,230,607.5,2
Mario Reyna,Wraps,SBD,M,1978-11-25,100.1,35,Open,110,CB,LyM,210,220,230,,230,135,142.5,150,,150,230,245,255,,255,635,2
Dalmiro Mutal,Wraps,SBD,M,1988-08-26,107.1,25,Open,110,BA,SpinardiTeam,185,195,-205,,195,115,-125,,,115,190,200,215,,215,525,3
Facundo Soria,Multi-ply,SBD,M,1991-03-28,109.3,23,Open,110,CB,Soria,335,350.5,-362.5,,350.5,230,240,-245,,240,300,-320,-320,,300,890.5,1
Facundo Soria,Multi-ply,SBD,M,1991-03-28,109.3,23,Jun,110,CB,Soria,335,350.5,-362.5,,350.5,230,240,-245,,240,300,-320,-320,,300,890.5,1
Andres Hugo,Multi-ply,SBD,M,1979-12-26,105.1,34,Open,110,NQ,Power Gym,-330,-330,-355,,,,,,,,,,,,,,DQ
Juan Manavella,Multi-ply,SBD,M,1977-12-15,105.5,36,SubM,110,BA,Soria,295,310,325,,325,140,150,160,,160,265,280,-300,,280,765,1
Enrique Barrionuevo,Wraps,SBD,M,1968-11-01,109.8,45,M 45-49,110,BA,Vulcano,260.5,-280,-280,,260.5,140,160,170,,170,-220,-220,-220,,,,DQ
Eloy Gonzalez,Wraps,SBD,M,1989-04-10,108.3,25,Open,110,SC,La Bestia,250,265,275,,275,155,165,-175,,165,100,250,282.5,,282.5,722.5,1
Pablo Perfetti,Wraps,SBD,M,1980-02-28,113.5,34,Open,125,BA,SpinardiTeam,-245,250,260,,260,130,-140,,,130,245,260,280,,280,670,1
Claudio Maidana,Multi-ply,SBD,M,1972-12-02,119.6,41,M 40-44,125,CB,Soria,290,300,310,,310,140,150,-160,,150,220,240,250,,250,710,1
Natalia Morales,Raw,B,F,1989-09-09,51.8,24,Open,52,RN,,,,,,,35,37.5,40,,40,,,,,,40,1
Alicia Hernandez,Multi-ply,B,F,1976-12-02,75.7,37,Open,82.5,SA,Amino Gym,,,,,,100,-110,112.5,,112.5,,,,,,112.5,1
Ezequiel De Simone,Raw,B,M,1997-07-07,73.8,16,Tn 16-17,75,BA,Power Unidos,,,,,,75,-80,80,,80,,,,,,80,1
Nahuel Montero,Raw,B,M,1994-11-26,66,19,Tn 18-19,67.5,BA,F Sagrado,,,,,,70,72.5,75,,75,,,,,,75,1
Ruben Reynoso,Multi-ply,B,M,1997-12-06,69.8,16,Tn 16-17,75,BA,Vulcano,,,,,,90,105,115,-120,115,,,,,,115,1
Guillermo Amodeo,Multi-ply,B,M,1973-09-30,58.2,40,Open,60,BA,SportsGym,,,,,,92.5,97.5,100,-102.5,100,,,,,,100,1
Guillermo Amodeo,Multi-ply,B,M,1973-09-30,58.2,40,M 40-44,60,BA,SportsGym,,,,,,92.5,97.5,100,-102.5,100,,,,,,100,1
Rodolfo Godooy,Raw,B,M,1962-07-04,67.3,51,M 50-54,67.5,BA,Vet Merlo,,,,,,90,95,-100,,95,,,,,,95,1
Marcos Villagra,Multi-ply,B,M,1985-10-12,67.3,28,Open,67.5,RN,,,,,,,130,140,142.5,,142.5,,,,,,142.5,1
Cristian Albornoz,Raw,B,M,1980-10-18,75,33,Open,75,CB,Elite,,,,,,120,127.5,130,,130,,,,,,130,3
David Coronel,Raw,B,M,1986-12-15,68,27,Open,75,BA,F Sagrado,,,,,,130,140,142.5,,142.5,,,,,,142.5,2
Gaston Montagna,Raw,B,M,1973-02-10,74.9,41,Open,75,BA,SpinardiTeam,,,,,,135,145,150,-155.5,150,,,,,,150,1
Gaston Montagna,Raw,B,M,1973-02-10,74.9,41,M 40-44,75,BA,SpinardiTeam,,,,,,135,145,150,-155.5,150,,,,,,150,1
Carlos Porta,Raw,B,M,1933-04-29,88.1,81,M 80+,90,CB,Chavez,,,,,,90,95,,,95,,,,,,95,1
Antonio Zani,Multi-ply,B,M,1942-01-17,84.5,72,M 70-74,90,BA,F Sagrado,,,,,,75,80,85,,85,,,,,,85,1
Hernan Silva,Raw,B,M,1987-12-06,59.9,26,Open,60,BA,SportsGym,,,,,,90,100,105,107.5,105,,,,,,105,1
Mario Bianchi,Raw,B,M,1969-09-05,67,44,M 40-44,67.5,CB,Soria,,,,,,120,-127.5,-127.5,,120,,,,,,120,1
Osvaldo Dunda,Raw,B,M,1937-07-15,75,76,M 75-79,75,CB,Soria,,,,,,40,45,50,,50,,,,,,50,1
Jonathan Cativelli,Multi-ply,B,M,1992-11-18,87.4,21,Jun,90,CB,Soria,,,,,,125,135,140,,140,,,,,,140,1
Marcelo Carrizo,Raw,B,M,1978-06-05,81.8,36,Open,82.5,RN,Performance,,,,,,120,130,-140,,130,,,,,,130,2
Marcelo Carrizo,Raw,B,M,1978-06-05,81.8,36,SubM,82.5,RN,Performance,,,,,,120,130,-140,,130,,,,,,130,1
Leandro Fainburg,Raw,B,M,1987-06-03,80.8,27,Open,82.5,BA,Enna Gym,,,,,,175,186,-190,,186,,,,,,186,1
Sergio Barrientos,Multi-ply,B,M,1978-09-03,81.5,35,SubM,82.5,SL,Pringles,,,,,,160,172.5,180,,180,,,,,,180,1
Daniel Aramburu,Multi-ply,B,M,1978-02-27,81.7,36,Open,82.5,RN,Performance,,,,,,160,-170,170,,170,,,,,,170,1
Daniel Aramburu,Multi-ply,B,M,1978-02-27,81.7,36,SubM,82.5,RN,Performance,,,,,,160,-170,170,,170,,,,,,170,2
Renato Arrroyo,Raw,B,M,1985-04-09,83.9,29,Open,90,RN,Performance,,,,,,120,130,140,,140,,,,,,140,2
Roque Gallardo,Raw,B,M,1972-03-01,81.4,42,M 40-44,82.5,CB,Elite,,,,,,107.5,115,117.5,,117.5,,,,,,117.5,1
Sergio Tomasoni,Raw,B,M,1969-12-27,87.3,44,M 40-44,90,BA,Vulcano,,,,,,160,170,-172.5,,170,,,,,,170,1
Jorge Silva,Multi-ply,B,M,1968-06-26,89.2,45,M 45-49,90,RN,RAM,,,,,,195,-205,205,-210,205,,,,,,205,1
Aquiles Paredes,Raw,B,M,1956-01-02,87.7,58,M 55-59,90,RN,RAM,,,,,,135,145,-150,,145,,,,,,145,1
Lucas Basualdo,Raw,B,M,,89,,ParaOl,90,CB,Soria,,,,,,100,117.5,120,,120,,,,,,120,1
Nicolas Salcedo,Multi-ply,B,M,1986-08-12,73.9,27,Open,75,RN,RAM,,,,,,167.5,-170,-170,,167.5,,,,,,167.5,3
Alejandro Gómez,Multi-ply,B,M,1977-05-01,73.6,37,SubM,75,BA,Gym 10,,,,,,-170,180,-192.5,,180,,,,,,180,1
Serafin de Simone,Multi-ply,B,M,1970-02-28,72.8,44,Open,75,BA,Power Unidos,,,,,,180,192.5,-195,,192.5,,,,,,192.5,1
Alejandro Gómez,Multi-ply,B,M,1977-05-01,73.6,37,Open,75,BA,Gym 10,,,,,,-170,180,-192.5,,180,,,,,,180,2
Serafin de Simone,Multi-ply,B,M,1970-02-28,72.8,44,M 40-44,75,BA,Power Unidos,,,,,,180,192.5,-195,,192.5,,,,,,192.5,1
Lucas Gareca,Raw,B,M,1995-06-05,93.7,19,Tn 18-19,100,BA,F Sagrado,,,,,,130,140,-145,,140,,,,,,140,1
Fernando Godoy,Multi-ply,B,M,1990-06-11,96.4,24,Open,100,CB,Soria,,,,,,130,-140,140,,140,,,,,,140,3
Andres Manrrique,Multi-ply,B,M,1977-03-31,88.6,37,Open,90,RN,RAM,,,,,,225,238,-245,,238,,,,,,238,1
Emiliano Barrionuevo,Raw,B,M,1991-12-24,91.5,22,Open,100,BA,Vulcano,,,,,,170,180,-185,,180,,,,,,180,1
Andres Manrrique,Multi-ply,B,M,1977-03-31,88.6,37,SubM,90,RN,RAM,,,,,,225,238,-245,,238,,,,,,238,1
Emiliano Barrionuevo,Raw,B,M,1991-12-24,91.5,22,Jun,100,BA,Vulcano,,,,,,170,180,-185,,180,,,,,,180,1
Hernan Camara,Raw,B,M,1985-07-24,99.9,28,Open,100,BA,Indiana,,,,,,165,172.5,-182.5,,172.5,,,,,,172.5,2
Mariano Miravalles,Multi-ply,B,M,1980-10-24,100,33,Open,100,BA,SportsGym,,,,,,190,212.5,217.5,220,217.5,,,,,,217.5,1
Maximiliano Gomez,Raw,B,M,1997-08-13,104.4,16,Open,110,RN,Performance,,,,,,80,90,-95,,90,,,,,,90,3
Maximiliano Gomez,Raw,B,M,1997-08-13,104.4,16,Tn 16-17,110,RN,Performance,,,,,,80,90,-95,,90,,,,,,90,1
Jose Garcia #21,Raw,B,M,1980-01-07,107.1,34,Open,110,SA,Atlhetic,,,,,,160,170,-180,,170,,,,,,170,2
Edgardo Bianchi,Raw,B,M,1984-09-21,103.4,29,Open,110,BA,SportsGym,,,,,,160,170,-172.5,,170,,,,,,170,1
Nicolas Pato,Multi-ply,B,M,1984-04-16,109.3,30,Open,110,BA,Vulcano,,,,,,230,240,-252.5,,240,,,,,,240,1
Adrian Lopez #3,Raw,B,M,1986-08-07,113.9,27,Open,125,BA,Vulcano,,,,,,160,170,,,170,,,,,,170,1
Gabriel Lopez #1,Multi-ply,B,M,1977-03-06,114.5,37,Open,125,BA,Vulcano,,,,,,170,-180,-190,,170,,,,,,170,2
Gabriel Lopez #1,Multi-ply,B,M,1977-03-06,114.5,37,SubM,125,BA,Vulcano,,,,,,170,-180,-190,,170,,,,,,170,1
Diego Hernandez,Raw,B,M,1981-10-15,125.7,32,Open,140,BA,Vulcano,,,,,,160,175,-185,,175,,,,,,175,1
Antonio Rosales,Multi-ply,B,M,1978-09-03,126.5,35,Open,140,RN,Performance,,,,,,190,200,210,,210,,,,,,210,1
Nestor Gonzalez #1,Multi-ply,B,M,1970-03-06,118.3,44,Open,125,BA,Vulcano,,,,,,160,175,180,,180,,,,,,180,1
Lisandro Pascuale,Multi-ply,B,M,1968-01-07,100.3,46,Open,110,BA,Vulcano,,,,,,145,165,-175,,165,,,,,,165,3
Daniel Matamala,Multi-ply,B,M,1964-12-01,98.5,49,Open,100,NQ,,,,,,,165,175,-180,,175,,,,,,175,2
Jose Naulle,Multi-ply,B,M,1963-09-02,103.6,50,Open,110,BA,Vulcano,,,,,,170,185,-192.5,,185,,,,,,185,2
Daniel Giacobone,Multi-ply,B,M,1952-01-05,103.2,62,Open,110,BA,Indiana,,,,,,145,-155,155,,155,,,,,,155,4
Eldo Galvan,Raw,B,M,1962-12-24,89.9,51,Open,90,,Vet Merlo,,,,,,153,-155,,,153,,,,,,153,1
Amado Monzon,Raw,B,M,1962-05-08,107.6,52,Open,110,,Vet Merlo,,,,,,-130,,,,,,,,,,,DQ
Antonio Rosales,Multi-ply,B,M,1978-09-03,126.5,35,SubM,140,RN,Performance,,,,,,190,200,210,,210,,,,,,210,1
Nestor Gonzalez #1,Multi-ply,B,M,1970-03-06,118.3,44,M 40-44,125,BA,Vulcano,,,,,,160,175,180,,180,,,,,,180,1
Lisandro Pascuale,Multi-ply,B,M,1968-01-07,100.3,46,M 45-49,110,BA,Vulcano,,,,,,145,165,-175,,165,,,,,,165,1
Daniel Matamala,Multi-ply,B,M,1964-12-01,98.5,49,M 45-49,100,NQ,,,,,,,165,175,-180,,175,,,,,,175,1
Jose Naulle,Multi-ply,B,M,1963-09-02,103.6,50,M 50-54,110,BA,Vulcano,,,,,,170,185,-192.5,,185,,,,,,185,1
Daniel Giacobone,Multi-ply,B,M,1952-01-05,103.2,62,M 60-64,110,BA,Indiana,,,,,,145,-155,155,,155,,,,,,155,1
Eldo Galvan,Raw,B,M,1962-12-24,89.9,51,M 50-54,90,,Vet Merlo,,,,,,153,-155,,,153,,,,,,153,1
Amado Monzon,Raw,B,M,1962-05-08,107.6,52,M 50-54,110,,Vet Merlo,,,,,,-130,,,,,,,,,,,DQ
