WeightClassKg,Event,Equipment,Sex,Tested,Name,CyrillicName,BirthDate,Division,BodyweightKg,Squat1Kg,Squat2Kg,Squat3Kg,Squat4Kg,Best3SquatKg,Bench1Kg,Bench2Kg,Bench3Kg,Bench4Kg,Best3BenchKg,Deadlift1Kg,Deadlift2Kg,Deadlift3Kg,Deadlift4Kg,Best3DeadliftKg,TotalKg,Place
67.5,B,Raw,M,Yes,Oleg Shchubkin,Олег Щубкин,1991-04-27,Amateur Juniors 20-23,67.25,,,,,,-130,-130,-130,,,,,,,,,DQ
75,B,Raw,M,Yes,Maksim Zelenin,Максим Зеленин,1992-11-22,Amateur Juniors 20-23,72.3,,,,,,125,130,132.5,,132.5,,,,,,132.5,1
75,B,Raw,M,Yes,Ivan Fedotov,Иван Федотов,1992-08-31,Amateur Juniors 20-23,74.7,,,,,,-130,130,-140,,130,,,,,,130,2
75,B,Raw,M,Yes,Evgeniy Shushkov,Евгений Шушков,1990-10-02,Amateur Juniors 20-23,72.8,,,,,,100,110,-115,,110,,,,,,110,3
75,B,Raw,M,Yes,Evgeniy Derbenev,Евгений Дербенев,1990-08-09,Amateur Juniors 20-23,73.15,,,,,,-120,-120,-120,,,,,,,,,DQ
82.5,B,Raw,M,Yes,Armen Sarkisyan,Армен Саркисян,1991-05-19,Amateur Juniors 20-23,79.6,,,,,,-132.5,132.5,142.5,,142.5,,,,,,142.5,1
82.5,B,Raw,M,Yes,Igor Soldatov,Игорь Солдатов,1991-04-24,Amateur Juniors 20-23,81,,,,,,-135,135,140,,140,,,,,,140,2
82.5,B,Raw,M,Yes,Nikita Zaykov,Никита Зайков,1991-06-26,Amateur Juniors 20-23,81.85,,,,,,-125,125,132.5,,132.5,,,,,,132.5,3
82.5,B,Raw,M,Yes,Eduard Timofeev,Эдуард Тимофеев,1992-04-06,Amateur Juniors 20-23,80.9,,,,,,130,-135,-135,,130,,,,,,130,4
90,B,Raw,M,Yes,Viktor Stepchenkov,Виктор Степченков,1992-10-21,Amateur Juniors 20-23,88.9,,,,,,145,155,157.5,,157.5,,,,,,157.5,1
90,B,Raw,M,Yes,Sergey Filimonov,Сергей Филимонов,1992-02-09,Amateur Juniors 20-23,86.8,,,,,,-145,145,150,,150,,,,,,150,2
90,B,Raw,M,Yes,Vladimir Sviridenko,Владимир Свириденко,1991-06-14,Amateur Juniors 20-23,89.45,,,,,,140,150,-155,,150,,,,,,150,3
90,B,Raw,M,Yes,Sergey Tkachenko,Сергей Ткаченко,1992-06-23,Amateur Juniors 20-23,87.75,,,,,,125,130,-137.5,,130,,,,,,130,6
90,B,Raw,M,Yes,Oleg Bashurov,Олег Башуров,1990-09-16,Amateur Juniors 20-23,86.1,,,,,,100,110,120,,120,,,,,,120,7
90,B,Raw,M,Yes,Maksim Zelekman,Максим Зелекман,1991-05-23,Amateur Juniors 20-23,86.8,,,,,,-125,-125,-125,,,,,,,,,DQ
90,B,Raw,M,Yes,Yuriy Popa,Юрий Попа,1993-01-10,Amateur Juniors 20-23,89.4,,,,,,-155,-155,-155,,,,,,,,,DQ
100,B,Raw,M,Yes,Aleksandr Vokhmyanin,Александр Вохмянин,1992-12-26,Amateur Juniors 20-23,98.5,,,,,,142.5,-147.5,147.5,,147.5,,,,,,147.5,2
110,B,Raw,M,Yes,Anton Ponomarev,Антон Пономарев,1992-02-12,Amateur Juniors 20-23,102.85,,,,,,145,150,152.5,,152.5,,,,,,152.5,3
75,B,Raw,M,Yes,Lev Aseev,Лев Асеев,1971-09-02,Amateur Masters 40-44,74.85,,,,,,-125,-125,125,,125,,,,,,125,1
75,B,Raw,M,Yes,Oleg Zolotarev,Олег Золотарев,1970-07-02,Amateur Masters 40-44,72.95,,,,,,97.5,105,110,,110,,,,,,110,2
82.5,B,Raw,M,Yes,Aleksey Usmanov,Алексей Усманов,1973-02-27,Amateur Masters 40-44,80.4,,,,,,-140,-140,-140,,,,,,,,,DQ
90,B,Raw,M,Yes,Aleksandr Nikitin,Александр Никитин,1973-09-15,Amateur Masters 40-44,88.45,,,,,,145,150,152.5,,152.5,,,,,,152.5,1
90,B,Raw,M,Yes,Vsevolod Sandomirskiy,Всеволод Сандомирский,1969-01-31,Amateur Masters 40-44,85.5,,,,,,140,-150,-150,,140,,,,,,140,2
100,B,Raw,M,Yes,Sergey Nikolaev,Сергей Николаев,1971-10-07,Amateur Masters 40-44,97.35,,,,,,170,-177.5,-177.5,,170,,,,,,170,1
100,B,Raw,M,Yes,Aleksandr Feofanov,Александр Феофанов,1972-01-17,Amateur Masters 40-44,97.1,,,,,,-130,130,-137.5,,130,,,,,,130,2
110,B,Raw,M,Yes,Evgeniy Antukh,Евгений Антух,1972-10-13,Amateur Masters 40-44,106.35,,,,,,155,162.5,-167.5,,162.5,,,,,,162.5,2
60,B,Raw,M,Yes,Vyacheslav Kravtsov,Вячеслав Кравцов,1967-04-21,Amateur Masters 45-49,58.5,,,,,,95,100,105,,105,,,,,,105,1
67.5,B,Raw,M,Yes,Igor Malenko,Игорь Маленко,1966-11-16,Amateur Masters 45-49,67.25,,,,,,107.5,-115,-115,,107.5,,,,,,107.5,1
90,B,Raw,M,Yes,Yuriy Rubanov,Юрий Рубанов,1967-11-28,Amateur Masters 45-49,87.15,,,,,,165,-172.5,-172.5,,165,,,,,,165,1
90,B,Raw,M,Yes,Aleksandr Tyulenev,Александр Тюленев,1968-08-26,Amateur Masters 45-49,89,,,,,,142.5,147.5,-150,,147.5,,,,,,147.5,2
100,B,Raw,M,Yes,Gennadiy Dortman,Геннадий Дортман,1965-05-15,Amateur Masters 45-49,98.3,,,,,,145,152.5,155,,155,,,,,,155,2
110,B,Raw,M,Yes,Andrey Kispitsin,Андрей Киспицин,1968-09-16,Amateur Masters 45-49,106.3,,,,,,155,167.5,172.5,,172.5,,,,,,172.5,1
90,B,Raw,M,Yes,Nikolay Kuznetsov,Николай Кузнецов,1960-12-28,Amateur Masters 50-54,89.75,,,,,,115,125,130,,130,,,,,,130,1
140,B,Raw,M,Yes,Sergey Stukalov,Сергей Стукалов,1962-07-07,Amateur Masters 50-54,129.3,,,,,,147.5,152.5,157.5,,157.5,,,,,,157.5,1
90,B,Raw,M,Yes,Vyacheslav Nikolaev,Вячеслав Николаев,1956-07-10,Amateur Masters 55-59,89.6,,,,,,-120,-120,120,,120,,,,,,120,1
100,B,Raw,M,Yes,Dmitriy Kruglov,Дмитрий Круглов,1955-05-09,Amateur Masters 55-59,96.05,,,,,,105,-110,110,,110,,,,,,110,1
110,B,Raw,M,Yes,Sergey Angel,Сергей Ангел,1955-03-25,Amateur Masters 55-59,101.65,,,,,,95,105,-110,,105,,,,,,105,1
67.5,B,Raw,M,Yes,Yuriy Vikhorev,Юрий Вихорев,1950-06-28,Amateur Masters 60-64,65.6,,,,,,-80,80,85,,85,,,,,,85,1
90,B,Raw,M,Yes,Aleksadr Razmakhnin,Алексадр Размахнин,1951-08-08,Amateur Masters 60-64,85.55,,,,,,105,-115,117.5,,117.5,,,,,,117.5,1
56,B,Raw,M,Yes,Dmitriy Samdanov,Дмитрий Самданов,1988-02-28,Amateur Open,54.95,,,,,,77.5,80,-82.5,,80,,,,,,80,1
67.5,B,Raw,M,Yes,Dmitriy Kaygorodov,Дмитрий Кайгородов,1983-09-24,Amateur Open,65.85,,,,,,147.5,-150,,,147.5,,,,,,147.5,1
67.5,B,Raw,M,Yes,Aleksey Abramov,Алексей Абрамов,1986-04-06,Amateur Open,67.1,,,,,,120,127.5,132.5,,132.5,,,,,,132.5,2
67.5,B,Raw,M,Yes,Sergey Poboykin,Сергей Побойкин,1989-03-10,Amateur Open,65.75,,,,,,130,-135,-135,,130,,,,,,130,4
67.5,B,Raw,M,Yes,Sergey Zagarskiy,Сергей Загарский,1989-11-20,Amateur Open,67.5,,,,,,120,125,130,,130,,,,,,130,5
75,B,Raw,M,Yes,Ivan Karpov,Иван Карпов,1988-08-10,Amateur Open,73.5,,,,,,162.5,170,175,,175,,,,,,175,1
75,B,Raw,M,Yes,Vladimir Malyavkin,Владимир Малявкин,1986-03-26,Amateur Open,75,,,,,,145,150,152.5,,152.5,,,,,,152.5,2
75,B,Raw,M,Yes,Daniil Lamanov,Даниил Ламанов,1987-08-17,Amateur Open,72.45,,,,,,140,150,-155,,150,,,,,,150,3
75,B,Raw,M,Yes,Evgeniy Zuev,Евгений Зуев,1985-07-11,Amateur Open,72.85,,,,,,-150,150,-152.5,,150,,,,,,150,4
75,B,Raw,M,Yes,Khuseyn Ishmatov,Хусейн Ишматов,1978-01-08,Amateur Open,74,,,,,,130,135,142.5,,142.5,,,,,,142.5,5
75,B,Raw,M,Yes,Vitaliy Tsarev,Виталий Царев,1975-05-31,Amateur Open,74.4,,,,,,130,137.5,-140,,137.5,,,,,,137.5,6
75,B,Raw,M,Yes,Aleksandr Fomin,Александр Фомин,1985-03-26,Amateur Open,74,,,,,,130,135,-140,,135,,,,,,135,7
75,B,Raw,M,Yes,Maksim Zelenin,Максим Зеленин,1992-11-22,Amateur Open,72.3,,,,,,125,130,132.5,,132.5,,,,,,132.5,8
75,B,Raw,M,Yes,Vladimir Ovcharov,Владимир Овчаров,1972-05-30,Amateur Open,73.8,,,,,,125,132.5,-140,,132.5,,,,,,132.5,9
75,B,Raw,M,Yes,Valeriy Matyunin,Валерий Матюнин,1983-06-22,Amateur Open,74.1,,,,,,115,120,-125,,120,,,,,,120,10
75,B,Raw,M,Yes,Aleksey Shatilov,Алексей Шатилов,1989-01-12,Amateur Open,73.8,,,,,,110,115,-125,,115,,,,,,115,11
75,B,Raw,M,Yes,Anton Alekseev #2,Антон Алексеев,1988-11-25,Amateur Open,73.05,,,,,,-90,90,-95,,90,,,,,,90,12
82.5,B,Raw,M,Yes,Vitaliy Dubrovin,Виталий Дубровин,1982-08-06,Amateur Open,81.7,,,,,,180,-187.5,187.5,,187.5,,,,,,187.5,1
82.5,B,Raw,M,Yes,Aleksey Rodik-Knyazev,Алексей Родик-Князев,1981-02-01,Amateur Open,79.2,,,,,,150,160,172.5,,172.5,,,,,,172.5,2
82.5,B,Raw,M,Yes,Aleksandr Shchelkov,Александр Щелков,1989-11-05,Amateur Open,79.1,,,,,,150,155,-160,,155,,,,,,155,4
82.5,B,Raw,M,Yes,Evgeniy Ritter,Евгений Риттер,1981-07-13,Amateur Open,81.2,,,,,,147.5,152.5,-157.5,,152.5,,,,,,152.5,6
82.5,B,Raw,M,Yes,Aleksandr Murga,Александр Мурга,1981-06-23,Amateur Open,79.7,,,,,,145,150,-157.5,,150,,,,,,150,7
82.5,B,Raw,M,Yes,Aleksandr Savchenko,Александр Савченко,1978-04-13,Amateur Open,81.55,,,,,,125,130,135,,135,,,,,,135,9
82.5,B,Raw,M,Yes,Serezha Volgin,Сережа Волгин,1986-10-11,Amateur Open,79.5,,,,,,110,120,132.5,,132.5,,,,,,132.5,10
82.5,B,Raw,M,Yes,Aleksandr Abramovskiy,Александр Абрамовский,1986-05-12,Amateur Open,80.25,,,,,,115,120,132.5,,132.5,,,,,,132.5,11
82.5,B,Raw,M,Yes,Ivan Eliseev,Иван Елисеев,1985-07-17,Amateur Open,82,,,,,,120,125,-132.5,,125,,,,,,125,12
82.5,B,Raw,M,Yes,Anton Rusov,Антон Русов,1988-04-11,Amateur Open,76.4,,,,,,117.5,122.5,-132.5,,122.5,,,,,,122.5,13
82.5,B,Raw,M,Yes,Viktor Ryabtsev,Виктор Рябцев,1986-10-13,Amateur Open,78.8,,,,,,112.5,117.5,-122.5,,117.5,,,,,,117.5,15
82.5,B,Raw,M,Yes,Maksim Smirdov,Максим Смирдов,1986-11-16,Amateur Open,81.2,,,,,,-140,-140,-140,,,,,,,,,DQ
90,B,Raw,M,Yes,Nikolay Berezovskiy,Николай Березовский,1987-04-06,Amateur Open,87.45,,,,,,180,185,187.5,,187.5,,,,,,187.5,1
90,B,Raw,M,Yes,Egor Pakhomchik,Егор Пахомчик,1986-11-28,Amateur Open,87.2,,,,,,155,-165,165,,165,,,,,,165,4
90,B,Raw,M,Yes,Aleksey Dubrovskiy,Алексей Дубровский,1986-11-03,Amateur Open,88.35,,,,,,145,155,-157.5,,155,,,,,,155,5
90,B,Raw,M,Yes,Sergey Tsarev,Сергей Царев,1986-02-08,Amateur Open,87.95,,,,,,140,-150,150,,150,,,,,,150,7
90,B,Raw,M,Yes,Aleksey Dovbiy,Алексей Довбий,1989-05-04,Amateur Open,89.7,,,,,,135,140,-150,,140,,,,,,140,8
90,B,Raw,M,Yes,Evgeniy Rudenok,Евгений Руденок,1984-02-03,Amateur Open,88.3,,,,,,130,137.5,-140,,137.5,,,,,,137.5,9
90,B,Raw,M,Yes,Konstantin Boev,Константин Боев,1983-10-02,Amateur Open,88.45,,,,,,-130,130,-140,,130,,,,,,130,11
90,B,Raw,M,Yes,Denis Savchenko,Денис Савченко,1983-04-22,Amateur Open,90,,,,,,115,122.5,127.5,,127.5,,,,,,127.5,12
90,B,Raw,M,Yes,Vladimir Mikhalev,Владимир Михалев,1983-10-05,Amateur Open,87.9,,,,,,125,-137.5,-137.5,,125,,,,,,125,13
90,B,Raw,M,Yes,Ivan Dikun,Иван Дикун,1985-11-08,Amateur Open,89.5,,,,,,120,-132.5,-132.5,,120,,,,,,120,14
90,B,Raw,M,Yes,Aleksandr Vikhlyaev,Александр Вихляев,1975-06-15,Amateur Open,89.6,,,,,,115,120,-125,,120,,,,,,120,15
90,B,Raw,M,Yes,Denis Eliseev,Денис Елисеев,1981-08-25,Amateur Open,87.85,,,,,,-160,,,,,,,,,,,DQ
100,B,Raw,M,Yes,Vadim Smirnov,Вадим Смирнов,1982-10-13,Amateur Open,99.65,,,,,,195,200,-202.5,,200,,,,,,200,3
100,B,Raw,M,Yes,Konstantin Kovazhenko,Константин Коваженко,1978-04-17,Amateur Open,93.15,,,,,,190,195,-200,,195,,,,,,195,4
100,B,Raw,M,Yes,Fedoro Alekseev,Федоро Алексеев,1977-07-07,Amateur Open,96.15,,,,,,162.5,167.5,172.5,,172.5,,,,,,172.5,7
100,B,Raw,M,Yes,Evgeniy Kava,Евгений Кава,1982-05-15,Amateur Open,99.6,,,,,,172.5,-180,-180,,172.5,,,,,,172.5,8
100,B,Raw,M,Yes,Artem Lukyanov,Артем Лукьянов,1983-04-02,Amateur Open,93.9,,,,,,160,170,-180,,170,,,,,,170,9
100,B,Raw,M,Yes,Sergey Nikolaev,Сергей Николаев,1971-10-07,Amateur Open,97.35,,,,,,170,-177.5,-177.5,,170,,,,,,170,10
100,B,Raw,M,Yes,Oleg Lipskiy,Олег Липский,1990-07-09,Amateur Open,100,,,,,,150,160,167.5,,167.5,,,,,,167.5,11
100,B,Raw,M,Yes,Aleksandr Kardonov,Александр Кардонов,1985-12-07,Amateur Open,97.6,,,,,,130,142.5,162.5,,162.5,,,,,,162.5,12
100,B,Raw,M,Yes,Svyatoslav Gaprindashvili,Святослав Гаприндашвили,1987-12-22,Amateur Open,98,,,,,,162.5,-165,-165,,162.5,,,,,,162.5,13
100,B,Raw,M,Yes,Dmitriy Yurchenko,Дмитрий Юрченко,1974-06-23,Amateur Open,98.15,,,,,,-155,-155,162.5,,162.5,,,,,,162.5,14
100,B,Raw,M,Yes,Maksim Vanin,Максим Ванин,1980-05-08,Amateur Open,99.7,,,,,,-150,162.5,-165,,162.5,,,,,,162.5,15
100,B,Raw,M,Yes,Nikita Mirsaev,Никита Мирсаев,1989-05-25,Amateur Open,98.9,,,,,,147.5,-152.5,-152.5,,147.5,,,,,,147.5,17
100,B,Raw,M,Yes,Maksim Sinelnikov,Максим Синельников,1984-01-17,Amateur Open,96.5,,,,,,130,-140,-140,,130,,,,,,130,18
100,B,Raw,M,Yes,Aleksey Zagorodnev,Алексей Загороднев,1986-03-31,Amateur Open,95.9,,,,,,-110,117.5,-125,,117.5,,,,,,117.5,19
100,B,Raw,M,Yes,Aleksandr Kushnir,Александр Кушнир,1986-05-30,Amateur Open,99.1,,,,,,-162.5,-162.5,-162.5,,,,,,,,,DQ
110,B,Raw,M,Yes,Maksim Starosvetskiy,Максим Старосветский,1975-04-10,Amateur Open,105.2,,,,,,175,180,185,,185,,,,,,185,7
110,B,Raw,M,Yes,Daniil Bashitov,Даниил Башитов,1983-12-04,Amateur Open,110,,,,,,160,170,-175,,170,,,,,,170,9
110,B,Raw,M,Yes,Ivan Klimenko,Иван Клименко,1980-11-10,Amateur Open,102.5,,,,,,160,-165,165,,165,,,,,,165,10
110,B,Raw,M,Yes,Aleksandr Babkin,Александр Бабкин,1985-05-20,Amateur Open,107.7,,,,,,120,132.5,137.5,,137.5,,,,,,137.5,11
110,B,Raw,M,Yes,Sergey Babin,Сергей Бабин,1981-11-18,Amateur Open,104.5,,,,,,-167.5,-167.5,-167.5,,,,,,,,,DQ
110,B,Raw,M,Yes,Ruslan Romanenko,Руслан Романенко,1986-05-26,Amateur Open,107.85,,,,,,-167.5,-167.5,-167.5,,,,,,,,,DQ
110,B,Raw,M,Yes,Andrey Ruban,Андрей Рубан,1983-09-21,Amateur Open,108.45,,,,,,-160,-160,-160,,,,,,,,,DQ
125,B,Raw,M,Yes,Konstantin Starodubov,Константин Стародубов,1982-10-17,Amateur Open,120.35,,,,,,165,175,-180,,175,,,,,,175,4
125,B,Raw,M,Yes,Sergey Seliverstov,Сергей Селиверстов,1978-03-02,Amateur Open,110.5,,,,,,110,125,-132.5,,125,,,,,,125,5
140,B,Raw,M,Yes,Artem Karakulov,Артем Каракулов,1989-01-18,Amateur Open,136.05,,,,,,145,-160,160,,160,,,,,,160,3
60,B,Raw,M,Yes,Rach Markosyan,Рач Маркосян,2000-07-24,Amateur Teen 13,58.35,,,,,,85,-92.5,95,,95,,,,,,95,1
56,B,Raw,M,Yes,Andrey Shtork,Андрей Шторк,1998-08-20,Amateur Teen 14-16,54.8,,,,,,80,82.5,85,,85,,,,,,85,1
60,B,Raw,M,Yes,Nikolay Kuzmin,Николай Кузьмин,1999-06-26,Amateur Teen 14-16,57.55,,,,,,72.5,77.5,-85,,77.5,,,,,,77.5,1
75,B,Raw,M,Yes,Sergey Mitrofanov,Сергей Митрофанов,,Amateur Teen 14-16,72.9,,,,,,90,100,-105,,100,,,,,,100,1
75,B,Raw,M,Yes,Evgeniy Chernyak,Евгений Черняк,1997-11-24,Amateur Teen 14-16,71.9,,,,,,-90,-90,92.5,,92.5,,,,,,92.5,2
60,B,Raw,M,Yes,Anatoliy Kozlov,Анатолий Козлов,1994-10-13,Amateur Teen 17-19,59.9,,,,,,105,-115,-115,,105,,,,,,105,1
67.5,B,Raw,M,Yes,Konstantin Sobolev,Константин Соболев,1994-06-15,Amateur Teen 17-19,67.25,,,,,,110,117.5,-122.5,,117.5,,,,,,117.5,1
67.5,B,Raw,M,Yes,Nikolay Basov,Николай Басов,1996-01-05,Amateur Teen 17-19,64.8,,,,,,105,110,-115,,110,,,,,,110,2
67.5,B,Raw,M,Yes,Egor Seryukov,Егор Серюков,1996-06-13,Amateur Teen 17-19,65.6,,,,,,82.5,87.5,90,,90,,,,,,90,3
67.5,B,Raw,M,Yes,Aleksandr Anufriev,Александр Ануфриев,1995-06-07,Amateur Teen 17-19,66.55,,,,,,90,-95,-95,,90,,,,,,90,4
75,B,Raw,M,Yes,Danil Semenov,Данил Семенов,1996-10-21,Amateur Teen 17-19,72.2,,,,,,120,125,130,,130,,,,,,130,1
75,B,Raw,M,Yes,Andrey Lityaev,Андрей Литяев,1995-09-26,Amateur Teen 17-19,72.05,,,,,,100,105,110,,110,,,,,,110,2
75,B,Raw,M,Yes,Artem Somov,Артем Сомов,1996-08-18,Amateur Teen 17-19,69.4,,,,,,105,-110,-110,,105,,,,,,105,3
75,B,Raw,M,Yes,Ivan Varsegov,Иван Варсегов,1994-10-07,Amateur Teen 17-19,74.15,,,,,,-145,,,,,,,,,,,DQ
82.5,B,Raw,M,Yes,Vitalya Ilyukhin,Виталя Ильюхин,1994-12-19,Amateur Teen 17-19,81.75,,,,,,-132.5,132.5,140,,140,,,,,,140,1
82.5,B,Raw,M,Yes,Nikita Ilyukhin,Никита Ильюхин,1996-10-30,Amateur Teen 17-19,77.4,,,,,,-135,135,-140,,135,,,,,,135,2
82.5,B,Raw,M,Yes,Arkadiy Ivanov,Аркадий Иванов,1995-05-25,Amateur Teen 17-19,77,,,,,,-132.5,-132.5,-132.5,,,,,,,,,DQ
90,B,Raw,M,Yes,Ivan Rubanov,Иван Рубанов,1995-01-01,Amateur Teen 17-19,87.1,,,,,,125,132.5,137.5,,137.5,,,,,,137.5,3
90,B,Raw,M,Yes,Mark Morev,Марк Морев,1994-01-13,Amateur Teen 17-19,89.85,,,,,,122.5,-130,-130,,122.5,,,,,,122.5,4
90,B,Raw,M,Yes,Aleksey Kovalenko,Алексей Коваленко,1996-02-27,Amateur Teen 17-19,87.4,,,,,,-115,-120,-120,,,,,,,,,DQ
110,B,Raw,M,Yes,Aleksey Kulakovskiy,Алексей Кулаковский,1995-03-07,Amateur Teen 17-19,103.67,,,,,,125,130,135,,135,,,,,,135,1
48,B,Raw,F,Yes,Viktoriya Kurpatova,Виктория Курпатова,1992-11-15,Amateur Juniors 20-23,46.95,,,,,,-57.5,57.5,-62.5,,57.5,,,,,,57.5,1
52,B,Raw,F,Yes,Viktoriya Avdeeva,Виктория Авдеева,1992-09-22,Amateur Juniors 20-23,52,,,,,,35,-42.5,42.5,,42.5,,,,,,42.5,2
56,B,Raw,F,Yes,Raisa Vorobeva,Раиса Воробьева,1991-11-04,Amateur Juniors 20-23,54.9,,,,,,-65,-65,67.5,,67.5,,,,,,67.5,1
56,B,Raw,F,Yes,Darya Averkieva,Дарья Аверкиева,1990-12-25,Amateur Juniors 20-23,55,,,,,,62.5,-65,-65,,62.5,,,,,,62.5,2
56,B,Raw,F,Yes,Anastasiya Borodina,Анастасия Бородина,1990-10-02,Amateur Juniors 20-23,56,,,,,,45,-47.5,-50,,45,,,,,,45,3
56,B,Raw,F,Yes,Mariya Morozova,Мария Морозова,1990-05-03,Amateur Juniors 20-23,55.55,,,,,,35,40,-42.5,,40,,,,,,40,4
75,B,Raw,F,Yes,Valentina Evsyukova,Валентина Евсюкова,1992-10-12,Amateur Juniors 20-23,69.45,,,,,,-70,-70,-70,,,,,,,,,DQ
52,B,Raw,F,Yes,Nonna Starostina,Нонна Старостина,1969-12-02,Amateur Masters 40-44,51.75,,,,,,-40,-40,40,,40,,,,,,40,1
90+,B,Raw,F,Yes,Elena Skobelkina,Елена Скобелкина,1973-05-24,Amateur Masters 40-44,105.8,,,,,,77.5,85,-87.5,,85,,,,,,85,1
44,B,Raw,F,Yes,Olga Dubok,Ольга Дубок,1988-01-02,Amateur Open,44,,,,,,35,-37.5,40,,40,,,,,,40,1
48,B,Raw,F,Yes,Viktoriya Kurpatova,Виктория Курпатова,1992-11-15,Amateur Open,46.95,,,,,,-57.5,57.5,-62.5,,57.5,,,,,,57.5,1
48,B,Raw,F,Yes,Evgeniya Korolkova,Евгения Королькова,1984-11-21,Amateur Open,47.25,,,,,,-50,-55,-55,,,,,,,,,DQ
48,B,Raw,F,Yes,Anastasiya Kovanovskaya,Анастасия Ковановская,1989-08-26,Amateur Open,47.7,,,,,,-50,-50,-50,,,,,,,,,DQ
56,B,Raw,F,Yes,Tatyana Gulevich,Татьяна Гулевич,1989-01-03,Amateur Open,55.8,,,,,,67.5,70,72.5,,72.5,,,,,,72.5,1
56,B,Raw,F,Yes,Raisa Vorobeva,Раиса Воробьева,1991-11-04,Amateur Open,54.9,,,,,,-65,-65,67.5,,67.5,,,,,,67.5,2
56,B,Raw,F,Yes,Mariya Morozova,Мария Морозова,1990-05-03,Amateur Open,55.55,,,,,,35,40,-42.5,,40,,,,,,40,3
60,B,Raw,F,Yes,Kristina Baranova,Кристина Баранова,1988-05-17,Amateur Open,59.5,,,,,,72.5,-77.5,77.5,,77.5,,,,,,77.5,1
60,B,Raw,F,Yes,Svetlana Ilyasova,Светлана Ильясова,1975-03-25,Amateur Open,59.45,,,,,,55,-60,-60,,55,,,,,,55,2
60,B,Raw,F,Yes,Marina Ivanova,Марина Иванова,1984-04-22,Amateur Open,59.9,,,,,,55,-60,-60,,55,,,,,,55,3
60,B,Raw,F,Yes,Mariya Prokonich,Мария Проконич,1988-09-25,Amateur Open,59.9,,,,,,45,-52.5,-52.5,,45,,,,,,45,4
67.5,B,Raw,F,Yes,Galina Konovalova,Галина Коновалова,1994-08-08,Amateur Open,67.15,,,,,,67.5,-72.5,-72.5,,67.5,,,,,,67.5,3
75,B,Raw,F,Yes,Natalya Korenkova,Наталья Коренкова,1980-01-07,Amateur Open,69.2,,,,,,95,102.5,-107.5,,102.5,,,,,,102.5,1
82.5,B,Raw,F,Yes,Anna Slobodchikova,Анна Слободчикова,1981-06-07,Amateur Open,81.15,,,,,,77.5,82.5,85,,85,,,,,,85,1
90+,B,Raw,F,Yes,Elena Konovalova,Елена Коновалова,1978-08-03,Amateur Open,108.1,,,,,,70,-80,-80,,70,,,,,,70,1
90+,B,Raw,F,Yes,Elena Skobelkina,Елена Скобелкина,1973-05-24,Amateur Open,105.8,,,,,,77.5,85,-87.5,,85,,,,,,85,1
48,B,Raw,F,Yes,Tatyana Alekseeva,Татьяна Алексеева,1998-08-04,Amateur Teen 14-16,47.95,,,,,,25,30,32.5,,32.5,,,,,,32.5,1
52,B,Raw,F,Yes,Anastasiya Saydentsal,Анастасия Сайденцаль,1998-07-24,Amateur Teen 14-16,52,,,,,,45,-50,-50,,45,,,,,,45,1
52,B,Raw,F,Yes,Veronika Yarotskaya,Вероника Яроцкая,1994-09-09,Amateur Teen 17-19,51.35,,,,,,40,45,47.5,,47.5,,,,,,47.5,1
60,B,Raw,F,Yes,Alina Stasko,Алина Стасько,1996-05-31,Amateur Teen 17-19,57.15,,,,,,35,37.5,-42.5,,37.5,,,,,,37.5,1
67.5,B,Raw,F,Yes,Galina Konovalova,Галина Коновалова,1994-08-08,Amateur Teen 17-19,67.15,,,,,,67.5,-72.5,-72.5,,67.5,,,,,,67.5,1
82.5,B,Raw,F,Yes,Aleksandra Feofanova,Александра Феофанова,1996-09-16,Amateur Teen 17-19,82.45,,,,,,-45,,,,,,,,,,,DQ
82.5,B,Raw,F,Yes,Aleksandra Feofanova,Александра Феофанова,1996-09-16,Amateur Teen 17-19,82.45,,,,,,-45,45,47.5,,47.5,,,,,,47.5,1
75,B,Multi-ply,M,Yes,Igor Polotechnikov,Игорь Полотечников,1991-08-26,Amateur Juniors 20-23,74.1,,,,,,-170,-170,170,,170,,,,,,170,1
100,B,Multi-ply,M,Yes,Igor Kurlanov,Игорь Курланов,1991-05-03,Amateur Juniors 20-23,96.75,,,,,,180,-192.5,-192.5,,180,,,,,,180,2
82.5,B,Multi-ply,M,Yes,Konstantin Smirnov,Константин Смирнов,1962-07-15,Amateur Masters 50-54,79.7,,,,,,140,-151,-151,,140,,,,,,140,1
90,B,Multi-ply,M,Yes,Nikolay Kuznetsov,Николай Кузнецов,1960-12-28,Amateur Masters 50-54,89.75,,,,,,-150,-150,-150,,,,,,,,,DQ
56,B,Multi-ply,M,Yes,Sergey Bogun,Сергей Богун,1999-04-03,Amateur Open,55.9,,,,,,-135,-135,-135,,,,,,,,,DQ
75,B,Multi-ply,M,Yes,Evgeniy Zuev,Евгений Зуев,1985-07-11,Amateur Open,72.85,,,,,,195,-205,-205,,195,,,,,,195,1
75,B,Multi-ply,M,Yes,Yuriy Mikhaylov,Юрий Михайлов,1987-07-22,Amateur Open,74.6,,,,,,150,157.5,162.5,,162.5,,,,,,162.5,2
75,B,Multi-ply,M,Yes,Aleksandr Moiseev,Александр Моисеев,1980-05-06,Amateur Open,73.8,,,,,,150,-157.5,-157.5,,150,,,,,,150,3
75,B,Multi-ply,M,Yes,Sergey Zhuganenko,Сергей Жуганенко,1987-02-11,Amateur Open,73.9,,,,,,-150,-150,-150,,,,,,,,,DQ
82.5,B,Multi-ply,M,Yes,Aleksey Rodik-Knyazev,Алексей Родик-Князев,1981-02-01,Amateur Open,79.2,,,,,,170,-182.5,182.5,,182.5,,,,,,182.5,2
90,B,Multi-ply,M,Yes,Denis Eliseev,Денис Елисеев,1981-08-25,Amateur Open,87.75,,,,,,-160,160,-180,,160,,,,,,160,1
100,B,Multi-ply,M,Yes,Sergey Gerber,Сергей Гербер,1977-07-15,Amateur Open,96.3,,,,,,-155,-155,,,,,,,,,,DQ
100,B,Multi-ply,M,Yes,Viktor Mistratov,Виктор Мистратов,1981-02-10,Amateur Open,99,,,,,,-300,-300,-300,,,,,,,,,DQ
56,B,Multi-ply,M,Yes,Sergey Bogun,Сергей Богун,1999-04-03,Amateur Teen 14-16,55.9,,,,,,-135,-135,-135,,,,,,,,,DQ
60,B,Multi-ply,M,Yes,Eldar Aliev,Элдар Алиев,1996-09-19,Amateur Teen 17-19,59.7,,,,,,107.5,115,122.5,,122.5,,,,,,122.5,1
67.5,B,Multi-ply,M,Yes,Demur Khorava,Демур Хорава,1995-06-06,Amateur Teen 17-19,65.55,,,,,,110,-120,120,,120,,,,,,120,1
75,B,Multi-ply,M,Yes,Ivan Varsegov,Иван Варсегов,1994-10-07,Amateur Teen 17-19,74.15,,,,,,145,-157.5,157.5,,157.5,,,,,,157.5,1
90,B,Multi-ply,M,Yes,Ivan Rubanov,Иван Рубанов,1995-01-01,Amateur Teen 17-19,87.1,,,,,,-175,-175,-175,,,,,,,,,DQ
100,B,Multi-ply,M,Yes,Vasiliy Kiselev,Василий Киселев,1994-04-18,Amateur Teen 17-19,95.25,,,,,,-157.5,-157.5,-157.5,,,,,,,,,DQ
56,B,Multi-ply,F,Yes,Tatyana Lazareva,Татьяна Лазарева,1992-07-19,Amateur Juniors 20-23,55.25,,,,,,-65,65,67.5,,67.5,,,,,,,DQ
52,SBD,Wraps,M,Yes,Artem Tishchenko,Артем Тищенко,1991-11-30,Amateur Juniors 20-23,49.9,115,125,-135,,125,57.5,65,-70,,65,125,135,-145,,135,325,1
56,SBD,Wraps,M,Yes,Aleksandr Shilo,Александр Шило,1992-10-11,Amateur Juniors 20-23,53,-80,-85,85,,85,65,72.5,75,,75,100,115,-130,,115,275,1
60,SBD,Wraps,M,Yes,Ziya Amirli,Зия Амирли,1992-10-10,Amateur Juniors 20-23,59.9,115,125,-130,,125,90,95,-97.5,,95,165,-175,-175,,165,385,1
60,SBD,Wraps,M,Yes,Tolgen Iskakov,Толген Искаков,1991-04-20,Amateur Juniors 20-23,59.9,110,125,-140,,125,80,90,-95,,90,150,-170,-170,,150,365,2
67.5,SBD,Wraps,M,Yes,Maksim Danilov,Максим Данилов,1990-10-11,Amateur Juniors 20-23,65.45,160,-167.5,167.5,,167.5,115,120,-125,,120,202.5,212.5,222.5,,222.5,510,1
67.5,SBD,Wraps,M,Yes,Aleksey Volosov,Алексей Волосов,1991-01-29,Amateur Juniors 20-23,67.45,112.5,117.5,125,,125,-82.5,-87.5,-87.5,,,-130,,,,,125,2
75,SBD,Wraps,M,Yes,Dmitriy Kolikov,Дмитрий Коликов,1993-10-26,Amateur Juniors 20-23,74.5,-165,170,-175,,170,110,117.5,-122.5,,117.5,180,195,205,,205,492.5,2
75,SBD,Wraps,M,Yes,Konstantin Protskiy,Константин Процкий,1992-12-09,Amateur Juniors 20-23,73.5,140,150,155,,155,125,130,-135,,130,190,205,-215,,205,490,3
75,SBD,Wraps,M,Yes,Pavel Kashkalda,Павел Кашкалда,1993-11-10,Amateur Juniors 20-23,74.5,-165,170,-180,,170,95,-100,-105,,95,175,182.5,190,,190,455,4
75,SBD,Wraps,M,Yes,Vladimir Lebedev,Владимир Лебедев,1993-11-14,Amateur Juniors 20-23,72.1,-140,140,-150,,140,-110,110,115,,115,180,185,-190,,185,440,5
75,SBD,Wraps,M,Yes,Denis Chernyshev,Денис Чернышев,1990-12-07,Amateur Juniors 20-23,73.85,-140,-140,140,,140,-110,110,115,,115,160,170,-180,,170,425,6
75,SBD,Wraps,M,Yes,Anton Loran,Антон Лоран,1992-04-16,Amateur Juniors 20-23,71.95,120,130,137.5,,137.5,-100,-105,105,,105,160,-170,-170,,160,402.5,7
75,SBD,Wraps,M,Yes,Anatoliy Kolesov,Анатолий Колесов,1992-02-01,Amateur Juniors 20-23,72.95,135,140,-147.5,,140,-105,105,-112.5,,105,155,-162.5,-162.5,,155,400,8
75,SBD,Wraps,M,Yes,Mikhail Bykov,Михаил Быков,1989-12-31,Amateur Juniors 20-23,71.85,110,-120,120,,120,80,-90,-90,,80,-160,160,170,,170,370,9
75,SBD,Wraps,M,Yes,Yuriy Izerskiy,Юрий Изерский,1992-07-15,Amateur Juniors 20-23,70.1,-100,100,110,,110,-90,90,-95,,90,120,135,140,,140,340,10
75,SBD,Wraps,M,Yes,Ivan Tugay,Иван Тугай,1990-05-06,Amateur Juniors 20-23,72,145,150,-155,,150,-110,-110,-112.5,,,145,-150,-150,,145,295,11
82.5,SBD,Wraps,M,Yes,Aleksey Astakhov,Алексей Астахов,1993-09-06,Amateur Juniors 20-23,82.5,155,-165,170,,170,117.5,122.5,127.5,,127.5,190,200,210,,210,507.5,3
82.5,SBD,Wraps,M,Yes,Igor Kagadiy,Игорь Кагадий,1991-03-28,Amateur Juniors 20-23,81.3,175,-190,-190,,175,110,120,-130,,120,200,210,-227.5,,210,505,4
82.5,SBD,Wraps,M,Yes,Roman Borisov,Роман Борисов,1990-11-23,Amateur Juniors 20-23,81.25,140,150,-155,,150,110,-115,115,,115,-160,160,175,,175,440,5
90,SBD,Wraps,M,Yes,Timofey Ermolaev,Тимофей Ермолаев,1991-10-20,Amateur Juniors 20-23,88.6,180,190,200,,200,142.5,147.5,152.5,,152.5,225,235,-240,,235,587.5,2
90,SBD,Wraps,M,Yes,Roman Kuryanov,Роман Курьянов,1993-07-20,Amateur Juniors 20-23,88.65,205,-216,-216,,205,130,135,-140,,135,182.5,192.5,207.5,,207.5,547.5,3
90,SBD,Wraps,M,Yes,Aleksey Zabolotskiy,Алексей Заболоцкий,1993-01-13,Amateur Juniors 20-23,85.55,170,180,190,,190,120,130,-135,,130,150,170,180,,180,500,4
90,SBD,Wraps,M,Yes,Ilya Batyrev,Илья Батырев,1990-12-22,Amateur Juniors 20-23,87.4,140,145,-150,,145,110,115,-120,,115,170,-175,,,170,430,5
90,SBD,Wraps,M,Yes,Andrey Terentev,Андрей Терентьев,1990-10-05,Amateur Juniors 20-23,88.7,120,130,135,,135,95,-105,-105,,95,160,180,190,,190,420,6
100,SBD,Wraps,M,Yes,Ivan Zotoverkhov,Иван Зотоверхов,1990-02-28,Amateur Juniors 20-23,94.8,185,195,-200,,195,150,155,-162.5,,155,245,262.5,275,-286,275,625,3
100,SBD,Wraps,M,Yes,Oleg Lipskiy,Олег Липский,1990-07-09,Amateur Juniors 20-23,100,180,190,200,,200,150,160,170,,170,190,210,220,,220,590,4
100,SBD,Wraps,M,Yes,Aleksey Bokarev,Алексей Бокарев,1991-09-10,Amateur Juniors 20-23,97.7,160,172.5,-180,,172.5,120,130,-140,,130,207.5,220,-240,,220,522.5,5
100,SBD,Wraps,M,Yes,Vladislav Tsyganok,Владислав Цыганок,1993-01-05,Amateur Juniors 20-23,93.45,170,180,-190,,180,120,-130,130,,130,175,185,-190,,185,495,6
100,SBD,Wraps,M,Yes,Nikolay Tolokonnikov,Николай Толоконников,1991-11-02,Amateur Juniors 20-23,97.7,140,155,162.5,,162.5,115,122.5,-130,,122.5,180,195,-215,,195,480,7
110,SBD,Wraps,M,Yes,Sergey Tarasenko,Сергей Тарасенко,1992-05-22,Amateur Juniors 20-23,107.2,-190,190,200,,200,125,135,-140,,135,220,-240,-240,,220,555,2
125,SBD,Wraps,M,Yes,Leontiy Yatsenko,Леонтий Яценко,1990-09-28,Amateur Juniors 20-23,122.3,220,-230,-230,,220,150,-155,-155,,150,200,210,220,,220,590,2
82.5,SBD,Wraps,M,Yes,Aleksey Vinyukov,Алексей Винюков,1973-10-19,Amateur Masters 40-44,81,185,190,-195,,190,127.5,135,-140,,135,215,220,-225,,220,545,1
82.5,SBD,Wraps,M,Yes,Sergey Karas,Сергій Карась,1973-07-19,Amateur Masters 40-44,80.1,150,160,170,,170,100,107.5,112.5,,112.5,170,180,190,,190,472.5,2
100,SBD,Wraps,M,Yes,Evgeniy Gorshkov,Евгений Горшков,1969-12-04,Amateur Masters 40-44,97.9,145,155,-162.5,,155,95,100,-102.5,,100,150,160,170,,170,425,1
125,SBD,Wraps,M,Yes,Oleg Shevchuk,Олег Шевчук,1970-07-23,Amateur Masters 40-44,122.15,180,195,202.5,,202.5,130,140,-147.5,,140,180,200,210,,210,552.5,3
90,SBD,Wraps,M,Yes,Genadiy Pokshevatov,Генадий Покшеватов,1959-04-17,Amateur Masters 50-54,87.15,200,220,225,,225,115,125,-130,,125,200,215,225,,225,575,1
100,SBD,Wraps,M,Yes,Oleg Smolin,Олег Смолин,1963-04-01,Amateur Masters 50-54,98.1,175,190,200,,200,140,147.5,150,,150,190,215,,,215,565,1
82.5,SBD,Wraps,M,Yes,Vyacheslav Piskalov,Вячеслав Пискалов,1958-10-23,Amateur Masters 55-59,80.85,220,240,252.5,,252.5,95,100,105,,105,220,230,235,,235,592.5,1
67.5,SBD,Wraps,M,Yes,Maksim Danilov,Максим Данилов,1990-10-11,Amateur Open,65.45,160,-167.5,167.5,,167.5,115,120,-125,,120,202.5,212.5,222.5,,222.5,510,1
67.5,SBD,Wraps,M,Yes,Yuriy Dzhakhaya,Юрий Джахая,1986-09-02,Amateur Open,66.6,-170,-170,170,,170,120,-125,-125,,120,200,220,,,220,510,2
67.5,SBD,Wraps,M,Yes,Ilya Gurko,Илья Гурко,1989-02-24,Amateur Open,66.6,145,155,160,,160,-100,-102.5,102.5,,102.5,170,180,187.5,,187.5,450,3
67.5,SBD,Wraps,M,Yes,Aleksey Volosov,Алексей Волосов,1991-01-29,Amateur Open,67.45,112.5,117.5,125,,125,-82.5,-87.5,-87.5,,,-130,,,,,125,4
75,SBD,Wraps,M,Yes,Aleksey Polubatonov,Алексей Полубатонов,1987-07-16,Amateur Open,74.9,165,-170,-170,,165,-115,115,122.5,,122.5,180,190,-202.5,,190,477.5,3
75,SBD,Wraps,M,Yes,Aleksandr Zvyaglov,Александр Звяглов,1983-07-22,Amateur Open,71.55,135,-145,-145,,135,92.5,97.5,-102.5,,97.5,-130,130,152.5,,152.5,385,4
75,SBD,Wraps,M,Yes,Yuriy Izerskiy,Юрий Изерский,1992-07-15,Amateur Open,70.1,-100,100,110,,110,-90,90,-95,,90,120,135,140,,140,340,5
82.5,SBD,Wraps,M,Yes,Vyacheslav Piskalov,Вячеслав Пискалов,1958-10-23,Amateur Open,80.85,220,240,252.5,,252.5,95,100,105,,105,220,230,235,,235,592.5,1
82.5,SBD,Wraps,M,Yes,Aleksey Vinyukov,Алексей Винюков,1973-10-19,Amateur Open,81,185,190,-195,,190,127.5,135,-140,,135,215,220,-225,,220,545,2
82.5,SBD,Wraps,M,Yes,Anton Gofer,Антон Гофер,1994-04-17,Amateur Open,80.8,170,-185,-185,,170,130,-137.5,-137.5,,130,-235,235,240,-247.5,240,540,3
82.5,SBD,Wraps,M,Yes,Sergey Karas,Сергій Карась,1973-07-19,Amateur Open,80.1,150,160,170,,170,100,107.5,112.5,,112.5,170,180,190,,190,472.5,4
82.5,SBD,Wraps,M,Yes,Roman Evdokimov,Роман Евдокимов,1989-02-08,Amateur Open,81.6,175,185,192.5,,192.5,-117.5,-125,-125,,,-200,,,,,192.5,7
90,SBD,Wraps,M,Yes,Roman Grishchenko,Роман Грищенко,1985-03-06,Amateur Open,89,200,-210,-210,,200,150,-160,-160,,150,270,-290,-292.5,,270,620,1
90,SBD,Wraps,M,Yes,Genadiy Pokshevatov,Генадий Покшеватов,1959-04-17,Amateur Open,87.15,200,220,225,,225,115,125,-130,,125,200,215,225,,225,575,3
90,SBD,Wraps,M,Yes,Konstantin Zhilkin,Константин Жилкин,1979-10-23,Amateur Open,87.55,-200,-200,210,,210,120,130,-135,,130,200,215,,,215,555,4
90,SBD,Wraps,M,Yes,Igor Kashcheev,Игорь Кащеев,1979-07-23,Amateur Open,88.2,-170,180,190,,190,120,130,132.5,,132.5,200,210,225,,225,547.5,5
90,SBD,Wraps,M,Yes,Maksim Denisenko,Максим Денисенко,1988-08-11,Amateur Open,89.85,160,190,-200,,190,115,125,-127.5,,125,200,-210,-210,,200,515,6
90,SBD,Wraps,M,Yes,Vyacheslav Emelyanov,Вячеслав Емельянов,1979-12-19,Amateur Open,89.6,-180,-190,-190,,,,,,,,,,,,,,DQ
100,SBD,Wraps,M,Yes,Anatoliy Cherkashin,Анатолий Черкашин,1987-10-21,Amateur Open,95.2,-210,210,-230,,210,130,145,155,,155,260,-275,275,-301,275,640,3
100,SBD,Wraps,M,Yes,Ivan Zotoverkhov,Иван Зотоверхов,1990-02-28,Amateur Open,94.8,185,195,-200,,195,150,155,-162.5,,155,245,262.5,275,-286,275,625,5
100,SBD,Wraps,M,Yes,Khayrullo Shakiev,Хайрулло Шакиев,1983-01-10,Amateur Open,99,210,220,-230,,220,165,175,-185,,175,220,230,-245,,230,625,6
100,SBD,Wraps,M,Yes,Ayur Dorzheev,Аюр Доржеев,1988-12-25,Amateur Open,97.95,222.5,-232.5,,,222.5,150,155,-160,,155,205,,,,205,582.5,8
100,SBD,Wraps,M,Yes,Sergey Galanin,Сергей Галанин,1984-03-02,Amateur Open,91.4,170,182.5,192.5,,192.5,130,140,-147.5,,140,200,215,227.5,,227.5,560,10
100,SBD,Wraps,M,Yes,Aleksey Bokarev,Алексей Бокарев,1991-09-10,Amateur Open,97.7,160,172.5,-180,,172.5,120,130,-140,,130,207.5,220,-240,,220,522.5,11
110,SBD,Wraps,M,Yes,Daniil Bashitov,Даниил Башитов,1983-12-04,Amateur Open,110,210,-220,220,,220,160,167.5,-172.5,,167.5,210,220,230,,230,617.5,4
110,SBD,Wraps,M,Yes,Andrey Germanovich,Андрей Германович,1979-03-09,Amateur Open,100.45,180,190,-200,,190,140,-150,-150,,140,235,-240,-240,,235,565,5
110,SBD,Wraps,M,Yes,Yuriy Zherebtsov,Юрий Жеребцов,1974-04-06,Amateur Open,107.1,-170,170,190,,190,140,-155,-155,,140,200,220,-250,,220,550,6
52,D,Raw,M,Yes,Roman Plyusnin,Роман Плюснин,1998-03-27,Amateur Teen 14-16,51.1,,,,,,,,,,,105,-110,110,,110,110,1
56,SBD,Wraps,M,Yes,Viktor Gapenko,Виктор Гапенко,1997-10-31,Amateur Teen 14-16,55,90,-95,-97.5,,90,60,-65,65,,65,-115,-115,115,,115,270,1
60,D,Raw,M,Yes,Andrey Chuchalin,Андрей Чучалин,1997-09-18,Amateur Teen 14-16,60,,,,,,,,,,,145,160,165,,165,165,1
60,D,Raw,M,Yes,Mikhail Grigorv,Михаил Григорьв,1997-10-01,Amateur Teen 14-16,58.55,,,,,,,,,,,135,-155,-162.5,,135,135,2
67.5,SBD,Wraps,M,Yes,Evgeniy Shurakov,Евгений Шураков,1997-12-15,Amateur Teen 14-16,66.45,135,145,150,,150,102.5,110,112.5,,112.5,167.5,177.5,-187.5,,177.5,440,1
67.5,SBD,Wraps,M,Yes,Nikita Filippov,Никита Филиппов,1997-10-09,Amateur Teen 14-16,66.5,112.5,120,-122.5,,120,80,85,-87.5,,85,130,142.5,147.5,,147.5,352.5,3
75,SBD,Wraps,M,Yes,Igor Makushev,Игорь Макушев,1997-02-21,Amateur Teen 14-16,73.85,110,120,-125,,120,80,-87.5,-90,,80,120,-132.5,-142.5,,120,320,1
75,SBD,Wraps,M,Yes,Daniil Shcherbatykh,Даниил Щербатых,1998-03-25,Amateur Teen 14-16,74.15,-110,110,115,,115,50,60,65,,65,120,135,-142.5,,135,315,2
82.5,SBD,Wraps,M,Yes,Aleksandr Davydov,Александр Давыдов,1996-12-14,Amateur Teen 14-16,80.8,160,170,-180,,170,95,-105,-105,,95,200,210,-220,,210,475,1
82.5,SBD,Wraps,M,Yes,Andrey Kharin,Андрей Харин,1997-11-04,Amateur Teen 14-16,77.1,130,135,-140,,135,85,90,-95,,90,170,180,190,,190,415,3
90,SBD,Wraps,M,Yes,Grigoriy Romanov,Григорий Романов,1997-10-06,Amateur Teen 14-16,86,135,145,-150,,145,87.5,95,-100,,95,155,165,-175,,165,405,1
110,SBD,Wraps,M,Yes,Evgeniy Levchenko,Евгений Левченко,1997-09-09,Amateur Teen 14-16,101.3,165,172.5,-180,,172.5,95,-100,100,,100,155,165,-175,,165,437.5,1
60,SBD,Wraps,M,Yes,Aleksey Samotonin,Алексей Самотонин,1995-02-26,Amateur Teen 17-19,57.6,105,110,-115,,110,80,85,-90,,85,-135,-135,-135,,,195,3
67.5,SBD,Wraps,M,Yes,Dmitriy Timokhin,Дмитрий Тимохин,1995-03-17,Amateur Teen 17-19,66.66,135,145,-147.5,,145,95,102.5,105,,105,185,195,-200,,195,445,1
67.5,SBD,Wraps,M,Yes,Sergey Velts,Сергей Вельц,1996-04-07,Amateur Teen 17-19,65.45,120,130,-140,,130,90,-95,95,,95,-160,170,-175,,170,395,2
75,SBD,Wraps,M,Yes,Ilya Vakulin,Илья Вакулин,1994-01-19,Amateur Teen 17-19,74.15,150,-162.5,162.5,,162.5,120,127.5,132.5,,132.5,180,200,-207.5,,200,495,1
75,SBD,Wraps,M,Yes,Vladislav Popov,Владислав Попов,1994-10-02,Amateur Teen 17-19,69.3,140,150,155,,155,95,-105,-105,,95,205,-215,-215,,205,455,2
75,SBD,Wraps,M,Yes,Evgeniy Zakharov #4,Евгений Захаров,1996-08-08,Amateur Teen 17-19,72.2,-130,130,-140,,130,100,-107.5,112.5,,112.5,160,175,-190,,175,417.5,3
75,SBD,Wraps,M,Yes,Yaroslav Gusev,Ярослав Гусев,1995-11-25,Amateur Teen 17-19,71.15,-125,125,135,,135,85,95,-102.5,,95,165,-175,-175,,165,395,4
75,SBD,Wraps,M,Yes,Aleksandr Plutakhin,Александр Плутахин,1996-11-17,Amateur Teen 17-19,74.95,100,110,115,,115,90,95,-97.5,,95,130,-140,140,,140,350,5
75,SBD,Wraps,M,Yes,Vladislav Pechenkin,Владислав Печенкин,1994-08-17,Amateur Teen 17-19,70.9,72.5,80,90,,90,50,60,-62.5,,60,100,115,125,,125,275,6
82.5,SBD,Wraps,M,Yes,Nikita Ilyukhin,Никита Ильюхин,1996-10-30,Amateur Teen 17-19,77.4,175,-185,185,191,185,135,137.5,140,,140,195,205,215,-226,215,540,1
82.5,SBD,Wraps,M,Yes,Anton Gofer,Антон Гофер,1994-04-17,Amateur Teen 17-19,80.8,170,-185,-185,,170,130,-137.5,-137.5,,130,-235,235,240,-247.5,240,540,2
82.5,SBD,Wraps,M,Yes,Aleksandr Bulatov,Александр Булатов,1994-01-20,Amateur Teen 17-19,82.1,185,195,202.5,,202.5,120,-130,-132.5,,120,190,200,210,,210,532.5,3
82.5,SBD,Wraps,M,Yes,Artemey Voronov,Артемей Воронов,1996-01-11,Amateur Teen 17-19,81.8,180,-190,190,,190,-110,110,-115,,110,195,-205,205,,205,505,4
82.5,SBD,Wraps,M,Yes,Kirill Karmanov,Кирилл Карманов,1994-10-06,Amateur Teen 17-19,79.9,180,-190,190,,190,105,-110,110,,110,180,-190,-190,,180,480,5
82.5,SBD,Wraps,M,Yes,Vladislav Romanov,Владислав Романов,1996-09-23,Amateur Teen 17-19,79.55,135,142.5,150,,150,102.5,-107.5,107.5,,107.5,150,160,167.5,,167.5,425,7
82.5,SBD,Wraps,M,Yes,Artur Zaykov,Артур Зайков,1996-02-28,Amateur Teen 17-19,78.6,130,-145,-145,,130,90,95,100,,100,160,-170,175,,175,405,8
82.5,SBD,Wraps,M,Yes,Dmitriy Kashirtsev,Дмитрий Каширцев,1996-01-04,Amateur Teen 17-19,78,110,115,-120,,115,90,-95,-95,,90,130,145,155,,155,360,10
82.5,D,Raw,M,Yes,Roman Pyshkov,Роман Пышков,1996-09-25,Amateur Teen 17-19,79.95,,,,,,,,,,,200,217.5,225,,225,225,1
90,SBD,Wraps,M,Yes,Artem Varutin,Артем Варутин,1994-08-16,Amateur Teen 17-19,86.1,160,175,-180,,175,120,-125,-125,,120,180,190,-197.5,,190,485,2
90,SBD,Wraps,M,Yes,Aleksey Suvorov,Алексей Суворов,1995-05-15,Amateur Teen 17-19,89.55,150,160,-175,,160,100,110,115,,115,170,185,-200,,185,460,3
90,SBD,Wraps,M,Yes,Roman Dankovets,Роман Данковец,1994-06-25,Amateur Teen 17-19,89.45,167.5,175,-182.5,,175,97.5,-105,105,,105,170,177.5,-185,,177.5,457.5,4
90,D,Raw,M,Yes,Aleksey Kovalenko,Алексей Коваленко,1996-02-27,Amateur Teen 17-19,89,,,,,,,,,,,180,-185,-185,,180,180,1
100,SBD,Wraps,M,Yes,Aleksey Luzhanskiy,Алексей Лужанский,1995-10-05,Amateur Teen 17-19,98,180,195,210,,210,150,157.5,,,157.5,180,200,-207.5,,200,567.5,2
100,SBD,Wraps,M,Yes,Kiril Zaburnyagin,Кирил Забурнягин,1995-04-21,Amateur Teen 17-19,99.85,160,172.5,180,,180,115,-125,-125,,115,215,230,-240,,230,525,4
110,SBD,Wraps,M,Yes,Anatoliy Spitchenko,Анатолий Спитченко,1994-02-27,Amateur Teen 17-19,105.15,160,170,180,,180,145,-152.5,152.5,,152.5,200,210,220,,220,552.5,2
44,SBD,Wraps,F,Yes,Anastasiya Komarova,Анастасия Комарова,1990-10-30,Amateur Juniors 20-23,44,-90,90,-100,,90,40,-45,-45,,40,90,100,107.5,-110,107.5,237.5,1
48,SBD,Wraps,F,Yes,Yuliya Buzulutskova,Юлия Бузулуцкова,1992-11-14,Amateur Juniors 20-23,47.9,-70,-70,-70,,,,,,,,75,80,82.5,,82.5,,DQ
52,SBD,Wraps,F,Yes,Yana Bazarkina,Яна Базаркина,1991-04-22,Amateur Juniors 20-23,51.9,-87.5,87.5,-95,,87.5,42.5,-45,-45,,42.5,120,130,-142.5,,130,260,1
56,SBD,Wraps,F,Yes,Rita Timakova,Рита Тимакова,1992-05-27,Amateur Juniors 20-23,54.7,60,65,-70,,65,20,25,-30,,25,70,75,80,,80,170,1
56,SBD,Wraps,F,Yes,Yuliya Grabovskaya,Юлия Грабовская,1993-08-29,Amateur Juniors 20-23,55.7,-87.5,-87.5,-87.5,,,-50,,,,,90,100,107.5,,107.5,,DQ
60,SBD,Wraps,F,Yes,Mariya Eliseeva,Мария Елисеева,1992-06-05,Amateur Juniors 20-23,57.25,70,80,-85,,80,30,-40,40,,40,70,80,90,,90,210,1
67.5,SBD,Wraps,F,Yes,Ekaterina Koshkareva,Екатерина Кошкарева,1990-08-22,Amateur Juniors 20-23,67.15,-95,-95,-95,,,,,,,,120,125,-130,,125,,DQ
44,SBD,Wraps,F,Yes,Anastasiya Komarova,Анастасия Комарова,1990-10-30,Amateur Open,44,-90,90,-100,,90,40,-45,-45,,40,90,100,107.5,-110,107.5,237.5,1
48,SBD,Wraps,F,Yes,Tatyana Chechkina,Татьяна Чечкина,1986-07-26,Amateur Open,47.3,100,-105,-105,,100,55,60,-65,,60,115,122.5,127.5,-131,127.5,287.5,1
48,SBD,Wraps,F,Yes,Tatyana Sukhorukova,Татьяна Сухорукова,1981-02-20,Amateur Open,47.1,82.5,87.5,-90,,87.5,-45,45,-47.5,,45,110,-117.5,,,110,242.5,2
48,SBD,Wraps,F,Yes,Tamara Rybachenko,Тамара Рыбаченко,1985-05-31,Amateur Open,48,75,80,85,,85,45,50,-52.5,,50,85,95,100,,100,235,3
52,SBD,Wraps,F,Yes,Mariya Ryzhova,Мария Рыжова,1988-09-01,Amateur Open,51.5,80,90,-95,,90,45,47.5,-50,,47.5,-100,100,110,,110,247.5,1
52,SBD,Wraps,F,Yes,Anna Vishnyak,Анна Вишняк,1984-12-12,Amateur Open,51.4,-95,-95,-95,,,,,,,,85,97.5,110,,110,,DQ
52,SBD,Wraps,F,Yes,Anzhelika Volf,Анжелика Вольф,1989-11-07,Amateur Open,50.7,-70,-72.5,-72.5,,,,,,,,-75,75,80,,80,,DQ
56,SBD,Wraps,F,Yes,Marina Nikitina,Марина Никитина,1976-08-02,Amateur Open,55.7,100,105,-107.5,,105,55,57.5,-60,,57.5,115,-122.5,-127.5,,115,277.5,2
56,SBD,Wraps,F,Yes,Olga Turkina,Ольга Туркина,1988-07-06,Amateur Open,55.4,90,-95,-97.5,,90,50,52.5,55,,55,-110,-110,110,,110,255,3
56,SBD,Wraps,F,Yes,Tatyana Lonchakova,Татьяна Лончакова,1986-05-24,Amateur Open,55.7,85,90,95,,95,-45,45,-50,,45,95,-102.5,105,,105,245,4
56,SBD,Wraps,F,Yes,Nadezhda Berezina,Надежда Березина,1986-07-10,Amateur Open,54.2,75,-80,-80,,75,47.5,-50,-50,,47.5,107.5,115,-122.5,,115,237.5,5
56,SBD,Wraps,F,Yes,Oksana Maslennikova,Оксана Масленникова,1981-05-07,Amateur Open,53.45,75,80,85,,85,-55,55,57.5,,57.5,85,90,-97.5,,90,232.5,6
56,SBD,Wraps,F,Yes,Evgeniya Rapikova,Евгения Рапикова,1988-08-07,Amateur Open,54.85,80,92.5,100,,100,30,-35,-35,,30,95,-107.5,-107.5,,95,225,7
56,SBD,Wraps,F,Yes,Nadezhda Ponomareva,Надежда Пономарева,1987-02-07,Amateur Open,55,70,-80,80,,80,45,-50,-50,,45,-100,100,-110,,100,225,8
56,SBD,Wraps,F,Yes,Tatyana Slepokurova,Татьяна Слепокурова,1969-01-07,Amateur Open,55.65,60,65,-70,,65,35,40,-42.5,,40,80,95,-100,,95,200,9
60,SBD,Wraps,F,Yes,Darya Litvinova #2,Дарья Литвинова,1988-12-14,Amateur Open,60,62.5,70,-77.5,,70,35,-40,-40,,35,80,90,-95,,90,195,3
67.5,SBD,Wraps,F,Yes,Natalya Leonteva,Наталья Леонтьева,1989-06-10,Amateur Open,67.5,107.5,115,-117.5,,115,55,62.5,65,,65,122.5,130,137.5,,137.5,317.5,2
67.5,SBD,Wraps,F,Yes,Yuliya Dubrovina,Юлия Дубровина,1983-07-14,Amateur Open,66.2,95,-100,-100,,95,52.5,55,57.5,,57.5,120,130,-137.5,,130,282.5,4
67.5,SBD,Wraps,F,Yes,Oksana Chudnaya,Оксана Чудная,1977-05-30,Amateur Open,66.7,100,105,110,,110,50,55,-60,,55,115,-120,,,115,280,5
67.5,SBD,Wraps,F,Yes,Irina Ageeva,Ирина Агеева,1989-09-12,Amateur Open,67.5,70,-80,80,,80,45,50,52.5,,52.5,90,100,110,,110,242.5,6
67.5,SBD,Wraps,F,Yes,Ekaterina Koshkareva,Екатерина Кошкарева,1990-08-22,Amateur Open,67.15,-95,-95,-95,,,,,,,,120,125,-130,,125,,DQ
75,SBD,Wraps,F,Yes,Tatyana Knaub,Татьяна Кнауб,1974-07-04,Amateur Open,70.8,75,-85,85,,85,45,50,-55,,50,-100,100,110,,110,245,2
90,SBD,Wraps,F,Yes,Zhanna Esaulenko,Жанна Эсауленко,1978-12-27,Amateur Open,86.5,90,-100,100,,100,67.5,-72.5,72.5,,72.5,110,130,137.5,,137.5,310,1
56,SBD,Wraps,F,Yes,Darya Esaulenko,Дарья Эсауленко,2001-11-22,Amateur Teen 13,53.1,50,55,-62.5,,55,30,32.5,-35,,32.5,80,90,95,-102,95,182.5,1
56,SBD,Wraps,F,Yes,Polina Matveeva,Полина Матвеева,1997-05-12,Amateur Teen 14-16,55.9,60,70,75,,75,50,55,-57.5,,55,75,-95,95,,95,225,1
48,SBD,Wraps,F,Yes,Rita Kisileva,Рита Кисилева,1994-04-09,Amateur Teen 17-19,48,57.5,-62.5,-62.5,,57.5,37.5,40,-42.5,,40,95,107.5,-112.5,,107.5,205,1
48,SBD,Wraps,F,Yes,Angelina Kalinina,Ангелина Калинина,1996-05-29,Amateur Teen 17-19,48,60,-65,-65,,60,27.5,30,-32.5,,30,86,95,,,95,185,2
52,SBD,Wraps,F,Yes,Veronika Yarotskaya,Вероника Яроцкая,1994-09-09,Amateur Teen 17-19,52,-60,-70,-75,,,,,,,,60,70,80,,80,,DQ
56,SBD,Wraps,F,Yes,Sveta Pereladova,Света Переладова,1994-10-17,Amateur Teen 17-19,54.8,92.5,95,-100,,95,42.5,-47.5,47.5,,47.5,-105,105,-115,,105,247.5,1
56,SBD,Wraps,F,Yes,Katya Lavrenyuk,Катя Лавренюк,1995-09-02,Amateur Teen 17-19,55.1,60,70,80,,80,42.5,-50,50,,50,75,-82.5,90,,90,220,2
56,SBD,Wraps,F,Yes,Elena Borovinskaya,Елена Боровинская,1995-12-06,Amateur Teen 17-19,55.15,72.5,82.5,-87.5,,82.5,45,-50,-50,,45,75,85,-90,,85,212.5,3
56,SBD,Wraps,F,Yes,Alena Berezina,Алена Березина,1995-05-12,Amateur Teen 17-19,52.3,67.5,72.5,-75,,72.5,40,-45,-45,,40,80,85,-92.5,,85,197.5,4
60,SBD,Wraps,F,Yes,Anastasiya Kraeva,Анастасия Краева,1994-09-27,Amateur Teen 17-19,60,-70,75,-87.5,,75,-42.5,42.5,45,,45,-100,112.5,-120,,112.5,232.5,1
60,SBD,Wraps,F,Yes,Mariya Shengerey,Мария Шенгерей,1995-11-24,Amateur Teen 17-19,56.45,70,-75,77.5,,77.5,37.5,-40,-40,,37.5,90,97.5,102.5,,102.5,217.5,2
60,SBD,Wraps,F,Yes,Ekaterina Kuzmicheva,Екатерина Кузьмичева,1996-01-23,Amateur Teen 17-19,60,-97.5,-97.5,-97.5,,,-55,,,,,135,145,-152.5,,145,,DQ
67.5,SBD,Multi-ply,M,Yes,Arsentiy Shishkin,Арсентий Шишкин,1939-05-02,Amateur Masters 70-74,67.5,175,185,195,,195,60,70,85,,85,160,-185,185,,185,465,1
75,SBD,Multi-ply,M,Yes,Evgeniy Bykov,Евгений Быков,1984-08-02,Amateur Open,73.85,225,-235,-235,,225,145,-152.5,-152.5,,145,200,220,240,,240,610,1
75,SBD,Multi-ply,M,Yes,Konstantin Polyakov,Константин Поляков,1976-04-21,Amateur Open,71.95,160,175,190,,190,110,115,,,115,170,185,200,,200,505,2
90,SBD,Multi-ply,M,Yes,Artem Bykhovets,Артем Быховец,1983-07-19,Amateur Open,89.1,250,280,-310,,280,190,-210,-210,,190,220,240,260,-281,260,730,2
100,SBD,Multi-ply,M,Yes,Sergey Gerber,Сергей Гербер,1977-07-15,Amateur Open,95.95,210,220,-225,,220,-150,150,155,,155,215,225,-235,,225,600,1
90,B,Raw,M,No,Vladimir Kryttsev,Владимир Крытцев,1990-11-19,Pro Juniors 20-23,88.5,,,,,,135,145,-150,,145,,,,,,145,4
90,B,Raw,M,No,Mikhail Kovalev,Михаил Ковалев,1990-04-04,Pro Juniors 20-23,90,,,,,,130,135,-140,,135,,,,,,135,5
100,B,Raw,M,No,Denis Zenin,Денис Зенин,1993-08-18,Pro Juniors 20-23,97.05,,,,,,210,-217.5,-217.5,,210,,,,,,210,1
100,B,Raw,M,No,Igor Goloshchalov,Игорь Голощалов,1992-08-23,Pro Juniors 20-23,99.85,,,,,,,,,,,,,,,,,DQ
110,B,Raw,M,No,Sergey Lir,Сергей Лир,1991-08-25,Pro Juniors 20-23,106.9,,,,,,230,240,-245,,240,,,,,,240,1
110,B,Raw,M,No,Maksim Nechaev,Максим Нечаев,1993-01-09,Pro Juniors 20-23,109,,,,,,165,180,190,,190,,,,,,190,2
125,B,Raw,M,No,Aleksey Kuzmenkov,Алексей Кузьменков,1991-05-18,Pro Juniors 20-23,117.45,,,,,,165,-170,-172.5,,165,,,,,,165,1
140,B,Raw,M,No,Aleksandr Elshin,Александр Ельшин,1992-08-17,Pro Juniors 20-23,131.4,,,,,,185,195,200,,200,,,,,,200,1
140,B,Raw,M,No,Aleksandr Okhrimenko,Александр Охрименко,1992-08-13,Pro Juniors 20-23,129.25,,,,,,160,172.5,180,,180,,,,,,180,2
110,B,Raw,M,No,Vasiliy Synkov,Василий Сынков,1972-09-07,Pro Masters 40-44,101,,,,,,190,200,,,200,,,,,,200,1
125,B,Raw,M,No,Nikolay Boykov,Николай Бойков,,Pro Masters 40-44,114.4,,,,,,-205,205,-210,,205,,,,,,205,1
140,B,Raw,M,No,Sergey Grebenkin,Сергей Гребенкин,1973-12-04,Pro Masters 40-44,130.2,,,,,,220,-230,-230,,220,,,,,,220,1
100,B,Raw,M,No,Aleksandr Bragin,Александр Брагин,1965-01-03,Pro Masters 45-49,99,,,,,,190,-195,-195,,190,,,,,,190,1
75,B,Raw,M,No,Aleksey Yachnev,Алексей Ячнев,1961-09-06,Pro Masters 50-54,73.15,,,,,,127.5,-142.5,-142.5,,127.5,,,,,,127.5,1
110,B,Raw,M,No,Mikhail Ishchechkin,Михаил Ищечкин,1962-01-22,Pro Masters 50-54,100.65,,,,,,130,140,147.5,,147.5,,,,,,147.5,1
100,B,Raw,M,No,Vladimir Vizgin,Владимир Визгин,1952-04-25,Pro Masters 60-64,94.5,,,,,,145,150,-155,,150,,,,,,150,1
90,B,Raw,M,No,Nikolay Bachurin,Николай Бачурин,1948-10-25,Pro Masters 65-69,86.4,,,,,,125,130,-132.5,,130,,,,,,130,1
67.5,B,Raw,M,No,Ilya Dugushkin,Илья Дугушкин,1986-04-11,Pro Open,67.5,,,,,,132.5,-147.5,-147.5,,132.5,,,,,,132.5,3
67.5,B,Raw,M,No,Aleksey Kazantsev,Алексей Казанцев,1977-08-25,Pro Open,66.35,,,,,,110,-125,-132.5,,110,,,,,,110,6
82.5,B,Raw,M,No,Nikolay Koshebarov,Николай Кошебаров,1987-03-02,Pro Open,81.3,,,,,,160,-167.5,170,,170,,,,,,170,3
82.5,B,Raw,M,No,Viktor Sevostyanov,Виктор Севостьянов,1983-11-06,Pro Open,80.85,,,,,,155,-165,-165,,155,,,,,,155,5
82.5,B,Raw,M,No,Dmitriy Savchenko,Дмитрий Савченко,1981-08-03,Pro Open,81.9,,,,,,130,140,-157.5,,140,,,,,,140,8
82.5,B,Raw,M,No,Aleksandr Stashevskiy,Александр Сташевский,1986-12-14,Pro Open,82,,,,,,100,110,122.5,,122.5,,,,,,122.5,14
82.5,B,Raw,M,No,Sergey Gorbunov,Сергей Горбунов,1984-06-05,Pro Open,79.2,,,,,,,,,,,,,,,,,DQ
90,B,Raw,M,No,Nikita Mikhalev,Никита Михалев,1988-12-24,Pro Open,89.45,,,,,,182.5,,-185,,182.5,,,,,,182.5,2
90,B,Raw,M,No,Anatoliy Chumakov,Анатолий Чумаков,1988-03-30,Pro Open,87.75,,,,,,170,-175,175,,175,,,,,,175,3
90,B,Raw,M,No,Danila Krashennikov,Данила Крашенников,1989-02-02,Pro Open,87.55,,,,,,-145,152.5,-162.5,,152.5,,,,,,152.5,6
90,B,Raw,M,No,Vladimir Smolyaninov,Владимир Смолянинов,1979-11-02,Pro Open,87.25,,,,,,120,130,-135,,130,,,,,,130,10
90,B,Raw,M,No,Evgeniy Shakirov,Евгений Шакиров,1982-04-25,Pro Open,87.8,,,,,,-170,-175,-175,,,,,,,,,DQ
100,B,Raw,M,No,Ivan Vasyunin,Иван Васюнин,1983-08-01,Pro Open,96.1,,,,,,210,215,-225,,215,,,,,,215,1
100,B,Raw,M,No,Denis Zenin,Денис Зенин,1993-08-18,Pro Open,97.05,,,,,,210,-217.5,-217.5,,210,,,,,,210,2
100,B,Raw,M,No,Petr Mikhaylov,Петр Михайлов,1975-08-24,Pro Open,94.55,,,,,,190,-197.5,-197.5,,190,,,,,,190,5
100,B,Raw,M,No,Aleksandr Bragin,Александр Брагин,1965-01-03,Pro Open,99,,,,,,190,-195,-195,,190,,,,,,190,6
100,B,Raw,M,No,Aleksandr Goloyukhov,Александр Голоюхов,1988-05-13,Pro Open,95,,,,,,152.5,-160,-172.5,,152.5,,,,,,152.5,16
100,B,Raw,M,No,Sergey Savoskin,Сергей Савоськин,1982-05-04,Pro Open,98.2,,,,,,,,,,,,,,,,,DQ
110,B,Raw,M,No,Sergey Lir,Сергей Лир,1991-08-25,Pro Open,106.9,,,,,,230,240,-245,,240,,,,,,240,1
110,B,Raw,M,No,Dmitriy Batrakov,Дмитрий Батраков,1976-08-30,Pro Open,110,,,,,,205,212.5,217.5,,217.5,,,,,,217.5,2
110,B,Raw,M,No,Anton Guselnikov,Антон Гусельников,1982-05-02,Pro Open,105,,,,,,215,-222.5,-222.5,,215,,,,,,215,3
110,B,Raw,M,No,Yuriy Gross,Юрий Гросс,1978-12-17,Pro Open,107.55,,,,,,190,202.5,-205,,202.5,,,,,,202.5,4
110,B,Raw,M,No,Vasiliy Synkov,Василий Сынков,1972-09-07,Pro Open,101,,,,,,190,200,,,200,,,,,,200,5
110,B,Raw,M,No,Denis Denisov,Денис Денисов,1980-07-23,Pro Open,105.35,,,,,,170,180,190,,190,,,,,,190,6
110,B,Raw,M,No,Viktor Prisyazhnyuk,Виктор Присяжнюк,1976-03-15,Pro Open,108.5,,,,,,180,-187.5,-187.5,,180,,,,,,180,8
110,B,Raw,M,No,Vitaliy Shevelev,Виталий Шевелев,1979-12-08,Pro Open,108.5,,,,,,-170,-177.5,-177.5,,,,,,,,,DQ
125,B,Raw,M,No,Konstantin Elshin,Константин Ельшин,1986-07-19,Pro Open,120.9,,,,,,240,-250,-250,,240,,,,,,240,1
125,B,Raw,M,No,Leonid Shevelkov,Леонид Шевельков,1987-10-06,Pro Open,121.1,,,,,,200,-210,210,,210,,,,,,210,2
125,B,Raw,M,No,Nikolay Boykov,Николай Бойков,,Pro Open,114.4,,,,,,-205,205,-210,,205,,,,,,205,3
125,B,Raw,M,No,Andrey Konenko,Андрей Коненко,1981-03-06,Pro Open,114.8,,,,,,-210,-210,-210,,,,,,,,,DQ
140,B,Raw,M,No,Sergey Grebenkin,Сергей Гребенкин,1973-12-04,Pro Open,130.2,,,,,,220,-230,-230,,220,,,,,,220,1
140,B,Raw,M,No,Roman Nikishin,Роман Никишин,1982-01-19,Pro Open,125.5,,,,,,180,185,-190,,185,,,,,,185,2
44,B,Raw,M,No,Sergey Synkov,Сергей Сынков,2001-11-26,Pro Teen 13,39,,,,,,45,47.5,50,,50,,,,,,50,1
48,B,Raw,M,No,Egor Pashkov,Егор Пашков,2000-06-08,Pro Teen 13,44.5,,,,,,35,40,42.5,,42.5,,,,,,42.5,1
60,B,Raw,M,No,Dmitriy Boldin,Дмитрий Болдин,1998-03-29,Pro Teen 14-16,56.6,,,,,,70,75,-77.5,,75,,,,,,75,2
60,B,Raw,M,No,Sergey Irkitov,Сергей Иркитов,1995-05-29,Pro Teen 17-19,58.1,,,,,,-92.5,92.5,-97.5,,92.5,,,,,,92.5,2
82.5,B,Raw,M,No,Roman Ryabtsev,Роман Рябцев,1996-06-13,Pro Teen 17-19,79.55,,,,,,115,120,-125,,120,,,,,,120,3
82.5,B,Raw,M,No,Roman Ryabtsev,Роман Рябцев,1996-06-13,Pro Teen 17-19,79.55,,,,,,,,,,,,,,,,,DQ
90,B,Raw,M,No,Denis Romanov,Денис Романов,1994-04-24,Pro Teen 17-19,87.5,,,,,,162.5,-170,-170,,162.5,,,,,,162.5,1
90,B,Raw,M,No,Vladimir Buzkin,Владимир Бузькин,1994-09-21,Pro Teen 17-19,87.5,,,,,,-160,160,-162.5,,160,,,,,,160,2
90,B,Raw,M,No,Egor Pfeyfer,Егор Пфейфер,1996-09-09,Pro Teen 17-19,87.85,,,,,,110,117.5,-125,,117.5,,,,,,117.5,5
90,B,Raw,M,No,Aleksandr Serdyukov,Александр Сердюков,1994-03-13,Pro Teen 17-19,89.6,,,,,,-147.5,-147.5,-155,,,,,,,,,DQ
100,B,Raw,M,No,Matvey Mishulin,Матвей Мишулин,1995-08-24,Pro Teen 17-19,97.8,,,,,,172.5,-180,185,,185,,,,,,185,1
52,B,Raw,F,No,Ekaterina Efimova,Екатерина Ефимова,1992-11-11,Pro Juniors 20-23,49.1,,,,,,60,65,-67.5,,65,,,,,,65,1
52,B,Raw,F,No,Natalya Konovalova,Наталья Коновалова,1988-09-14,Pro Open,51.7,,,,,,-105,105,107.5,110,107.5,,,,,,107.5,1
67.5,B,Raw,F,No,Ekaterina Shchibrya,Екатерина Щибря,1986-03-13,Pro Open,64.35,,,,,,107.5,115,-120,,115,,,,,,115,1
67.5,B,Raw,F,No,Marina Yarovaya,Марина Яровая,1981-12-22,Pro Open,66,,,,,,-75,75,80,,80,,,,,,80,2
75,B,Raw,F,No,Irina Masalova,Ирина Масалова,1977-05-20,Pro Open,73.6,,,,,,75,-80,-80,,75,,,,,,75,2
67.5,B,Multi-ply,M,No,Mikhail Zaytsev,Михаил Зайцев,1991-12-10,Pro Juniors 20-23,67.4,,,,,,115,-130,-137.5,,115,,,,,,115,1
100,B,Multi-ply,M,No,Aleksandr Kurmashov,Александр Курмашов,1993-07-13,Pro Juniors 20-23,100,,,,,,210,225,-230,,225,,,,,,225,1
110,B,Multi-ply,M,No,Maksim Nechaev,Максим Нечаев,1993-01-09,Pro Juniors 20-23,109,,,,,,-220,220,240,,240,,,,,,240,1
110,B,Multi-ply,M,No,Vasiliy Synkov,Василий Сынков,1972-09-07,Pro Masters 40-44,101,,,,,,240,250,257.5,,257.5,,,,,,257.5,1
82.5,B,Multi-ply,M,No,Maksim Shukhalov,Максим Шухалов,1986-10-23,Pro Open,81.4,,,,,,200,-215,,,200,,,,,,200,1
82.5,B,Multi-ply,M,No,Dmitriy Savchenko,Дмитрий Савченко,1981-08-03,Pro Open,81.9,,,,,,165,180,-195,,180,,,,,,180,3
100,B,Multi-ply,M,No,Ivan Vasyunin,Иван Васюнин,1983-08-01,Pro Open,96.1,,,,,,-270,270,-280,,270,,,,,,270,1
100,B,Multi-ply,M,No,Artem Segov,Артем Сегов,1988-04-20,Pro Open,99.8,,,,,,235,245,-262.5,,245,,,,,,245,2
110,B,Multi-ply,M,No,Vasiliy Synkov,Василий Сынков,1972-09-07,Pro Open,101,,,,,,240,250,257.5,,257.5,,,,,,257.5,1
110,B,Multi-ply,M,No,Aleksandr Musokhranov,Александр Мусохранов,1980-10-16,Pro Open,106.2,,,,,,165,172.5,177.5,,177.5,,,,,,177.5,2
75,SBD,Wraps,M,No,Ignat Salnikov,Игнат Сальников,1991-04-09,Pro Juniors 20-23,74.75,170,-180,180,,180,125,-132.5,132.5,,132.5,190,200,210,,210,522.5,1
82.5,SBD,Wraps,M,No,Vladimir Bukhmiller,Владимир Бухмиллер,1990-06-08,Pro Juniors 20-23,82.45,-170,170,175,,175,140,147.5,152.5,,152.5,225,235,240,,240,567.5,1
82.5,SBD,Wraps,M,No,Artem Pisarenko,Артем Писаренко,1993-09-01,Pro Juniors 20-23,80.8,180,190,200,,200,125,130,-135,,130,215,225,-232.5,,225,555,2
90,SBD,Wraps,M,No,Vladimir Shumilov,Владимир Шумилов,1992-08-31,Pro Juniors 20-23,90,190,200,210,,210,135,140,-147.5,,140,210,230,240,,240,590,1
100,SBD,Wraps,M,No,Daniil Tsarev,Даниил Царев,1990-09-12,Pro Juniors 20-23,95.4,235,-242.5,-242.5,,235,167.2,172.5,177.5,,177.5,290,300,-307.5,,300,712.5,1
100,SBD,Wraps,M,No,Vyacheslav Alekseev,Вячеслав Алексеев,1990-03-07,Pro Juniors 20-23,94.9,230,250,260,,260,130,140,-145,,140,265,280,-300,,280,680,2
110,SBD,Wraps,M,No,Stanislav Shishkin,Станислав Шишкин,1991-12-30,Pro Juniors 20-23,100.9,180,190,-200,,190,140,150,155,,155,220,240,250,,250,595,1
125,SBD,Wraps,M,No,Nikita Shafikov,Никита Шафиков,1993-05-15,Pro Juniors 20-23,123.1,200,215,225,,225,110,120,130,,130,295,307.5,-312.5,,307.5,662.5,1
125,SBD,Wraps,M,No,Vasiliy Omelchenko,Василий Омельченко,1973-10-22,Pro Masters 40-44,124.7,305,320,,,320,230,245,252.5,,252.5,320,340,,,340,912.5,1
125,SBD,Wraps,M,No,Borislav Dzakhsorov,Борислав Дзахсоров,1972-07-19,Pro Masters 40-44,118.45,220,,,,220,170,180,-185,,180,240,-260,,,240,640,2
140,SBD,Wraps,M,No,Oleg Vlasov,Олег Власов,1973-12-06,Pro Open,128.4,270,285,300,,300,220,230,240,,240,300,320,340,,340,880,1
75,SBD,Wraps,M,No,Evgeniy Lonchakov,Евгений Лончаков,1986-02-05,Pro Open,74.65,180,190,-200,,190,130,140,145,,145,190,200,210,,210,545,1
75,SBD,Wraps,M,No,Aleksey Kuptsov,Алексей Купцов,1990-06-21,Pro Open,74.15,190,-205,210,,210,115,120,122.5,,122.5,192.5,-202.5,-202.5,,192.5,525,2
82.5,SBD,Wraps,M,No,Mikhail Pavlyuchenko,Михаил Павлюченко,1987-01-01,Pro Open,77.77,130,137.5,-142.5,,137.5,-105,105,-112.5,,105,180,190,-200,,190,432.5,5
82.5,SBD,Wraps,M,No,STepan Dolgovykh,СТепан Долговых,1988-07-22,Pro Open,79.25,130,140,150,,150,-95,95,100,,100,150,160,170,,170,420,6
90,SBD,Wraps,M,No,Stanislav Telyatin,Станислав Телятин,1989-09-11,Pro Open,90,215,230,-242.5,,230,130,145,-155,,145,225,240,,,240,615,2
100,SBD,Wraps,M,No,Daniil Tsarev,Даниил Царев,1990-09-12,Pro Open,95.4,235,-242.5,-242.5,,235,167.2,172.5,177.5,,177.5,290,300,-307.5,,300,712.5,1
100,SBD,Wraps,M,No,Vyacheslav Alekseev,Вячеслав Алексеев,1990-03-07,Pro Open,94.9,230,250,260,,260,130,140,-145,,140,265,280,-300,,280,680,2
100,SBD,Wraps,M,No,Aleksandr Savin,Александр Савин,1986-06-01,Pro Open,96.1,210,220,-227.5,,220,-182.5,182.5,-190,,182.5,230,-245,,,230,632.5,4
100,SBD,Wraps,M,No,Denis Bertenev,Денис Бертенев,1987-10-10,Pro Open,98.3,-190,200,-220,,200,140,-150,-152.5,,140,210,250,-260,,250,590,7
100,SBD,Wraps,M,No,Aleksandr Kuchin,Александр Кучин,1987-10-06,Pro Open,90.1,220,-230,-230,,220,140,150,-155,,150,210,-220,,,210,580,9
110,SBD,Wraps,M,No,Nikita Myachin,Никита Мячин,1985-06-02,Pro Open,109.9,260,270,,,270,170,185,-190,,185,250,270,-300,,270,725,1
110,SBD,Wraps,M,No,Aleksey Ayvazyan,Алексей Айвазян,1974-08-04,Pro Open,109.3,-230,235,-250,,235,160,167.5,172.5,,172.5,200,240,,,240,647.5,2
110,SBD,Wraps,M,No,Igor Lepikhov,Игорь Лепихов,1976-08-10,Pro Open,104.6,200,210,217.5,,217.5,145,152.5,160,,160,230,250,260,,260,637.5,3
110,SBD,Wraps,M,No,Aleksandr Babkin,Александр Бабкин,1985-05-20,Pro Open,109.1,185,-195,-195,,185,-120,130,-137.5,,130,180,190,200,,200,515,7
110,SBD,Wraps,M,No,Dmitriy Shishkin,Дмитрий Шишкин,1982-12-23,Pro Open,100.7,160,170,180,,180,120,-130,-130,,120,180,200,-210,,200,500,8
125,SBD,Wraps,M,No,Vasiliy Omelchenko,Василий Омельченко,1973-10-22,Pro Open,124.7,305,320,,,320,230,245,252.5,,252.5,320,340,,,340,912.5,1
125,SBD,Wraps,M,No,Evgeniy Kosik,Евгений Косик,1983-09-06,Pro Open,113.2,220,230,240,,240,180,190,-200,,190,240,260,-270,,260,690,2
140,SBD,Wraps,M,No,Oleg Vlasov,Олег Власов,1973-12-06,Pro Open,128.4,270,285,300,,300,220,230,240,,240,300,320,340,,340,880,1
67.5,SBD,Wraps,M,No,Roman Cheremysin,Роман Черемысин,1998-06-16,Pro Teen 14-16,64.5,120,-125,125,,125,85,92.5,100,,100,180,-190,200,,200,425,2
82.5,SBD,Wraps,M,No,Nikita Tolmachev,Никита Толмачев,1997-09-29,Pro Teen 14-16,79.5,140,145,150,,150,90,-97.5,,,90,190,200,210,,210,450,2
60,SBD,Wraps,M,No,Evgeniy Petrov,Евгений Петров,1996-10-26,Pro Teen 17-19,59.35,140,-150,-150,,140,80,90,95,,95,180,190,200,,200,435,1
60,SBD,Wraps,M,No,Aleksandr Lomatchenko,Александр Ломатченко,1995-04-08,Pro Teen 17-19,59.6,110,120,130,,130,90,97.5,-102.5,,97.5,120,130,140,,140,367.5,2
67.5,SBD,Wraps,M,No,Maksim Madaminov,Максим Мадаминов,1996-04-26,Pro Teen 17-19,66.25,-100,-100,100,,100,67.5,72.5,77.5,,77.5,140,150,160,,160,337.5,3
82.5,SBD,Wraps,M,No,Artem Timofeev,Артем Тимофеев,1994-05-04,Pro Teen 17-19,81.5,140,150,152.5,,152.5,105,110,115,,115,150,160,170,,170,437.5,6
82.5,SBD,Wraps,M,No,Denis Mylnikov,Денис Мыльников,1996-05-07,Pro Teen 17-19,76.55,-125,125,137.5,,137.5,-95,95,100,,100,150,155,157.5,,157.5,395,9
90,SBD,Wraps,M,No,Dmitriy Podchasov,Дмитрий Подчасов,1994-03-03,Pro Teen 17-19,89.1,165,175,-180,,175,105,110,-112.5,,110,200,210,-217.5,,210,495,1
90,SBD,Wraps,M,No,Aleksandr Panasenko,Александр Панасенко,1996-03-01,Pro Teen 17-19,90,125,135,142.5,,142.5,90,95,102.5,,102.5,180,190,200,,200,445,5
100,SBD,Wraps,M,No,Vladimir Maslyuk,Владимир Маслюк,1994-07-26,Pro Teen 17-19,99,-200,200,-205,,200,135,140,-145,,140,225,230,-235,,230,570,1
100,SBD,Wraps,M,No,Yaroslav Ivanov,Ярослав Иванов,1995-07-20,Pro Teen 17-19,100,170,190,-195,,190,92.5,102.5,107.5,,107.5,215,235,252.5,,252.5,550,3
110,SBD,Wraps,M,No,Aleksandr Shnorr,Александр Шнорр,1994-03-06,Pro Teen 17-19,107,-200,-200,200,,200,120,-130,-140,,120,230,250,-260,,250,570,1
140,SBD,Wraps,M,No,Ivan Tsimbal,Иван Цимбал,1996-07-25,Pro Teen 17-19,139.25,245,260,270,,270,125,140,-150,,140,225,245,-255,,245,655,1
52,SBD,Wraps,F,No,Anna Galkina,Анна Галкина,1991-11-11,Pro Open,51.5,70,80,87.5,,87.5,52.5,57.5,60,,60,80,-90,-90,,80,227.5,2
56,SBD,Wraps,F,No,Svetlana Stelmashenko,Светлана Стельмашенко,1985-06-16,Pro Open,55.6,-82.5,82.5,87.5,,87.5,62.5,67.5,-72.5,,67.5,130,140,145,,145,300,1
60,SBD,Wraps,F,No,Galina Abramova,Галина Абрамова,1989-06-19,Pro Open,59,110,120,122.5,,122.5,52.5,57.5,-60,,57.5,145,155,162.5,,162.5,342.5,1
60,SBD,Wraps,F,No,Veronika Kozhevnikova,Вероника Кожевникова,1987-09-11,Pro Open,59,70,77.5,-82.5,,77.5,35,40,-45,,40,75,85,90,,90,207.5,2
67.5,SBD,Wraps,F,No,Irina Denisova,Ирина Денисова,1990-02-10,Pro Open,66.55,120,125,-127.5,,125,60,65,-67.5,,65,145,157.5,162.5,,162.5,352.5,1
67.5,SBD,Wraps,F,No,Kseniya Baskakova,Ксения Баскакова,1992-02-23,Pro Open,64.8,95,105,-112.5,,105,65,70,77.5,,77.5,110,120,132.5,,132.5,315,3
75,SBD,Wraps,F,No,Olga Gerasimyuk,Ольга Герасимюк,1996-03-01,Pro Open,75,135,-142.5,-142.5,,135,75,80,82.5,,82.5,170,-182.5,-182.5,,170,387.5,1
75,SBD,Multi-ply,M,No,Sergey Fedoseev,Сергей Федосеев,1982-01-18,Pro Open,74.9,160,-172.5,-185,,160,-135,-135,-135,,,,,,,,,DQ
75,SBD,Multi-ply,M,No,Anatoliy Sukhachev,Анатолий Сухачев,1992-10-19,Pro Open,74.95,-270,-285,-285,,,,,,,,,,,,,,DQ
90,SBD,Multi-ply,M,No,Evgeniy Doroshenko,Евгений Дорошенко,1983-02-01,Pro Open,86,280,-300,-300,,280,180,-190,-190,,180,250,270,,,270,730,1
90,SBD,Multi-ply,M,No,Anton Zherebtsov,Антон Жеребцов,1987-03-09,Pro Open,88.15,-230,230,-250,,230,-130,130,-140,,130,210,230,-250,,230,590,3
110,SBD,Multi-ply,M,No,Aleksandr Bozhko,Александр Божко,1979-03-19,Pro Open,104.9,280,300,-310,,300,-170,170,180,,180,270,280,,,280,760,1
125,SBD,Multi-ply,M,No,Aleksey Zherebtsov,Алексей Жеребцов,1979-06-10,Pro Open,122.7,-280,280,290,,290,160,170,-190,,170,240,260,,,260,720,1
110,SBD,Multi-ply,M,No,Andrey Belogubkin,Андрей Белогубкин,1996-05-23,Pro Teen 17-19,107.65,-260,260,-280,,260,-170,-170,-170,,,,,,,,,DQ
