Division,WeightClassKg,Place,Name,Team,BodyweightKg,Best3SquatKg,Best3BenchKg,Best3DeadliftKg,TotalKg,Equipment,Event,Sex
Boys,51.71,1,Eloy Garza,Corpus Christi West Oso,51.44,136.08,61.23,131.54,328.85,Single-ply,SBD,M
Boys,55.79,2,Blake Suarez,Corpus Christi Tuloso-Midway,51.89,127.01,65.77,131.54,324.32,Single-ply,SBD,M
Boys,51.71,3,Devin Cowen,Rockport-Fulton,50.17,97.52,45.36,113.4,256.28,Single-ply,SBD,M
Boys,55.79,1,Joe Castillo #4,Gregory-Portland,55.7,156.49,88.45,176.9,421.84,Single-ply,SBD,M
Boys,55.79,2,Mike Nunez,Corpus Christi West Oso,55.7,136.08,61.23,136.08,333.39,Single-ply,SBD,M
Boys,59.87,1,Marcos Lara,Mathis,59.15,165.56,111.13,183.7,460.4,Single-ply,SBD,M
Boys,59.87,2,Cody Hartman,Corpus Christi West Oso,59.51,167.83,106.59,179.17,453.59,Single-ply,SBD,M
Boys,67.13,3,Daniel Tortu,Corpus Christi West Oso,59.96,163.29,92.99,165.56,421.84,Single-ply,SBD,M
Boys,67.13,4,Jonathan Galvan,Corpus Christi Tuloso-Midway,59.96,147.42,92.99,154.22,394.63,Single-ply,SBD,M
Boys,59.87,5,Trevor DeLuna,Corpus Christi Tuloso-Midway,59.69,145.15,90.72,145.15,381.02,Single-ply,SBD,M
Boys,59.87,6,Noah Pena,Corpus Christi Calallen,58.42,122.47,77.11,140.61,340.19,Single-ply,SBD,M
Boys,59.87,7,Dylan Sharp,Sinton,58.06,113.4,74.84,124.74,312.98,Single-ply,SBD,M
Boys,67.13,DQ,Chantz Mickens,Corpus Christi Tuloso-Midway,59.96,,,,,Single-ply,SBD,M
Boys,59.87,DQ,Gabriel Quinones,Gregory-Portland,59.87,113.4,,,,Single-ply,SBD,M
Boys,59.87,DQ,Michael Baker,Gregory-Portland,58.33,113.4,,,,Single-ply,SBD,M
Boys,59.87,DQ,Aaron Shockley,Corpus Christi Calallen,59.87,,,,,Single-ply,SBD,M
Boys,67.13,1,Aaron Martinez,Corpus Christi Calallen,66.95,195.04,124.74,206.38,526.17,Single-ply,SBD,M
Boys,67.13,2,JP Ruth,Gregory-Portland,66.86,181.44,108.86,204.12,494.42,Single-ply,SBD,M
Boys,67.13,3,Alonzo Moya,Corpus Christi West Oso,64.77,185.97,99.79,206.38,492.15,Single-ply,SBD,M
Boys,67.13,4,Anthony Huerta,Gregory-Portland,64.05,174.63,117.93,197.31,489.88,Single-ply,SBD,M
Boys,67.13,5,Reed Anastasio,Gregory-Portland,64.86,136.08,90.72,161.03,387.82,Single-ply,SBD,M
Boys,67.13,6,Daniel Valenzuela,Ingleside,63.05,149.69,86.18,136.08,371.95,Single-ply,SBD,M
Boys,67.13,7,James King,Sinton,60.33,129.27,92.99,145.15,367.41,Single-ply,SBD,M
Boys,67.13,8,Raiden Windam,Gregory-Portland,65.68,142.88,70.31,136.08,349.27,Single-ply,SBD,M
Boys,67.13,9,Christian Acosta,Ingleside,66.22,106.59,72.57,127.01,306.17,Single-ply,SBD,M
Boys,74.84,1,Gabriel Cantu,Corpus Christi Calallen,73.21,217.72,117.93,249.48,585.13,Single-ply,SBD,M
Boys,74.84,2,Tristen Taylor,Rockport-Fulton,74.39,192.78,113.4,204.12,510.29,Single-ply,SBD,M
Boys,74.84,3,Taylor Nguyen,Rockport-Fulton,73.75,181.44,108.86,208.65,498.95,Single-ply,SBD,M
Boys,74.84,4,Christopher Lopez,Corpus Christi Calallen,73.12,165.56,120.2,181.44,467.2,Single-ply,SBD,M
Boys,74.84,5,Rey Borjon,Santa Gertrudis Academy,72.94,145.15,106.59,172.37,424.11,Single-ply,SBD,M
Boys,74.84,6,Rudy Perez,Ingleside,69.67,149.69,106.59,165.56,421.84,Single-ply,SBD,M
Boys,74.84,7,Raul Chapa,Corpus Christi West Oso,73.75,142.88,81.65,163.29,387.82,Single-ply,SBD,M
Boys,74.84,8,Miguel Silvas,Sinton,67.68,142.88,88.45,142.88,374.21,Single-ply,SBD,M
Boys,74.84,9,Alex Gandara,Corpus Christi West Oso,69.22,92.99,70.31,138.35,301.64,Single-ply,SBD,M
Boys,74.84,10,Steven Marshall,Rockport-Fulton,70.49,106.59,54.43,129.27,290.3,Single-ply,SBD,M
Boys,74.84,DQ,Bradley Allen,Rockport-Fulton,68.95,124.74,,,,Single-ply,SBD,M
Boys,74.84,DQ,Josef Garza,Mathis,73.66,,,,,Single-ply,SBD,M
Boys,82.1,1,Dustin Flores,Corpus Christi Calallen,80.1,195.04,147.42,217.72,560.19,Single-ply,SBD,M
Boys,89.81,2,Angel Casas,Corpus Christi Tuloso-Midway,82.19,210.92,133.81,208.65,553.38,Single-ply,SBD,M
Boys,82.1,3,Nazario Chapa,Aransas Pass,77.93,199.58,145.15,201.85,546.58,Single-ply,SBD,M
Boys,82.1,4,Alec Lara,Mathis,82.1,170.1,136.08,158.76,464.93,Single-ply,SBD,M
Boys,82.1,5,Chase Benavides,Corpus Christi Tuloso-Midway,80.1,154.22,92.99,172.37,419.57,Single-ply,SBD,M
Boys,82.1,6,Jonathan Castillo,Sinton,80.83,151.95,99.79,165.56,417.3,Single-ply,SBD,M
Boys,82.1,7,Keenan Nash,Gregory-Portland,77.29,122.47,77.11,131.54,331.12,Single-ply,SBD,M
Boys,82.1,DQ,Juan Ordeno-Ortiz,Gregory-Portland,81.37,97.52,,,,Single-ply,SBD,M
Boys,82.1,DQ,Jeremiah Munoz,Corpus Christi Tuloso-Midway,78.47,,,,,Single-ply,SBD,M
Boys,82.1,DQ,Sean Gonzales,Corpus Christi Calallen,80.01,219.99,,,,Single-ply,SBD,M
Boys,89.81,1,Karl Gibson,Mathis,88.63,238.14,131.54,226.8,596.47,Single-ply,SBD,M
Boys,89.81,2,JD Zapata,Rockport-Fulton,88.99,208.65,120.2,215.46,544.31,Single-ply,SBD,M
Boys,99.79,3,Jon Andrew Villarreal,Corpus Christi West Oso,89.99,204.12,122.47,208.65,535.24,Single-ply,SBD,M
Boys,89.81,4,Abel Rodriguez,Corpus Christi Tuloso-Midway,88.81,199.58,131.54,185.97,517.1,Single-ply,SBD,M
Boys,89.81,5,Martin Fonseca,Mathis,85.18,176.9,120.2,204.12,501.22,Single-ply,SBD,M
Boys,89.81,6,John Tanguma,Corpus Christi Calallen,87.09,170.1,117.93,213.19,501.22,Single-ply,SBD,M
Boys,89.81,7,Brandon Mejia,Corpus Christi West Oso,88.09,151.95,108.86,170.1,430.91,Single-ply,SBD,M
Boys,89.81,8,Raul Fernandez,Rockport-Fulton,88.36,174.63,95.25,158.76,428.64,Single-ply,SBD,M
Boys,89.81,9,John Castro,Corpus Christi Tuloso-Midway,88.9,151.95,102.06,149.69,403.7,Single-ply,SBD,M
Boys,99.79,DQ,Xavier Flores,Corpus Christi Calallen,89.9,190.51,,,,Single-ply,SBD,M
Boys,99.79,1,Frankie Lopez,Corpus Christi Tuloso-Midway,99.79,272.16,145.15,208.65,625.96,Single-ply,SBD,M
Boys,99.79,2,Charles West,Gregory-Portland,93.35,188.24,113.4,213.19,514.83,Single-ply,SBD,M
Boys,99.79,3,Johnathon Reinhart,Gregory-Portland,91.44,190.51,129.27,188.24,508.02,Single-ply,SBD,M
Boys,99.79,4,Arnold Molina,Sinton,97.52,172.37,113.4,181.44,467.2,Single-ply,SBD,M
Boys,99.79,5,Eric Espinoza,Sinton,97.07,165.56,106.59,156.49,428.64,Single-ply,SBD,M
Boys,99.79,6,Marvin Barton,Ingleside,97.7,158.76,99.79,158.76,417.3,Single-ply,SBD,M
Boys,99.79,7,Chase Higgins,Corpus Christi Tuloso-Midway,90.63,136.08,58.97,133.81,328.85,Single-ply,SBD,M
Boys,109.77,1,Zach Kwiatkowski,Corpus Christi West Oso,101.42,247.21,136.08,256.28,639.57,Single-ply,SBD,M
Boys,109.77,2,Ricardo Perez,Santa Gertrudis Academy,108.41,244.94,156.49,217.72,619.15,Single-ply,SBD,M
Boys,109.77,3,Matthew German,Rockport-Fulton,104.51,240.4,136.08,226.8,603.28,Single-ply,SBD,M
Boys,109.77,4,Javier Henderson,Mathis,108.32,272.16,142.88,188.24,603.28,Single-ply,SBD,M
Boys,109.77,5,Oscar Canton,Sinton,100.61,222.26,124.74,219.99,566.99,Single-ply,SBD,M
Boys,109.77,6,Josh Sturgeon,Corpus Christi West Oso,103.78,199.58,120.2,204.12,523.9,Single-ply,SBD,M
Boys,109.77,7,Seth Watts,Gregory-Portland,109.5,199.58,124.74,195.04,519.36,Single-ply,SBD,M
Boys,109.77,8,Adrian Rivas,Sinton,101.79,195.04,133.81,188.24,517.1,Single-ply,SBD,M
Boys,109.77,9,Christopher Monsevais,Corpus Christi Calallen,102.33,183.7,115.67,195.04,494.42,Single-ply,SBD,M
Boys,109.77,10,Michael Duenes,Gregory-Portland,108.14,183.7,111.13,185.97,480.81,Single-ply,SBD,M
Boys,109.77,11,Antonio Cantu,Sinton,107.23,158.76,127.01,174.63,460.4,Single-ply,SBD,M
Boys,109.77,12,Duque Waddill,Corpus Christi Calallen,105.14,142.88,102.06,145.15,390.09,Single-ply,SBD,M
Boys,109.77,13,Julian Beltran,Corpus Christi Calallen,108.14,127.01,74.84,136.08,337.93,Single-ply,SBD,M
Boys,109.77,DQ,Vince Gutierrez,Corpus Christi Tuloso-Midway,105.6,,,,,Single-ply,SBD,M
Boys,109.77,DQ,Nicholas Isaacks,Gregory-Portland,107.86,204.12,,,,Single-ply,SBD,M
Boys,109.77,DQ,William Withers,Gregory-Portland,104.14,,,,,Single-ply,SBD,M
Boys,124.74,1,Rene Gonzales,Mathis,121.47,294.84,192.78,233.6,721.21,Single-ply,SBD,M
Boys,124.74,2,Jacob Rodriguez #4,Corpus Christi Tuloso-Midway,123.01,285.76,154.22,251.74,691.73,Single-ply,SBD,M
Boys,124.74,3,Isaac Salinas #1,Gregory-Portland,119.2,267.62,170.1,235.87,673.58,Single-ply,SBD,M
Boys,124.74,4,Joey Rodriguez,Corpus Christi West Oso,118.3,215.46,120.2,204.12,539.77,Single-ply,SBD,M
Boys,124.74,5,Jeremy Trevino,Gregory-Portland,111.13,204.12,115.67,199.58,519.36,Single-ply,SBD,M
Boys,124.74,6,Anthony Cantu,Mathis,114.03,201.85,138.35,170.1,510.29,Single-ply,SBD,M
Boys,124.74,7,Jagger Weatherford,Gregory-Portland,119.02,176.9,113.4,167.83,458.13,Single-ply,SBD,M
Boys,124.74,8,Edward Hernandez,Corpus Christi Tuloso-Midway,114.58,165.56,90.72,129.27,385.55,Single-ply,SBD,M
Boys,124.74,DQ,Jaime Castillo #2,Corpus Christi Tuloso-Midway,111.04,,,,,Single-ply,SBD,M
Boys,124.74+,1,Mikey Esparza,Rockport-Fulton,127.37,254.01,181.44,226.8,662.24,Single-ply,SBD,M
Boys,124.74+,2,Ed Hernandez,Corpus Christi West Oso,144.06,222.26,120.2,179.17,521.63,Single-ply,SBD,M
