
<svg width="6px" height="6px" viewBox="0 0 6 6" @if ( $class ) class="{{ $class  }}" @endif xmlns="http://www.w3.org/2000/svg">
    <!-- Generator: Sketch 40 (33762) - http://www.bohemiancoding.com/sketch -->
    
    
    <defs></defs>
    <g id="Page-1" stroke="none" stroke-width="1" fill-rule="evenodd">
        <g id="Artboard-3-Copy-2">
            <polygon id="Rectangle-9" points="5 0 6 0 0 6 0 5"></polygon>
            <polygon id="Rectangle-9-Copy" points="6 5 6 6 5 6"></polygon>
        </g>
    </g>
</svg>