^F:\PROJECT\SKILLBOX\HOMEWORK4.12\HW_4_12\DEBUG\HW_4_12.OBJ
F:\PROJECT\SKILLBOX\HOMEWORK4.12\HW_4_12\DEBUG\HW_4_12.EXE
F:\PROJECT\SKILLBOX\HOMEWORK4.12\HW_4_12\DEBUG\HW_4_12.ILK
F:\PROJECT\SKILLBOX\HOMEWORK4.12\HW_4_12\DEBUG\HW_4_12.PDB
