^F:\PROJECT\SKILLBOX\HOMEWORK1_4\DEBUG\HOMEWORK1_4.OBJ
F:\PROJECT\SKILLBOX\HOMEWORK1_4\DEBUG\HOMEWORK1_4.EXE
F:\PROJECT\SKILLBOX\HOMEWORK1_4\DEBUG\HOMEWORK1_4.ILK
F:\PROJECT\SKILLBOX\HOMEWORK1_4\DEBUG\HOMEWORK1_4.PDB
