{
  "type": "service_account",
  "project_id": "vooxe-gamedistribution",
  "private_key_id": "d2ccbbfc0e0500888988d241db09e821a9becb02",
  "private_key": "-----BEGIN PRIVATE KEY-----\nMIIEvQIBADANBgkqhkiG9w0BAQEFAASCBKcwggSjAgEAAoIBAQC4nCb9x37l4tZe\ntrSTwnJqEeTwTe8odYU0kN5NRv+dQKRgVttKNQmlVRMfMn5p+no8lPb6FB/njJpM\nSvzLRcNJgYpINLhWxJsbjyJvamhEMxd/Ha3I1Y/CaHKp2XLu7qEEsiUBT7UHSurt\nX7eZyzVID4uJ/0x6shp2GJP7Cu8cm3gyHe7qY7pibEAU2bYL5DYsVV3Qlsg473UH\nt5JbrJIC5/KzdrLkyDB0TerWjc3pQZG77llE0Rt4t0sfR98qkMSdGeuHaX8a2m2u\nC25RSx3xlJyPAyHH7zAeuusnXEOlMhFDoau0w21sMQLuFIpC8q5XwBcEAEou8SGA\nfSpDCDLFAgMBAAECggEACbJH+QHquCPlOxXRH8axkEEu23FYe7FKhROL3Za6U9Xi\nnF3LiFcHUewJRFT4X1Qk6fwwCbwXXefcbd/tbbbVFk4Lx5WfTg1nEThAKIZ4AgcF\n96sFJvySn7UxOpsdho+5nN/Hgk1ftomYk824fMc33fhVDbM/Xt1udt/9G807+G5Z\n+JkYo/Ih4R+OWXGMVUmi7ixSs70SLYap/1+Cw98XyJOeJkaerQkbCdKRLaFY3bRz\nlRfUVNrjRVV2M63a+jxx1RGAzXsuKj/TfcCDNBX/z2YXVfOx4whaTm27Oy0zhNR6\ncsBx7fK1vD29yrz5MqQzYXxWsiIEKAhNNALgwFyP0QKBgQD78T1iN6IA5DUy4tEC\nOe4r6rU2mv8AKGavRuVNNsbkwSWKJuRr7c1SBPU07EcQa6dg7ezHtSI3bgehlHjy\nfkZ/YeLFsMdv0/9/b1G6kbfUBCzCwThezWfvYB5ef4dBSWIeSIZuGupnQwb6aF5+\nOA6LTrUZ2RcZjmh59De6Dz2N9QKBgQC7lUz2mRQtOxnYQz1at/PUdr58nmDiVBxz\nbEMY/ueZUChHRsYUWC3c0p9hb02/9aYkkUokBOk+RfEWKuwtbIFMkwo86bENjYtk\nhk5jvM7/OvZYRExdACAdHni6eW4kGghDgaZMiedTnumDz4WslIUzsuy+edH7zV0J\nnl/R8Z2/kQKBgHyO80souBZ6vPZwfub73w2lV3wsux/H2aSUh29aQpD8EOQxgEL/\n6b/AJb7JhgTPRIw+dQ7zNXx0EJ/I+NbiqVX2/hfA44kdJbdKQPzdaCYQ/lQ3FPiB\n0v3c5obPw/36GuFf995dvj/ZOoz4pqb+bepfuleSJcKDzpFktVxuhn81AoGAalLv\nA9uytwyH0rASJ8iauXPw9rvi2IaqdbYItjNN3PW1TulLvx5YKJFt65FmNYcsfA+q\nQY5TEowcYd9EbV7STzANHoerZq4zM3B5IElV3w9xsIhN7Gz0xuyNq8zGZEopIvJq\n63lDGH+7ho3rC+5HLg2d6T0ti5dUw+30DBDyxDECgYEAonuXKtRvwaMg51CHvbx+\n6b1qD66UpnwFS0ZB8w5zZBurYrmk2PwLWfUslna5cnv/fwoA6dsReZHM/VA3PdgJ\ndeuqmS0occXNkoComX8XDEXEBEwgKChM8bLp+JCZp6+rKLsohwqWyh1GI+vy56q7\nbudNKnOzLYQXlMpIg5gT8FY=\n-----END PRIVATE KEY-----\n",
  "client_email": "gd-service-account@vooxe-gamedistribution.iam.gserviceaccount.com",
  "client_id": "106319457138081982891",
  "auth_uri": "https://accounts.google.com/o/oauth2/auth",
  "token_uri": "https://accounts.google.com/o/oauth2/token",
  "auth_provider_x509_cert_url": "https://www.googleapis.com/oauth2/v1/certs",
  "client_x509_cert_url": "https://www.googleapis.com/robot/v1/metadata/x509/gd-service-account%40vooxe-gamedistribution.iam.gserviceaccount.com"
}
