ID,surname,middle.name,first.name,gender,Smoker,systolic_bp,diastolic_bp,Age,height,weight,RandomBSL,DiabetesDiagnosis,MAP
500494,PISCOPIO,Shedrick,Paris,Male,False,106,92,39,138,59,6.0,False,96.7
288850,HOWARD,,Gina,Female,False,131,82,60,178,77,4.9,False,98.3
160907,SMITH,,Phoua,Female,False,132,87,91,158,42,5.8,False,102.0
436848,CHUI,,Nevin,Male,False,135,80,50,155,66,3.1,False,98.3
553819,,,"Khatanbaatar, Erik",Male,False,125,21,49,183,98,7.2,True,55.7
138563,ECCHER,,Sarah,Female,True,132,89,88,142,129,2.9,False,103.3
903107,CASTILLO,Joshua,Kya,Male,False,131,87,81,178,NA,3.4,False,101.7
3866,GOMEN,Ryan,Pharwit,Male,True,130,88,73,169,80,5.9,False,102.0
970189,DOYLE,,Marcus,Male,False,118,71,17,172,73,0.7,False,86.7
67921,CASTER,Jien,Ameya,Male,True,135,81,87,163,97,5.2,False,99.0
805332,VILLALOBOS-VARGAS,Allyssia,India,Female,False,120,81,NA,143,119,5.6,False,94.0
616612,VELASQUEZ,,Wambli,Male,False,143,90,77,170,98,2.8,False,107.7
519731,EDDINGS,,Kirsten,,False,135,81,80,183,72,4.5,False,99.0
654726,VENTLING,,Gabriela,Female,True,121,85,96,128,67,6.3,True,97.0
61067,Austin Rivera,NA,NA,Male,True,105,85,86,182,89,6.3,False,91.7
208424,POPE,,,Female,True,122,84,NA,173,61,4.7,False,96.7
441887,,,"Ahn, D'Ondre",NA,True,115,84,54,184,111,4.3,False,94.3
593281,TOWNE,Justice,Edward,M,True,117,78,50,179,67,5.9,False,91.0
299002,,,"Norton, Tailor",Female,False,119,84,29,173,48,5.2,False,95.7
570305,DUNN,Allana,Anestahia,Female,True,127,72,25,159,NA,5.2,False,90.3
608372,MEHROTRA,Tomasik,Tyler,Male,False,125,81,65,171,75,4.9,False,95.7
927364,NA,NA,Zion Macdougall,NA,True,120,86,96,193,98,4.5,False,97.3
788460,HEELAN,,Brenda,Female,True,123,90,83,157,52,NA,False,101.0
314500,RIKKE,,Jerel,Male,True,134,73,58,191,83,4.8,False,93.3
150088,STEWART,,Matthew,Male,True,125,78,63,151,50,NA,True,93.7
611301,RODRIGUEZ-MERCADO,,NA,Female,True,145,78,25,183,99,6.8,False,100.3
688412,LEWIS,Evelyn,Kalene,Female,True,132,85,34,159,60,7.7,False,100.7
348569,BRUNER,,Kyle,Male,True,122,79,26,156,42,NA,True,93.3
73019,MASSEY,,David,Male,True,128,79,24,NA,64,4.4,False,95.3
329938,NGUYEN,,Angelo,Male,False,120,82,96,156,45,3.7,False,94.7
317500,MCINTOSH,,NA,Female,False,122,76,55,182,79,5.7,False,91.3
483383,,,"Maxwell, Brianna",Female,True,323,95,95,188,60,3.5,False,171.0
521290,ELLERBEE,,Hannah,Female,False,137,73,81,NA,93,5.6,True,94.3
735247,FOWLER,,Megan,NA,True,NA,73,18,170,NA,3.8,False,
242192,LEHI,,Dominique,Male,True,129,80,79,167,58,3.4,False,96.3
640161,REM,,Alton,Male,True,127,89,83,175,43,6.6,False,101.7
868431,CLARK,,Spencer,Male,True,121,33,45,NA,68,NA,False,62.3
355717,WILLIAMS,Cherokee,Lauren,NA,False,130,79,57,147,83,7.1,False,96.0
96641,DOMINGO JR,,Erick,Male,True,123,91,86,167,NA,7.4,True,101.7
294719,LECHUGA,,Autumn,Female,True,130,83,51,178,64,5.5,False,98.7
902610,ZEIGLER,,Natalie,Female,True,117,80,92,196,62,7.3,False,92.3
577043,BARR,,Joshua,NA,True,130,NA,24,188,80,4.0,False,
190625,ABACHICHE,,Bao,Male,False,135,89,34,157,70,6.5,False,104.3
540977,ARROYO,,Shamika,NA,False,123,80,27,159,102,4.2,False,94.3
930156,LORENZ,,Samantha,Female,True,124,NA,55,180,58,1.0,False,
852786,LOBATO,,Raymond,Male,True,291,73,23,166,50,6.1,False,145.7
977947,CHEN,Daniel,Antonio,Male,True,132,77,69,166,NA,5.2,False,95.3
494138,,,"Domingo Jr, Imane",Male,True,124,84,83,163,84,5.4,False,97.3
270004,SANDERS,,Mahalia,,False,136,76,68,184,65,NA,False,96.0
105000,JOHNSON,,Timothy,Male,True,127,80,59,160,93,4.7,False,95.7
235913,HESS,,Caleb,Male,True,116,81,28,175,95,NA,False,92.7
481902,TRAN,Darren,Nicholas,Male,True,120,80,97,168,63,3.6,False,93.3
118998,JONES JR,,Cindy,Female,False,127,93,76,158,75,5.3,False,104.3
177946,BOYER,Shannon,Shelby,Female,True,121,82,58,133,83,2.4,False,95.0
485283,BAKER,,Karina,Female,NA,122,84,NA,154,89,4.7,False,96.7
509264,hoffmann,,Jazmyn,Female,False,133,84,50,181,63,2.6,False,100.3
19769,MALONE,,Michael,NA,True,126,93,41,173,64,5.3,False,104.0
593372,davies,,Deborah,Female,True,129,32,93,179,79,2.7,False,64.3
151778,Lisa Archuleta,NA,NA,Female,True,118,88,86,172,64,4.1,False,98.0
376474,CHATMAN,,Devin,Male,True,124,77,64,166,68,8.3,False,92.7
358969,PETRONI,Royce,NA,NA,False,123,71,72,163,70,5.5,False,88.3
282487,ASHLOCK,,Lazaro,Male,False,132,85,37,171,34,1.8,False,100.7
406135,,Juan,Jose,Male,True,121,71,89,141,65,6.7,False,87.7
439251,CASTLETON,,Vanessa,Female,True,116,84,21,175,63,4.4,False,94.7
167065,MYRICK,,,Female,True,122,85,60,203,49,6.4,False,97.3
391227,KING,,Evan,Male,False,121,82,69,166,62,4.0,False,95.0
355633,ROBINSON,,Danesha,Female,False,122,82,69,183,88,2.5,False,95.3
842236,ELLIOTT,Jenai,Kayla,Female,True,117,80,38,175,40,3.7,False,92.3
321030,KIM,,Zackariah,Male,False,130,78,31,193,98,NA,True,95.3
933303,,Jennell,Marissa,Female,True,129,84,32,176,58,1.9,False,99.0
823424,BELL,,Estefany,Female,True,129,74,35,157,NA,5.2,False,92.3
237542,,Jocelyn,Charlotte,Female,False,123,32,68,142,88,7.8,False,62.3
330676,WALLACE,Mariah,Kaila,Female,True,118,76,24,188,53,5.2,False,90.0
134463,NAKAI,Carlos,Cody,Male,False,135,79,96,142,101,6.1,False,97.7
650520,RIVERA,,Wakiyan,Male,True,129,82,26,162,70,5.9,False,97.7
740626,PARSONS,,Elias,Male,True,124,80,63,171,55,4.9,False,94.7
126764,MOSS,,Camaris,NA,True,122,85,43,169,90,4.7,False,97.3
105935,GRIGSBY,,Arianna,2,True,135,80,46,189,58,6.4,False,98.3
829288,BROWN,Damian,Sage,Male,False,119,77,16,156,62,4.6,False,91.0
244382,Dion Nguyen,NA,NA,Male,True,131,85,40,189,121,4.8,False,100.3
570794,LARIOS,,Fortun,Female,True,135,84,28,206,122,5.6,False,101.0
697846,LEE,Uriel,Jeremias,NA,True,123,85,23,184,76,5.9,False,97.7
653330,VANG,Dawan,Aric,Male,False,119,73,77,NA,69,1.0,False,88.3
307974,NERE,,Daniel,Male,False,125,38,73,189,101,4.5,False,67.0
754019,JACKET,,Eric,Male,False,114,83,64,165,61,6.1,False,93.3
558686,CARBAJAL,Esther,Helen,Female,False,120,85,88,176,58,5.5,False,96.7
939065,HERNANDEZ,,Andres,Male,True,121,79,73,169,92,6.1,False,93.0
874457,TREXLER,,Elizabeth,NA,False,119,80,40,179,77,5.2,False,93.0
124437,NA,NA,Alfredo Tobin,Male,True,128,77,78,171,NA,4.1,False,94.0
138517,TORRES,,Brandon,NA,False,118,82,74,187,72,6.1,False,94.0
323265,CARNIVAL,Alyssa,Ana,Female,NA,115,78,18,180,91,4.6,False,90.3
914031,,,"Trujillo, Nhan",Female,False,124,33,17,160,68,6.0,False,63.3
832767,TAASE,Jordan,Laderian,Male,True,131,88,18,142,68,3.2,False,102.3
933341,NA,,Elizabeth,Female,False,128,27,69,184,77,4.9,False,60.7
108274,WAMPLER,,Lara,Female,False,121,86,76,180,55,4.3,False,97.7
856463,GARCIA,,Guang,Male,False,117,71,16,154,86,5.1,False,86.3
792225,MORGAN,,Summer,Female,True,123,98,91,158,NA,7.6,NA,106.3
298555,MAESTAS,,Gia,Female,False,119,NA,32,NA,55,4.0,False,
746724,WILSON,Mckenzy,Elena,Female,True,125,83,17,188,68,5.4,False,97.0
84592,BENEDETTI,,Daniela,Female,False,124,82,63,174,62,6.0,False,96.0
853429,ROMERO,,Tashari,Female,False,127,80,25,165,92,7.2,False,95.7
65619,RAYFORD,,Drew,Male,True,127,83,80,142,96,2.0,False,97.7
487648,DIKES,,Amy,Female,True,128,77,87,202,101,4.6,True,94.0
425705,,,Michal,Female,False,125,76,78,166,86,2.9,False,92.3
583452,KERRIDGE,Charity,Carissa,Female,True,137,70,97,172,67,4.7,False,92.3
797370,SHEPHERD,Rose,Kristin,Female,True,129,82,32,186,81,7.7,False,97.7
679421,NA,NA,Dezarae Spaulding,NA,False,123,79,78,185,142,5.6,False,93.7
805463,LEE,,Shakeer,Male,False,134,82,72,142,74,5.5,False,99.3
498228,JACOBSEN,Lesly,,Female,False,127,91,42,184,68,3.5,False,103.0
485135,LUNA,,Gabriel,Male,False,124,80,53,191,63,3.7,False,94.7
698531,DYE,,Vincent,Male,False,126,84,71,173,NA,2.9,False,98.0
358878,MATSUMOTO,,Berhanmeskel,Male,True,134,79,45,174,66,5.5,False,97.3
942597,MOORE,Kara,Vanessa,Female,False,122,90,94,179,82,5.0,False,100.7
847682,ROMERO,,Toni,2,True,130,79,77,172,106,8.1,False,96.0
227677,URQUIDEZ,Kentorra,Alicia,Female,False,129,NA,73,195,54,3.7,False,
16266,,Caleb,Jemal,Male,True,281,75,91,181,88,3.1,False,143.7
574281,ROGERS,Patrick,Daniel,Male,True,122,81,52,NA,42,3.4,False,94.7
230681,ARAGON,Erica,Katherine,Female,False,133,80,17,152,76,1.3,False,97.7
70590,WELCH,James,Dylan,Male,True,136,81,27,175,104,4.3,False,99.3
621096,HAMMOND,,NA,Male,True,128,74,59,186,42,7.5,False,92.0
669167,MCPHERSON,,Frances,Female,True,126,84,27,167,56,2.1,NA,98.0
862447,TRAN,Edward,Elijah,Male,False,128,78,21,180,NA,3.1,False,94.7
924211,ROMERO,,Shannon,Female,True,330,89,26,186,56,4.9,False,169.3
467208,,,Ahnaf,Male,True,132,79,68,177,85,2.5,False,96.7
431494,NA,,Taraneka,NA,True,130,84,20,136,NA,6.9,False,99.3
159190,HSIUNG,,Francisco,Male,False,117,80,43,184,62,3.7,False,92.3
396021,BRASHEARS,,Kylie,Female,NA,128,78,18,154,78,4.3,False,94.7
216825,MILLAR,,Chelsy,Female,True,128,25,40,158,44,NA,False,59.3
694407,RIOS,Taylor,Kaylin,Female,False,123,82,62,170,50,3.3,False,95.7
505228,JAY,Loagyn,Kyana,Female,False,137,88,71,184,68,3.8,True,104.3
545327,CURRY,,Jacob,,False,121,NA,28,181,NA,4.3,False,
172925,DE LOS SANTOS GARCIA,Nykia,Miriah,NA,False,121,81,17,181,96,6.0,False,94.3
578863,NA,Katie,Amber,Female,True,130,84,22,NA,75,NA,False,99.3
487271,GONZALES,,Briana,Female,False,127,81,87,193,83,8.9,False,96.3
498190,TORREZ,,Cameron,Male,False,128,77,80,158,82,3.4,False,94.0
750208,HARVEY,Jaylene,Mariah,Female,NA,120,81,68,208,49,5.7,True,94.0
558567,,Gabriel,Nicolas,Male,True,112,85,98,162,67,4.1,False,94.0
136146,BRUCE,,Claudia,Female,False,137,72,31,180,70,5.6,False,93.7
706300,MCMILLAN,,Mercelia,Female,False,128,72,17,194,89,3.8,False,90.7
525010,WEST,,Garrett,Male,False,130,72,38,159,76,5.6,False,91.3
58910,COLEMAN,,Nickolas,Male,True,125,82,63,190,60,4.5,False,96.3
647096,ABRAMS,,Colin,Male,True,142,67,16,159,69,0.8,False,92.0
549663,QUINONEZ,,NA,Female,False,314,84,89,189,110,6.2,False,160.7
87881,JACKSON,Justin,Eric,Male,True,125,78,NA,168,NA,5.4,False,93.7
835463,choi,,Jeremiah,Male,True,119,89,40,161,85,NA,False,99.0
667395,BOWEN,,Callison,Female,True,303,75,68,151,52,9.3,NA,151.0
677479,SHOBE,Kami,Tanisha,Female,True,126,82,81,161,64,7.5,False,96.7
633613,WARE,Jose,NA,Male,True,126,78,81,187,74,5.8,False,94.0
857544,NA,NA,Lauren Rex,Female,True,129,77,81,204,63,3.3,False,94.3
646278,WILSON,,NA,Female,True,118,79,72,155,62,3.0,False,92.0
46970,ORTIZ,Henry,Matthew,Male,False,125,79,27,181,80,4.2,False,94.3
974478,COOPER,,Brandon,Male,False,131,85,88,181,82,4.4,False,100.3
4182,KOONTZ,,Long,Male,True,122,NA,37,153,81,6.5,False,
88725,GARCIA,Chantell,Autumn,Female,True,135,81,34,179,78,2.9,False,99.0
710105,MATTE,,,Female,True,123,79,45,177,74,3.4,False,93.7
361482,LUJAN,,Breana,NA,False,115,85,93,166,68,NA,False,95.0
334112,KINNEY,,Zoe,Female,False,126,85,31,182,87,3.8,False,98.7
287116,HARPER,,Brianna,Female,True,128,82,63,184,119,2.4,NA,97.3
720612,GRAY,,Jessica,Female,False,125,85,38,157,68,4.6,False,98.3
252077,BARNETT,,Toni,Female,True,129,70,64,136,80,5.2,False,89.7
602217,CURLIN,,,Male,False,318,NA,46,179,76,5.5,False,
582854,CARLSON,Katelyn,,Female,False,120,82,32,159,102,5.8,False,94.7
284265,CHA,,Markus,Male,NA,126,82,40,153,52,7.9,NA,96.7
927990,LIAL,,Othell,Male,True,127,91,66,130,120,8.0,False,103.0
565552,coburn,,Ashley,Female,False,128,69,28,185,75,6.2,False,88.7
255670,COTTONWOOD,,Hendrick,NA,False,130,78,26,148,67,5.6,False,95.3
384044,AHMED,Bradley,Abysolome,Male,True,125,83,33,158,88,3.1,False,97.0
730180,MARTINEZ,Deandra,Jamya,Female,True,136,84,39,150,42,7.4,True,101.3
686251,LITTLE,Mitchell,De'Von,NA,True,128,74,71,161,106,6.4,False,92.0
90812,,,Myron,Male,False,117,85,26,154,63,4.9,False,95.7
940680,CONE,,Majdi,M,True,122,88,48,189,72,6.3,False,99.3
432634,,,Christian,Male,False,125,86,NA,159,100,NA,False,99.0
845112,CARSON,Jonathan,Siale,Male,True,122,81,49,163,86,4.9,False,94.7
731718,APTIDON,,Christina,Female,False,131,87,81,128,73,NA,False,101.7
533170,ORTIZ,,Chelsea,Female,True,118,89,90,169,57,6.3,False,98.7
100928,ALFEROS,Martin,Jonathan,NA,False,127,84,65,172,NA,7.8,False,98.3
831817,EDWARDS,Russell,Nrsimhadeva,Male,True,121,81,73,183,74,NA,False,94.3
634658,HARMON,,Laura,Female,False,123,75,48,154,60,4.4,False,91.0
858735,WILSON,Cole,Brian,Male,False,130,87,34,169,48,2.6,False,101.3
899785,MCKEAN,,Brittney,Female,False,123,90,39,146,122,6.9,True,101.0
65845,JOHNSON,,Tyler,Male,True,133,79,95,155,NA,5.0,False,97.0
802789,CARMODY,,Celia,Female,True,115,80,65,167,62,5.0,False,91.7
526302,CLAWSON,,Angela,Female,False,117,76,46,175,42,4.9,True,89.7
964329,KING,,Taylor,NA,True,120,81,96,176,56,3.8,False,94.0
871357,asher,,Asine,NA,True,124,81,89,195,64,4.8,False,95.3
294932,KIRKLIN,,Keshla,Female,False,127,85,83,177,76,6.8,False,99.0
355297,MEDINA,,NA,Female,True,126,77,16,163,70,3.4,False,93.3
522123,JONES-CARROLL,,,M,True,124,82,77,171,66,6.1,False,96.0
846532,LENAHAN,,Alondra,Female,True,134,82,77,159,86,4.1,False,99.3
595030,LYNCH,,Nicholas,Male,True,125,79,50,186,86,5.6,False,94.3
874877,CASTANEDA,,William,Male,False,125,NA,53,192,78,5.0,False,
829152,HOUDEK,Keith,Landon,Male,False,135,82,NA,170,94,1.9,False,99.7
687113,AGGERS,Alondra,Tiegen,NA,True,122,78,54,142,81,6.6,NA,92.7
961827,RODRIGUEZ CASILLAS,Ceairra,Ashley,Female,False,133,81,66,199,126,5.7,False,98.3
646427,CANTRELL,Benjamin,Hyuk,Male,False,124,79,87,156,59,7.0,False,94.0
133789,ULZIIBAT,,Manuel,Male,False,134,74,97,163,67,4.4,False,94.0
258195,THOMAS,Jake,Noah,Male,False,120,70,42,156,71,4.9,False,86.7
697447,CARNEY,,Lilstar,Female,False,122,77,82,185,68,NA,False,92.0
957078,RUIZ-APODACA,,Jillian,Female,True,121,NA,39,160,81,8.8,NA,
333921,REA,,Trenton,Male,True,131,79,61,181,83,4.2,False,96.3
69148,HILLYER,,Janette,F,True,306,87,73,182,98,6.4,False,160.0
213285,WHITAKER,,James,Male,True,123,85,77,161,78,8.7,False,97.7
891787,RODRIGUEZ,,Gia,Female,True,129,85,68,174,71,3.7,False,99.7
969066,METZLER,,Shyan,Female,True,136,88,33,167,58,7.0,False,104.0
46375,MEDINA,,Danielle,Female,True,122,88,90,172,83,9.3,False,99.3
138620,LIVINGSTON,Jhaciel,Nicholaus,Male,True,318,74,61,177,93,3.9,False,155.3
234102,GRANATO,,Natalia,Female,False,121,68,68,161,57,6.3,False,85.7
344971,VILLEGAS,,Breanna,Female,False,124,77,85,158,86,2.0,False,92.7
783174,WINSTON,,Joshua,M,False,128,78,24,156,63,9.6,False,94.7
544059,HAIR,Corrinthia,Hannah,Female,True,119,88,53,160,106,6.2,False,98.3
373719,,,"Seger, Laura",Female,True,116,74,36,NA,61,3.1,False,88.0
247371,REESE,,Dakoda,1,True,131,80,78,193,57,4.1,NA,97.0
708887,ROBERTS,,Rachel,Female,True,126,79,46,173,NA,8.0,True,94.7
985260,HAM,Olivia,Sonja,Female,True,135,80,33,183,83,6.4,False,98.3
650900,AMADOU,,Tyler,Male,False,125,79,29,178,69,3.2,False,94.3
437904,LEE,,Alan,Male,False,128,82,24,189,53,5.2,False,97.3
18941,NGUYEN-DUONG,,Timothy,Male,True,131,87,80,188,55,4.7,False,101.7
511806,MEEKS,,Jesse,Female,False,122,84,44,162,55,2.4,False,96.7
590837,SUMMERS,Kristin,NA,Female,False,126,75,75,183,58,6.5,False,92.0
79601,NA,Sheyla,Marta,Female,False,124,80,NA,153,84,7.2,False,94.7
667300,JENSEN,Alannah,Bethany,Female,False,129,72,NA,171,94,3.7,False,91.0
617734,HERNANDEZ,Jasmine,Akila,Female,False,115,74,25,151,71,3.3,False,87.7
876715,LEE,,Zachary,Male,False,141,83,87,139,105,5.0,False,102.3
97004,CLARK,,Michael,Male,False,121,83,74,159,110,3.5,False,95.7
595921,NA,NA,Jeremy Yancey,Male,True,126,88,40,137,63,6.5,False,100.7
13284,KOWALSKI,,Christina,Female,NA,131,82,62,179,80,2.2,True,98.3
227832,WILLIAMS,Kyla,Brianna,2,True,131,72,88,176,88,2.8,False,91.7
612336,SMITH,,Sierra,Female,True,128,20,84,161,76,3.0,False,56.0
905549,ORTEGA,Makayla,Alexia,Female,True,124,81,24,183,76,9.0,False,95.3
826990,TRUAX,,,Female,False,134,70,50,NA,80,8.1,False,91.3
342399,kobayashi,,Dion,Male,False,124,NA,54,176,66,4.9,False,
60352,POLK,Christopher,Jeremy,Male,False,120,75,26,178,76,6.1,False,90.0
541837,SANDOVAL,,Victoria,Female,False,123,87,51,180,58,5.8,False,99.0
822786,EANES,,Michelle,Female,True,131,74,89,156,64,4.0,False,93.0
978501,KING,Maria,Jordan,Female,True,128,76,68,166,49,3.2,False,93.3
742526,POUGH,Jordan,Elliott,Male,True,127,81,47,156,74,3.7,False,96.3
745833,PRAK,Joseph,Guillermo,Male,False,129,73,29,152,62,NA,False,91.7
56084,MORFORD,,Jared,Male,True,131,81,NA,178,71,5.7,False,97.7
868407,,,Makinzy,Female,True,129,82,68,170,86,3.2,False,97.7
812464,BLAEHOLDER,Jeremiah,Farrell,Male,True,123,83,41,177,91,5.5,False,96.3
961394,COUCH,,Owen,,False,112,73,36,154,116,7.7,False,86.0
662632,FRESQUEZ,Lateisha,Chierika,Female,False,124,79,42,172,56,6.3,False,94.0
812055,NA,NA,Dylan Tigg,Male,True,125,83,51,213,82,5.4,False,97.0
723664,ZUEHLSDORFF,,Camarin,Female,True,125,79,77,151,75,4.1,False,94.3
675109,WILLMAN,,Samantha,Female,False,128,78,77,194,61,5.1,False,94.7
885975,MULLINIX,,Alyson,Female,False,123,85,64,170,93,5.5,True,97.7
964218,CHAVEZ,,Byron,Male,True,129,80,58,172,60,10.7,False,96.3
412819,COLEMAN,,Baylen,Male,True,134,72,NA,167,42,2.7,False,92.7
248407,GROSSMAN,Samantha,Bailey,Female,True,124,84,38,168,81,4.2,False,97.3
813044,NA,NA,Michael Novick,Male,True,124,77,77,174,97,NA,True,92.7
623773,VANCE,Chykeiljah,Cheyenne,Female,True,130,83,88,NA,88,7.2,False,98.7
539821,NANGAH,Breanna,NA,Female,False,119,73,71,174,73,5.4,False,88.3
360952,ROSAS,,Anna,Female,False,120,82,34,157,81,5.8,False,94.7
228388,FARRIS,,Nicholas,Male,True,118,70,NA,157,79,3.2,False,86.0
478506,KANG,,David,Male,False,123,80,33,155,76,6.5,False,94.3
520278,TORKELSON,,Kaylah,Female,True,NA,84,98,163,144,2.0,False,
532854,NA,NA,Tylor Henderson,Female,True,128,77,23,173,75,8.1,False,94.0
845573,BUSTAMANTE,Kevin,Ian,Male,False,128,88,81,160,89,8.2,False,101.3
807361,COLTER,,Christian,Female,False,124,71,93,189,78,4.1,False,88.7
697008,LOW,,Desmond,Male,False,131,86,47,175,77,5.4,False,101.0
572680,KRAVCHIN,,Tevin,Male,False,122,94,82,205,73,2.8,False,103.3
792175,NA,,Alexandra,Female,False,125,78,41,156,70,6.8,False,93.7
361665,DEWIND,,Karen,NA,True,135,87,75,170,94,3.5,False,103.0
62952,,,"Johnson, Markese",Male,False,115,83,44,147,74,4.2,False,93.7
153095,SCHELL,Ted,Alex,Male,True,318,75,77,153,60,3.5,False,156.0
375808,,,"Fenton, Heather",Female,False,127,84,48,194,46,3.7,False,98.3
462218,WATTS,,Joshua,Male,False,135,82,78,166,65,6.3,False,99.7
288833,DRAKE,,Lara,Female,False,121,84,NA,166,93,2.8,False,96.3
736467,BACK,Auzjarae,Taylor,Female,False,131,86,NA,192,62,6.4,True,101.0
553237,REYES,Danielle,Laura,Female,False,119,83,80,170,68,4.5,False,95.0
34899,SMALLEY,Kaylee,Christina,Female,False,117,79,65,180,92,6.6,False,91.7
703345,,,"Mccoy, Katherine",NA,True,129,83,48,155,99,5.5,False,98.3
475995,WEASEL BEAR,,Patrick,1,NA,129,77,NA,189,46,6.1,False,94.3
436820,ARNOLD,Tania,Sasha,Female,False,130,22,91,169,46,6.4,False,58.0
459641,MIZER,,NA,Female,True,128,92,76,NA,86,5.7,False,104.0
137772,PASLEY,,Ryan,Male,False,130,72,63,169,NA,NA,True,91.3
18347,BOHN,Elizabeth,Caitlin,2,True,125,68,87,160,90,4.6,False,87.0
83334,ORONA,,Michael,Male,True,127,86,NA,144,69,0.5,NA,99.7
643622,MACHISA,,Tyreisha,Female,True,109,83,77,172,129,5.7,False,91.7
12673,NA,NA,Jeremy Fink,Male,False,119,72,19,185,63,6.4,False,87.7
872088,LUCAS,,Charles,Male,False,123,88,93,173,65,6.6,True,99.7
14710,MARTINEZ,,Shenandoah,Male,True,135,73,82,140,NA,2.8,False,93.7
344160,MOODY,,Olivia,Female,False,131,81,28,164,52,6.3,False,97.7
460143,Christina Widner,NA,NA,Female,True,128,75,16,176,54,2.7,False,92.7
144994,,,"Perez, Tracey",Female,False,115,83,56,134,75,5.2,False,93.7
747221,BOYLE,,Kensie,Female,True,135,74,47,213,53,6.9,False,94.3
278661,LEVENGOOD,,,Male,False,130,79,46,176,88,4.6,NA,96.0
676665,STOSOVIC,Corrie,Jessica,Female,False,133,81,94,160,66,3.9,False,98.3
620576,NA,NA,Sharon Lowe,Female,True,123,87,20,168,NA,4.0,False,99.0
532065,NIDEY,,Shelby,Female,False,129,76,30,166,67,7.0,False,93.7
488554,JOHNSON,,Bradley,Male,True,119,80,16,197,92,5.1,False,93.0
996491,SHAW,Dominic,Jose,Male,True,129,79,39,171,83,4.5,False,95.7
438287,SIWA,,Derrick,Male,True,131,77,58,180,89,4.9,False,95.0
92461,KEELER,,Irving,Male,False,125,85,34,NA,102,6.7,False,98.3
165029,BYRNES,Jung,Ellis,NA,True,135,38,52,157,75,NA,False,70.3
474431,FORNEY,,Survoy,Male,False,122,77,89,168,68,11.2,False,92.0
593142,GILMORE,Taylor,Devin,Male,False,125,81,25,166,65,4.6,NA,95.7
333127,DECKER,Kaci,Keely,Female,True,137,81,81,179,68,6.8,False,99.7
979465,JAMISON,,,Male,False,129,81,27,156,73,3.8,False,97.0
29268,BRETT,,Carlos,Male,True,128,84,73,154,61,7.4,False,98.7
4361,MITCHELL,,Lucia,Female,False,141,81,82,166,69,6.8,False,101.0
416003,NATICHIONI,,Brenna,Female,False,134,78,67,187,86,1.7,False,96.7
760768,HOLDER,,Sourob,Male,True,124,77,19,167,51,0.9,False,92.7
430107,CHEUNG,Travis,Omar,NA,True,121,78,22,157,58,6.5,True,92.3
128279,SMITS-KAGOSHIMA,,Haven,Male,False,128,85,16,172,88,4.5,False,99.3
241993,NA,NA,Alec Chittum,Male,False,126,88,35,155,61,NA,False,100.7
545798,RASCON ORTEGA,,Wallis,NA,True,130,38,56,161,NA,5.0,False,68.7
555181,NA,NA,Samone Marroquin,NA,True,134,72,85,197,66,3.2,NA,92.7
665915,MOORE,,Eric,Male,True,117,71,96,155,125,2.6,False,86.3
531975,WARREN,,James,Male,False,115,70,28,186,51,5.1,False,85.0
981574,,,Robert,Male,False,132,73,83,169,68,3.3,True,92.7
751702,GRAHAM,,NA,Male,True,136,82,37,181,56,6.2,False,100.0
539826,,,"Hsiung, Marciece",Male,True,125,89,50,159,49,6.1,False,101.0
437975,LEE,,Vincent,1,True,114,77,46,174,51,3.3,False,89.3
807738,exline,,Rachel,Female,False,114,73,29,177,NA,6.8,False,86.7
190206,PARRA BECERRA,,Essence,NA,True,124,79,64,163,65,8.0,False,94.0
446811,XIONG,,Jose,Male,True,128,83,38,167,79,8.4,False,98.0
674975,PARAPAT,Gabriel,Nikolas,Male,False,132,83,93,176,72,5.2,False,99.3
611231,AHUNA,Ruben,Juan,Male,True,137,NA,98,167,69,7.6,False,
694148,hammond,,Dominique,Male,True,129,81,NA,146,73,3.5,False,97.0
708887,MANNING JR,,Luanne,Female,True,125,79,50,179,75,7.0,False,94.3
484210,Michael Yazzie,NA,NA,NA,True,121,75,73,146,63,6.2,False,90.3
619568,DANIELS,Kristen,Consuello,Female,True,125,28,95,175,64,5.5,NA,60.3
499998,,Blessy,Sabine,Female,True,121,78,81,181,82,7.1,False,92.3
888357,PRUET,Kai,Michael,Male,False,132,74,79,166,NA,NA,False,93.3
244754,VELASQUEZ,,Shengh,F,False,140,75,71,139,58,4.9,False,96.7
712631,MCVAY,,Daniel,Male,True,297,83,97,159,31,5.8,False,154.3
610942,Alexander Pham,NA,NA,Male,True,123,85,29,149,NA,6.9,False,97.7
770662,TAYLOR,,Danielle,Female,True,126,80,46,150,129,3.5,False,95.3
335788,,,"Duncan, Hanna",Female,True,NA,81,60,197,57,4.5,False,
180780,HINOJOSA,,April,Female,True,126,75,60,168,68,6.3,True,92.0
420297,XU,,Stephon,Male,False,120,80,58,159,67,3.1,False,93.3
969211,LAMBERT,,Juanita,Female,False,129,78,75,142,113,7.6,False,95.0
634962,FELICIA,,Macey,Male,NA,124,84,41,159,42,NA,False,97.3
139086,BENALLY,Maninder,Ryan,Male,False,125,74,98,164,75,NA,False,91.0
90844,KNIGHT,Monica,Elizabeth,Female,True,116,86,97,166,86,3.1,False,96.0
984093,CRUZ,,Jade,Female,True,116,79,72,183,58,5.7,False,91.3
715546,SEPOLEN,,Benjamin,NA,True,131,83,57,151,110,4.9,False,99.0
709622,FAN,,Chukwudi,Male,True,125,82,29,176,72,4.1,False,96.3
440708,CATAFFO,,Erin,Female,True,126,74,46,148,59,4.3,False,91.3
752450,MOSS,Sean,Artem,Male,True,123,82,88,152,70,NA,False,95.7
367337,AGUILAR,,Abigail,NA,False,118,82,68,201,71,5.2,False,94.0
918102,CHAUDHRY,,Jonathan,Male,False,123,80,25,170,62,5.4,False,94.3
880792,FRANCO,,Zaiasia,Female,True,117,76,98,139,76,6.6,False,89.7
104320,SON,Samba,David,Male,True,118,82,62,167,81,7.1,False,94.0
299499,AJAYI,,Marissa,Female,True,NA,89,61,143,66,4.6,NA,
629819,RUSHTON,Cynthia,Aaliyah,Female,True,125,87,45,202,63,8.7,False,99.7
506980,GARDNER,,Mia,Female,False,121,82,16,159,84,4.3,False,95.0
986163,SHAHEEN,Timothy,Draven,NA,True,126,80,55,160,77,5.9,False,95.3
740579,GONZALEZ,,Trang,Female,True,118,85,31,NA,91,4.7,False,96.0
540939,MORTON,Brittany,Matea,Female,True,131,83,NA,149,100,4.7,False,99.0
631571,REYES,,Anna,Female,False,123,77,55,163,87,5.2,False,92.3
208059,NIETO,,Tatyana,2,False,135,84,79,171,62,4.7,False,101.0
554388,NA,NA,Cody Blackmore,Male,False,126,69,69,170,104,9.8,False,88.0
798905,ANGLO,,Noah,Male,False,129,73,54,179,48,3.0,False,91.7
122415,SHAFI,,Demario,Male,False,131,33,73,174,63,5.6,False,65.7
90128,BRIDGEFORD,,Michael,M,True,130,85,98,166,58,2.9,False,100.0
861509,COFFMAN,Timothy,Robert,NA,False,125,81,74,154,58,4.7,False,95.7
564431,BOX,Quy,Shawn,Male,False,125,82,24,147,72,7.2,False,96.3
190723,BANKS,,Mariah,Female,True,137,74,45,170,74,4.2,False,95.0
26932,HEALY,,Willie,,False,136,83,54,149,92,6.2,False,100.7
255066,MANZO,Kyle,Crue,NA,True,114,86,28,191,120,5.9,False,95.3
297806,FLOWERS,Chance,Aaron,Male,True,126,82,94,159,75,5.5,False,96.7
670212,STOREY,Alexandria,,Female,False,120,83,16,167,65,0.8,False,95.3
468795,SCHMITT,,Madison,Female,False,133,83,70,151,46,8.3,False,99.7
74483,SOLANO,,Chervonne,NA,False,134,75,33,159,64,4.4,False,94.7
263320,MARTINEZ,,Susanna,Female,False,124,NA,60,163,82,4.6,False,
533293,FORSYTHE,,Milliona,Female,False,118,86,19,181,74,8.7,False,96.7
741287,CHA,Lucas,Hugo,Male,False,124,81,56,173,81,4.5,False,95.3
228815,NA,NA,Jackson Gemeda,Male,True,130,82,58,154,57,5.9,False,98.0
165590,REPOLLO,,Adrian,NA,False,130,84,27,164,58,6.8,False,99.3
263186,CRAMER,,,Male,False,129,89,36,160,95,5.4,NA,102.3
265305,STARKS III,Francine,Leslie,Female,False,130,85,18,169,87,3.4,False,100.0
501658,HANSEN,,Tania,Female,True,127,81,21,159,93,3.4,False,96.3
100630,YORK,Destiny,Brittany,Female,False,141,86,98,186,80,8.0,False,104.3
586277,JANES,,Maxine,Female,False,126,80,81,140,88,6.5,NA,95.3
826844,MARTINEZ,,Hung,Male,True,135,74,74,155,75,4.9,False,94.3
285402,HIGGS,,Dominika,NA,True,123,81,97,164,63,4.1,False,95.0
484910,GOMEZ,,Rachael,Female,False,125,74,79,NA,60,4.1,False,91.0
57670,CHARLES,,Nicholas,Male,True,126,74,85,158,76,5.0,False,91.3
186621,SNIFF,Martin,Johnathan,Male,False,120,NA,21,172,81,5.3,False,
646513,KIM,,Derek,Male,True,134,80,38,173,87,7.6,False,98.0
508615,SKAZINSKI,,Brittany,Female,True,140,87,NA,189,54,5.7,True,104.7
227339,KANU,,Sierra,Female,True,125,69,61,147,153,5.2,False,87.7
261014,NA,,David,Male,False,132,83,NA,179,98,2.5,True,99.3
160463,DIXON,,Megan,NA,False,126,NA,64,164,71,5.0,True,
650977,CRUZ,Ciara,Monica,Female,True,131,77,36,161,149,4.8,False,95.0
576641,SANCHEZ,,Alice,Female,False,126,80,80,167,90,3.9,False,95.3
153954,cox,Jonathan,Rohith,Male,True,133,80,16,176,48,2.8,False,97.7
388175,WINCKLER,,Brittany,Female,True,118,80,97,189,90,3.5,False,92.7
365662,NA,,Quianah,Female,True,130,72,71,155,105,5.1,False,91.3
424041,HARRIS,,Patrick,NA,False,128,80,47,154,NA,0.8,False,96.0
782294,NA,NA,Angelina Smith,Female,True,129,84,64,176,79,4.9,False,99.0
439803,NA,NA,Monaca Monie,Female,False,126,86,34,185,142,4.2,False,99.3
235811,,,Jesus,Male,False,119,75,24,165,58,6.2,False,89.7
462661,SOTO-GONZALEZ,,Mariah,Female,NA,122,80,48,176,91,4.3,False,94.0
481928,VANG,,Tylor,Male,True,127,81,34,152,73,4.5,False,96.3
619128,HART,Aimee,Taisia,Female,False,126,81,16,170,95,4.0,False,96.0
420105,NA,NA,Aaliyah Montoya,Female,False,115,78,23,163,55,2.9,False,90.3
847005,,,Sonia,Female,True,125,82,38,179,100,3.3,False,96.3
382288,NIX,,Raul,Male,False,120,75,38,192,46,10.0,False,90.0
491480,BALDWIN,,Mikayla,,True,124,75,82,NA,72,9.5,False,91.3
537114,WHYTE,,Kyle,Male,True,121,85,80,158,79,3.6,False,97.0
917667,SUTTON,Mckenna,Kathleen,Female,False,112,83,NA,192,56,NA,False,92.7
760707,NA,NA,Renay Baier,Female,False,111,73,23,194,78,3.4,False,85.7
837905,ROMERO,Caelin,,Female,False,128,77,98,148,84,5.7,False,94.0
684905,bradshaw,,Randy,Male,True,126,81,42,185,100,5.0,False,96.0
913808,BILLIE,,Nicholas,NA,True,122,84,24,176,65,3.9,False,96.7
292480,YANG,Joey,Justin,NA,False,119,76,54,189,74,2.2,False,90.3
443973,MURRAY,,Kevin,Male,False,113,70,58,157,63,3.4,False,84.3
393211,NA,NA,Shannon Rodriguez,Female,True,132,84,43,171,57,4.4,False,100.0
550871,AGUIRRE,Anhisha,Taraneka,Female,True,121,80,78,156,61,6.5,False,93.7
881872,MANN,Breckelle,Autumn,Female,False,119,78,26,162,96,6.7,False,91.7
845003,HIGGINS,,Jacquelin,F,True,126,78,67,153,67,5.6,False,94.0
780865,SEELEY,Ty,Benjamin,Male,False,122,79,48,NA,111,7.1,False,93.3
822636,VANG,Michael,Andrew,Male,False,119,83,73,172,55,6.9,False,95.0
422058,NORGAARD,Maria,Myranda,Female,True,121,76,49,201,78,4.8,False,91.0
202679,RIVERA,,Christina,,True,131,85,85,154,75,7.1,False,100.3
310165,VIDANA,Miracle,Tiffany,,False,113,76,70,200,53,3.9,False,88.3
18531,GODIN,,Kacie,Female,False,118,84,17,193,72,5.0,False,95.3
946189,COCHRAN,Paul,Michael,Male,True,113,69,69,153,103,6.1,True,83.7
399326,RIVAS,,Noreen,Female,False,125,78,71,163,66,4.6,False,93.7
362208,GARCIA,Kenny,John,Male,False,120,75,79,177,120,1.4,False,90.0
994159,STEVENS,,Bryan,Male,False,125,81,23,183,77,5.1,False,95.7
396565,WILSON,,Sarah,Female,True,131,77,40,185,69,6.2,False,95.0
750002,CORNELIUS,,Jacky,Male,True,128,78,89,157,92,4.8,False,94.7
331902,KING,,Anthony,Male,False,130,79,66,199,66,8.6,False,96.0
194694,dorrance,,,Male,True,136,39,NA,150,92,2.2,False,71.3
367611,DURAN,,Sawhitney,Female,True,119,80,25,159,69,NA,False,93.0
741608,ABRAM,,Ethan,Male,False,117,82,54,186,148,5.8,False,93.7
501782,HALLING,,Omar,Male,False,126,73,16,181,53,8.8,False,90.7
886903,ARELLANO,,Hithaishini,Female,False,126,88,38,175,72,10.3,False,100.7
756050,TORRES,,Jacqueline,Female,True,134,35,NA,151,101,6.1,False,68.0
981323,WALDOR,,,Female,True,316,73,96,171,92,NA,False,154.0
222042,LOPEZ,Ebony,Delana,Female,True,125,80,58,171,91,5.2,False,95.0
970406,park,Scott,NA,Male,True,354,77,32,150,70,5.1,False,169.3
138637,CHRISTENSON,,Alura,Female,True,119,80,53,172,NA,10.0,False,93.0
886992,TORO-ALLEN,Marybeth,Katelyn,Female,False,125,84,31,170,68,5.4,False,97.7
4270,ROBINSON,,Sreya,Female,True,110,78,47,138,83,6.0,False,88.7
840268,WHITE,Evan,Tristan,Male,True,114,75,37,194,72,5.7,True,88.0
5805,FOSTER,,Adriana,Female,True,136,81,17,180,51,5.1,False,99.3
362795,DAVIS,Steven,Jordan,NA,True,112,24,32,172,78,3.3,True,53.3
340277,ADAMS,Melissa,Carsen,Female,False,123,86,47,175,NA,7.8,False,98.3
731827,MILLER,,Otoniel,Male,True,117,85,90,137,92,7.1,False,95.7
765600,AGHI,,Mario,Male,False,114,71,19,191,73,6.6,True,85.3
599399,villegas,Joseph,Sourob,Male,True,131,89,72,195,96,3.3,False,103.0
149803,MAHNKEN,,Matthew,Male,False,120,75,49,187,84,9.0,False,90.0
348684,FOUST,,Ashlyn,Female,False,124,85,30,176,102,7.6,False,98.0
200362,AUTTERSON,,Francisco,Male,True,128,86,60,159,100,0.5,False,100.0
204312,ESPINOSA RAMIREZ,,Ashanti,Female,True,131,81,83,165,89,8.5,False,97.7
877732,NEAL,Quinn,Joshua,Male,False,124,77,68,156,69,3.0,False,92.7
7457,WEINSTEIN,Alexandere,Vincent,Male,False,107,91,93,178,61,5.0,False,96.3
119517,KHAN-AKBARI,Tajae,Jabriel,Male,False,124,82,92,159,116,7.8,False,96.0
349357,BRANNON,,Damaryz,Female,True,128,72,17,178,83,7.0,False,90.7
8843,MILLS,,Michelle,NA,True,123,89,72,167,72,5.1,False,100.3
339111,WARREN,,Sidney,M,False,133,85,46,184,78,NA,False,101.0
491165,HAZELMAN,Jaime,Leopoldo,Male,False,125,80,47,176,66,5.4,False,95.0
963370,DAWSON,,Gregory,Male,False,122,76,39,163,127,5.0,False,91.3
187699,KIMBREL,Joshua,Alijah,NA,True,129,83,21,172,53,3.9,False,98.3
749962,YANN,Corey,Davion,Male,True,123,85,80,177,67,3.0,False,97.7
72281,NEAL,,Tyler,Male,True,135,82,33,148,105,5.2,False,99.7
676519,JOHN,,Joseph,NA,True,123,88,28,175,66,6.0,False,99.7
539573,LOVELACE,,Jeremy,Male,False,117,79,37,197,57,2.2,False,91.7
856450,WALL,,Brandon,NA,True,130,82,98,177,65,8.5,False,98.0
268779,MORALES,,NA,Female,True,124,85,79,149,NA,2.0,False,98.0
563252,KYAMBALESA,,Joseph,Male,False,137,76,18,184,93,5.8,False,96.3
225142,CRUZ,,Zhane,Female,True,132,77,47,152,75,5.2,False,95.3
726508,HARVEY,,Julia,Female,True,129,86,92,176,47,5.3,False,100.3
480984,NA,NA,Renita Eyasu,Female,False,132,70,78,173,74,4.8,False,90.7
500009,JENNINGS,,Aurora,Female,False,116,76,17,175,63,5.6,False,89.3
792648,WILLIAMS,,Jamie Lee,Female,False,309,80,97,170,80,6.4,False,156.3
869465,HERNANDEZ,Tywanna,Blaine,Female,True,129,77,18,142,55,7.4,True,94.3
603101,YAZZIE,,David,Male,False,124,71,33,149,71,5.2,False,88.7
530939,MORTON,,Richard,1,True,133,86,57,178,65,4.5,False,101.7
730178,SIMANGUNSONG,,Eric,Male,True,127,81,70,191,93,4.8,True,96.3
196322,LANGRIDGE,,,Male,False,123,86,20,NA,56,7.3,True,98.3
13243,NELSON,,Clayton,Male,False,120,98,NA,142,63,4.6,True,105.3
616338,NA,,Kareli,Female,True,123,84,69,188,57,6.9,False,97.0
465150,FERMIN,,Jeramy,M,False,127,82,96,189,87,2.5,False,97.0
376408,LOPEZ,,Megan,Female,True,125,90,23,160,52,6.4,False,101.7
741250,JARVIS,,NA,Female,False,113,66,60,181,121,3.4,False,81.7
757822,HALL,,Marshall,Male,True,126,61,59,153,89,4.0,False,82.7
206592,ROMERO,Giselle,Sieva,Female,True,119,89,54,135,63,5.1,False,99.0
203522,NGUYEN,,Eric,Male,False,129,78,79,171,70,5.1,False,95.0
119349,CULHANE,Shahzad,Hassanain,Male,False,134,76,NA,179,115,5.4,False,95.3
490984,LIGHTHALL,,Daniel,Male,True,118,44,27,157,84,5.9,False,68.7
353073,BROWN,Lucia,Mikayla,Female,False,137,84,38,153,112,2.1,False,101.7
22906,WALKER,,Dru,Male,True,131,24,59,185,86,3.4,False,59.7
296578,HALL,Tanisha,Anna,Female,True,111,85,26,163,54,6.1,True,93.7
390837,Linton Uribe Andrade,NA,NA,Female,True,132,77,38,149,50,4.0,False,95.3
679717,Jordan Kazemi,NA,NA,Male,True,117,81,64,162,56,7.0,False,93.0
605161,SCHELL,,Kailey,F,False,130,74,NA,177,65,5.0,False,92.7
870047,MATSUO,,Joshua,Male,False,120,75,58,149,52,7.1,False,90.0
807427,HUEY,Christina,Julia,Female,False,131,69,NA,161,NA,2.2,False,89.7
36348,RICHARDSON,,Phelicia,Female,False,129,75,73,190,56,4.4,False,93.0
337165,ANDREWS,,Brynn,Male,True,122,86,84,183,73,0.2,False,98.0
809971,NA,NA,Issac Kim,Male,False,114,73,19,136,64,6.2,False,86.7
744177,,,"Stuart, Simona",Female,NA,137,75,90,199,110,4.2,False,95.7
31803,DHILLON,,Juan,Male,True,357,77,58,160,82,6.2,False,170.3
949405,HOFFMAN,,Rachel,Female,False,129,28,17,171,52,3.0,False,61.7
665173,MCKENZIE,Hannah,Stephanie,Female,False,127,70,96,176,71,7.5,True,89.0
103732,BECKLER,,Gabriela,2,True,120,74,84,189,62,6.0,True,89.3
931025,LLOYD,,NA,Female,False,121,75,19,163,59,3.0,False,90.3
665519,MCINTYRE,Alexis,Cicely,NA,True,134,92,26,NA,70,2.3,False,106.0
830314,MARTIN,,Jared,Male,False,127,77,79,166,98,6.5,False,93.7
167828,,Ernesto,Darell,Male,False,127,88,60,153,68,8.0,False,101.0
462029,NA,NA,Zitlalik Ream-Dickerson,Female,True,128,83,68,159,57,3.1,False,98.0
583463,LEAKS,Trina,Shelby,Female,False,123,89,76,174,47,5.3,False,100.3
969727,VASQUEZ,,Jose,Male,False,129,79,40,185,64,5.8,False,95.7
864759,TEMMER,Tanahiry,Lucero,Female,False,125,81,97,162,71,4.4,False,95.7
114449,NA,NA,Noah Williams,Male,False,108,71,62,182,72,2.9,False,83.3
367069,SIERRA MIRANDA,,Stephanie,Female,False,124,80,NA,156,81,7.0,True,94.7
829540,RAIBURN,,Mori,Male,True,129,76,80,192,120,6.4,False,93.7
721586,,,Shayla,Female,True,127,83,56,157,45,NA,False,97.7
283552,,,"Plasencia, Kaibrea",Female,True,122,77,62,163,80,1.6,False,92.0
163861,HAMMOND,,Justin,NA,True,138,82,NA,179,82,6.3,False,100.7
507910,LAM,,Tyler,Male,False,325,86,28,179,78,9.4,False,165.7
36277,HALL,Justin,Killian,Male,False,123,69,59,181,79,2.4,False,87.0
857730,CASTILLO GARCIA,,Brittany,Female,True,112,77,75,163,56,7.0,False,88.7
486328,JONES,David,Cody,Male,NA,132,73,84,155,91,5.2,True,92.7
80520,COOK-NUNN,Karissa,Kelsie,NA,False,119,87,23,153,105,NA,False,97.7
958326,BRODERICK,,Christina,Female,False,123,NA,97,158,68,5.3,False,
724201,GARCIA HERNANDEZ,Markeisha,Tanisha,Female,True,121,87,78,NA,53,3.5,False,98.3
456431,ANDING,Scott,Collin,Male,False,135,79,53,173,79,1.6,False,97.7
983108,WASHBURN,Holly,,Female,True,120,86,67,170,44,5.2,False,97.3
996577,ARMENDARIZ,,,Female,False,121,86,81,172,68,3.7,NA,97.7
183660,SHERWIN,,Naomi,NA,False,124,76,34,162,100,6.7,False,92.0
712366,HILL,,Nubia,Female,True,133,83,34,171,67,3.9,False,99.7
876263,NA,NA,Samantha Haile,Female,False,127,84,52,144,47,6.8,False,98.3
91235,MCCARTY,,NA,Male,False,120,80,96,202,56,5.9,False,93.3
587411,NA,,Breaja,NA,False,135,74,40,173,96,3.2,False,94.3
638008,TOLBERTSON,,Kevin,Male,False,130,79,98,150,84,5.8,False,96.0
363983,HERNANDEZ NIETO,Dami,Lisa,Female,False,132,69,33,159,61,5.4,False,90.0
659295,ELEP,,Ian,Male,False,119,96,66,136,74,3.2,False,103.7
397213,WISE,,Michael,,True,122,87,63,168,71,5.7,False,98.7
256559,abraham,,J,Male,False,132,70,NA,185,49,5.4,False,90.7
995707,,,"Wilson, Dustin",Male,True,121,76,81,150,49,7.0,False,91.0
60156,GONZALES,Maithreyi,Tara,Female,False,134,73,22,164,75,7.0,False,93.3
185560,NA,NA,Kari Salinas,Female,True,136,79,23,132,72,6.4,False,98.0
18025,MOORE,Shalimar,Marie-Pearl,Female,True,NA,76,74,184,91,7.2,False,
633233,JONES,Cassidy,Evelyn,Female,True,134,72,59,179,67,2.0,False,92.7
950311,TAFOYA,,Christian,Male,True,123,82,62,155,128,4.6,False,95.7
769083,SMITH,,Cody,Male,False,129,91,55,161,76,NA,False,103.7
782721,ABEYTA,,Dylahn,Male,False,121,41,94,160,69,4.6,False,67.7
560903,burger,,Yolanda,Female,True,129,83,46,NA,87,NA,False,98.3
509209,NA,NA,Rachel Page,Female,True,129,86,NA,179,67,3.7,False,100.3
132963,WARREN,Rocky,Cavan,Male,True,122,82,70,186,70,7.7,False,95.3
181547,HAWKINS,Markki,Cinthia,Female,True,131,82,36,175,58,5.3,False,98.3
487464,BOFFILL,,Krysta,Female,False,124,73,36,172,126,3.9,False,90.0
39058,NA,NA,Whitney Padilla De Leon,Female,False,143,80,85,178,50,1.6,False,101.0
666955,,,"Medina, Yuri",Female,True,139,77,29,150,56,5.3,False,97.7
414864,VAN,Alexandra,Alexandra,Female,True,136,72,60,178,69,4.2,False,93.3
107188,SINSHEIMER,,Destiny,Female,False,135,84,NA,146,65,3.8,False,101.0
852360,MAUMAU,,Alan,,True,112,83,61,143,78,5.2,False,92.7
327198,KIM,,Hawe,Male,False,136,93,41,172,62,1.9,False,107.3
796584,,,"Tran, Nicholas",Male,False,130,79,19,141,51,3.6,False,96.0
161622,ARCHULETA,Jade,Auriel,Female,False,119,32,NA,184,59,7.5,False,61.0
702206,FUENTES,,Khalie,Female,True,122,82,24,NA,96,4.0,False,95.3
512039,CHIEROTTI,,Jordan,Female,False,125,77,61,185,96,5.5,False,93.0
987841,HAN,,David,M,True,115,83,43,173,NA,4.5,False,93.7
418659,banchongchith,,Gilbert,Male,True,131,75,56,167,58,4.2,False,93.7
342380,VAN,Chris,Daniel,Male,False,117,75,83,180,44,2.1,False,89.0
158961,NA,NA,Ronald Thompson,Male,True,120,75,44,167,75,5.1,False,90.0
207662,FATTORE,,Simone,Female,False,127,79,65,189,47,3.4,False,95.0
551020,GALLEGOS,,Kathryn,Female,True,126,16,24,163,57,5.9,False,52.7
303648,BEHBAHANI,Dajeon,Jalen,Male,False,125,81,18,170,100,5.5,False,95.7
287214,NA,NA,Dante Alessandr Tafoya,Male,False,137,82,98,174,69,5.3,False,100.3
938273,SMITH,,Yaa,NA,False,120,81,75,NA,70,NA,False,94.0
700261,JONES,,Reed,Male,NA,118,82,29,168,44,6.9,False,94.0
929572,LIPPS,,Orion,Male,True,108,85,38,177,60,3.4,False,92.7
382971,THOMPSON,Paul,Dean,Male,True,130,80,54,150,59,1.8,False,96.7
64353,GREEN,,Sang,Male,True,127,75,61,185,82,4.8,False,92.3
83093,FRESQUEZ,,Saamyia,2,False,112,30,48,165,49,4.1,False,57.3
254662,RODRIGUEZ,,Chan'Cellore,Female,False,113,NA,30,177,75,NA,NA,
425688,HARNEY,,Gilbert,Male,False,119,27,55,179,97,4.6,False,57.7
229013,CHEN,,Michael,Male,False,131,79,52,157,62,NA,False,96.3
907671,CARROLL,Edith,Elilma,NA,False,130,20,47,174,134,2.4,False,56.7
264789,PEDERSEN,,Marissa,Female,True,121,77,96,NA,117,2.3,False,91.7
567257,Hassanain Absher,NA,NA,NA,True,140,81,70,142,90,NA,False,100.7
464121,MOSS,,Melanie,Female,True,128,88,63,148,102,1.0,False,101.3
86387,STRAND,,Jordan,Male,False,129,79,50,189,94,5.9,NA,95.7
725984,MORALES,,Tian,Female,NA,132,82,50,186,109,5.4,False,98.7
65695,brauher,,Michael,Male,NA,117,74,81,170,74,5.4,False,88.3
451014,ALVAREZ,,Clarissa,Female,False,114,85,NA,179,55,8.1,False,94.7
943872,Alexandria Lester,NA,NA,Female,False,127,79,92,170,61,6.8,False,95.0
244214,LIVINGSTON,,Abrien,Male,True,129,79,44,162,90,3.9,False,95.7
749518,OYEBI,Steven,,Male,True,NA,85,NA,189,106,6.7,False,
497576,MIERA,,Batamgalan,Male,True,126,83,53,161,103,6.9,False,97.3
847387,COOPER,,Carolyn,Female,True,326,20,22,185,60,2.9,False,122.0
598629,THOMPSON,Alexander,Carter,Male,False,113,74,80,178,NA,4.1,False,87.0
605306,HALASEH,Taylor,Brandon,Male,True,142,87,36,147,117,5.2,False,105.3
838999,SOWELL-BOYES,,Connor,Male,False,129,83,70,159,100,4.6,False,98.3
870298,SCHLAG,,Maria,Female,True,134,73,67,181,67,5.7,False,93.3
701403,BURNS,,,Male,True,115,81,66,153,88,1.6,False,92.3
958159,VOVAN,,Alexander,Male,False,NA,81,82,181,83,4.7,False,
673423,JOHNSON,,Devon,Male,True,125,88,37,175,71,2.3,False,100.3
348546,BOHMS,,Christina,NA,True,126,68,67,176,55,3.9,False,87.3
396206,STROHMEIER,,Na'Gee,Female,False,339,84,22,145,76,3.7,False,169.0
49342,MCWILLIAMS,Shawn,Michael,1,True,130,85,48,162,51,5.9,False,100.0
216583,SCHWARTZKOPF,,Cheyanne,Female,True,129,95,79,164,90,6.0,False,106.3
419049,SHIRLEY,,Yanira,Female,True,112,77,82,186,47,5.0,False,88.7
231879,BROWN,Wesley,Kyler,NA,False,127,71,66,135,115,4.3,False,89.7
235833,KIM,Charlie,Jeremy,Male,False,125,74,24,178,74,5.8,False,91.0
99318,NA,NA,Celeste Corral Perez,Female,False,137,83,46,178,107,3.4,False,101.0
579608,NA,NA,Maria Greene,Female,False,124,79,72,157,103,4.5,True,94.0
703827,GARCIA,,Marce,Female,True,126,86,88,171,46,5.2,False,99.3
638116,NEWMAN,,Jodell,Female,True,126,72,92,154,91,4.2,False,90.0
38855,CHRISTOPHERSON,Mauricio,Edgar,Male,True,121,80,79,172,79,4.4,False,93.7
831168,JAMISON,Teryn,Eloyita,Female,False,138,88,85,166,85,7.2,False,104.7
266151,NA,NA,Derek Retana,Male,True,138,71,82,178,62,6.1,False,93.3
986494,HINOJOS VAZQUEZ,Hamdi,NA,Female,True,116,71,41,161,53,4.7,True,86.0
655471,,,"Amarsaikhan, David",Male,True,121,81,95,192,66,5.8,False,94.3
326164,HILL,Tyler,Shane,Male,False,130,75,90,171,NA,3.0,False,93.3
54483,KREHBIEL,,Hannah,Female,True,118,76,41,140,89,3.6,False,90.0
205392,PETERS,,Alexis,Female,False,133,84,52,171,63,6.8,False,100.3
875390,DUFRESNE,,Alejandro,Male,True,137,87,94,174,76,3.9,False,103.7
417057,GILBERT,Carly,Tristin,Female,True,125,63,88,179,NA,7.0,False,83.7
866404,OGAZ,D'Razhane,Ali,Female,True,138,93,75,167,89,6.2,False,108.0
915714,DIERDORFF,,Hailey,Female,True,126,90,25,170,54,7.9,False,102.0
532227,KING,Hunter,Daylamae,Female,True,126,90,29,162,68,3.5,False,102.0
592287,QUESADA,,Haile,Female,False,123,79,43,173,85,5.3,False,93.7
86227,JIJON-SOLIS,,Phaylinh,NA,False,124,76,95,167,77,5.6,False,92.0
332916,GOMEZ,,Tajaneek,Female,True,136,83,70,164,60,4.3,False,100.7
689888,LOVERN,,Chad,Male,True,328,92,68,168,61,6.4,True,170.7
431893,ZENONI,,Adrianna,Female,True,116,79,16,NA,117,NA,False,91.3
445132,RIVERA,Celia,Thalir,Female,True,134,84,95,151,NA,4.2,False,100.7
993332,NA,NA,Daniel Hill,Male,False,131,70,55,175,79,5.3,False,90.3
950793,GOGERTY,,Isiah,Male,False,127,79,97,NA,67,3.8,False,95.0
477771,LOTT,,Yash,Male,False,126,82,46,126,63,7.1,False,96.7
30577,RUTHERFORD,Jasmine,Eleisia,Female,NA,332,78,41,199,84,5.7,False,162.7
828942,BOYD,,Vela,Male,True,116,88,95,170,59,NA,False,97.3
101444,SAXE,,Janay,Female,True,137,78,64,160,96,2.9,False,97.7
668162,Binh Medrano,NA,NA,Female,False,122,97,46,168,78,5.1,False,105.3
980896,BURRELL,,Hayley,Female,False,123,78,22,156,84,3.9,False,93.0
300043,KERSEY,,Kalvin,Male,False,114,78,80,189,67,2.1,False,90.0
341323,,,Kendall,Male,False,114,75,85,178,57,3.2,False,88.0
615158,NA,NA,Karyn Herrera,NA,False,137,85,56,179,56,7.5,False,102.3
220701,,,"Sayavong, Derrick",Male,False,133,15,58,NA,51,6.4,False,54.3
450911,,,"Ellidridge, Shyanne",Female,True,114,87,33,150,50,6.1,False,96.0
633417,WILLIAMS,Brooke,Jordan,Female,False,115,91,36,148,58,3.1,False,99.0
30471,NA,Jonathan,Houdini,Male,False,130,82,34,190,48,3.6,False,98.0
359716,,,Jesse,Male,True,121,67,48,161,87,6.9,False,85.0
786575,lujan,,Robert,NA,True,119,76,64,191,68,6.3,False,90.3
741061,,,Nigel,Male,False,124,65,37,196,77,8.0,False,84.7
946053,hanamura,Kenneth,Darek,Male,False,125,86,92,133,74,8.3,False,99.0
498573,VEED,,Anna,Female,False,119,81,58,165,68,3.5,False,93.7
621188,FIFITA,,Dominic,Male,True,120,80,48,183,71,5.0,False,93.3
244531,WILLIAMS,Tyler,Alexander,Male,True,120,82,82,188,51,4.9,False,94.7
214487,,,"Britton, Ryan",Male,False,132,79,58,175,87,5.1,False,96.7
686544,JUAREZ,Kyla,Abigail,Female,False,131,75,63,187,38,6.9,False,93.7
389154,ZHENG,,Ricky,NA,True,126,78,76,169,99,3.2,False,94.0
977594,WEAVER,,Matthew,Male,True,305,74,44,171,63,2.8,False,151.0
913078,FIDDELKE,,Edward,Male,False,130,77,27,NA,76,3.6,False,94.7
54099,ELLERMAN,,Benjamin,Male,True,118,NA,28,168,48,4.3,False,
770984,,,Losol,Male,True,123,77,NA,150,112,5.7,False,92.3
116306,GUERECA II,Michelle,,Female,True,125,69,NA,164,90,6.0,False,87.7
601669,,,"Rife, Nicholas",Male,False,127,77,82,170,65,6.4,False,93.7
774289,SANCHEZ-GUEVARA,,Tram-Anh,NA,False,128,89,21,163,99,3.8,False,102.0
443000,BECKNER,,Evan,NA,False,109,74,78,165,71,3.3,False,85.7
245214,LITTLE,Long,,Male,True,127,76,43,198,NA,3.7,False,93.0
701960,MONTES PEDREGO,Antoinette,Deaushanay,Female,False,118,82,81,160,59,5.1,False,94.0
269937,CHUNDRU,,Gerald,Male,False,118,80,70,185,134,4.0,False,92.7
506600,LEGER,,Anna,2,True,130,75,95,176,78,5.1,False,93.3
784923,CROSLEY,,,Female,True,122,76,65,186,52,7.1,False,91.3
114858,NA,NA,Selene Jimenez,Female,NA,108,76,35,139,93,6.2,False,86.7
543697,MOCTEZUMA,,Madalyn,Female,True,126,74,57,174,49,6.9,False,91.3
612411,VALDEZ,,Sara,Female,False,122,83,18,171,88,2.7,False,96.0
557550,MILLER,,Chakeame,Male,True,130,94,40,166,75,5.7,False,106.0
250729,,,Ca'La,Female,False,129,82,32,164,60,7.7,False,97.7
813858,JENSEN,,Jonathan,Male,False,144,72,56,160,76,3.1,False,96.0
89115,,Parker,James,Male,False,131,79,68,187,65,8.3,False,96.3
789952,VALDEZ,,Selena,2,False,133,74,54,177,77,NA,False,93.7
988603,DOWNS,Silas,Justice,Male,False,120,92,47,191,68,5.3,False,101.3
830722,FIERRO,,Myron,Male,False,117,70,33,157,86,3.8,False,85.7
66142,PHAN,,Jordan,Male,False,141,86,59,181,93,5.1,False,104.3
163667,BOWENS,Ryan,Jake,Male,False,117,83,62,179,89,3.8,False,94.3
422379,MUCHI,Brandon,Justin,Male,False,123,77,18,183,60,3.1,True,92.3
304937,,,"Newton, Andre",Male,True,130,87,55,179,70,3.6,False,101.3
976530,HALL,Brandon,Justin,Male,False,131,83,85,154,83,5.7,False,99.0
156953,BROWN,,Nicholas,Male,True,126,87,NA,190,93,7.8,False,100.0
267965,GARCIA,,,Female,False,123,77,80,167,81,5.7,False,92.3
617255,BARKSDALE,,Abel,Male,False,125,28,97,172,108,7.4,False,60.3
291760,MELTESEN-LEE,,Darrius,NA,True,123,76,17,143,143,NA,False,91.7
425510,TERRY,,Haden,Male,False,132,76,58,173,NA,2.5,False,94.7
123125,Teddi Malina,NA,NA,Female,True,129,78,91,NA,90,3.7,False,95.0
571516,MCGUIRE,,,Female,True,132,82,43,146,55,5.9,False,98.7
769996,YBARRA,,Kaley,Female,True,130,84,36,139,129,7.2,False,99.3
300820,NA,Makayla,Taylor,Female,False,123,89,29,155,86,4.0,False,100.3
316346,LEE,Mario,,Male,NA,125,85,30,176,48,5.2,False,98.3
962303,FINNEGAN,,Julie,Female,True,115,73,22,187,82,3.3,False,87.0
822662,STROVER,,Leilani,Female,False,119,71,NA,154,78,4.4,False,87.0
400691,FILBY,Esperanza,Gabrielle,Female,True,135,76,96,NA,75,5.9,False,95.7
824237,LOFTON,,Timothy,Male,True,117,78,35,175,92,6.1,False,91.0
423465,EIDENSCHINK,,Sara,Female,False,123,64,73,180,63,NA,False,83.7
392725,BRUCE,,Douglas,Male,False,128,82,23,183,126,3.2,False,97.3
223561,HARRIS,,Shane,Male,False,126,87,35,162,159,5.5,False,100.0
601537,TUGGLE,Kody,Andrew,,True,125,78,51,173,49,4.9,True,93.7
969392,BURGOS,,Madisyn,Female,False,129,70,66,173,81,1.8,NA,89.7
725499,AUSTRIA,David,Steven,Male,True,128,85,26,161,NA,2.5,False,99.3
347288,ENRIQUEZ,L'Tazha,Aalon,Female,True,127,93,29,178,83,6.3,False,104.3
499758,MARTINEZ,,Faith,Female,True,337,NA,83,164,105,7.3,False,
825733,BERHE,,Darshae,Female,True,138,91,NA,157,96,6.2,False,106.7
953290,WHITAKER,Selena,Tara,Female,True,123,83,49,140,98,6.5,False,96.3
992769,NA,,Desirelle,Female,True,137,85,80,174,39,NA,False,102.3
465196,WILSON,Matthew,Jacob,Male,False,124,72,22,182,66,3.8,True,89.3
41702,NELSON,,Autumn,NA,True,133,83,70,197,131,4.7,False,99.7
384248,PALMER,Elliott,Nam,Male,False,120,85,57,156,63,6.1,False,96.7
620975,BEGAYE,,Dominick,Male,True,120,87,82,NA,75,5.8,False,98.0
412252,BROWN,Nicolette,Olivia,NA,False,125,83,74,183,59,4.0,False,97.0
653605,NA,NA,Dakota Garrett,Male,NA,130,80,96,185,56,NA,False,96.7
638871,BURGOS,,Janet,Female,True,127,83,25,149,65,2.5,False,97.7
732937,,Olivya,Sarah,Female,False,132,92,23,166,58,6.4,False,105.3
617237,rouillard,,Bruce,Male,False,139,76,43,159,73,6.7,False,97.0
711377,TALAIN,Joshua,Devon,Male,True,116,80,NA,177,81,3.3,False,92.0
428021,GOOD WIND,Steven,,Male,False,119,87,46,154,NA,1.9,False,97.7
336869,MAI,,Salvador,Male,False,NA,87,58,173,75,6.6,False,
552346,JOHNSON III,,Michael,Male,False,120,89,86,198,89,5.1,False,99.3
642617,MULLINGS,,Charline,Female,False,125,81,64,161,108,8.4,False,95.7
999440,HUBBARD,,Joshua,Male,False,120,74,88,NA,75,4.9,True,89.3
558179,KEMP,Traivon,Jeremy,Male,True,134,82,87,167,56,5.2,False,99.3
808350,RAMIREZ GOMEZ,Shayla,Alexis,F,True,123,79,NA,164,76,3.5,False,93.7
250537,ORELLANA,Colette,Stephanie,Female,False,122,75,75,158,73,3.7,False,90.7
833938,YAZZIE,,Samuel,NA,True,133,69,33,161,65,5.0,False,90.3
747171,Dayzia Babcock,NA,NA,Female,False,127,90,38,162,82,6.4,False,102.3
273142,LARGUSA,,Alexandra,Female,False,122,88,57,169,41,7.4,False,99.3
830368,FISH,Tyler,Aaron,Male,False,124,86,19,177,65,4.0,False,98.7
199531,TOWNSEND,,Joseph,Male,True,125,85,42,163,40,6.6,False,98.3
710117,JUNG,,D'Ondre,Male,False,135,94,NA,184,113,NA,False,107.7
440589,ASHER,,Emily,Female,True,129,85,63,172,72,4.9,False,99.7
302004,LITTLEJOHN,,Trieu,Male,NA,118,81,34,178,57,5.2,False,93.3
473123,KAUFHOLD,,Jennifer,Female,False,127,76,73,183,63,4.4,False,93.0
5904,QUINTANA,,Joshua,Male,False,120,68,51,174,67,7.6,False,85.3
264970,CHAVEZ,,Danielle,Female,True,117,80,53,143,72,6.2,False,92.3
123604,Brandon Alphonse,NA,NA,Male,True,135,80,79,153,61,7.6,False,98.3
660609,lujan,,Brieanna,Female,True,133,84,17,166,52,3.0,NA,100.3
558316,PALMIER,,Kaigo,Male,True,119,21,81,177,99,1.5,False,53.7
986988,TSUI,,Chukwudi,Male,False,139,93,64,144,55,9.0,False,108.3
792487,BROCK,Apolonio,Raul,Male,False,NA,28,47,175,92,2.3,False,
646753,TERZIC,,Denis,Female,False,130,82,18,160,54,8.9,False,98.0
651860,MCDUFF,,,Female,True,116,89,46,155,78,4.4,False,98.0
836221,BUSTOS,Sophearath,Shelly,Female,True,127,73,63,183,NA,5.2,False,91.0
687758,HERBST,,Giovany,Male,True,119,30,92,188,60,4.8,False,59.7
969270,ONOYAMA,,Dontae,Male,True,120,23,34,178,75,5.0,False,55.3
355910,SHAFFER,,,NA,False,132,79,40,166,76,3.3,False,96.7
303309,XIONG,,Nickolas,Male,True,122,76,68,170,76,4.4,False,91.3
573939,NA,,Chioma,Female,False,325,83,53,155,66,6.9,True,163.7
10323,BELL,,Shenoa,Female,False,122,81,34,160,120,3.5,True,94.7
158335,NA,NA,Angel Hill,Female,NA,129,85,76,151,55,4.5,False,99.7
896180,TRUONG,,Alfredo,NA,False,120,33,38,149,107,6.5,True,62.0
216369,SMITH,Jesus,Luis,Male,False,125,76,53,191,76,6.0,False,92.3
823522,CHRISTY,,Juan,Male,True,123,88,74,181,73,7.1,False,99.7
58618,HALL,,Bryce,Male,False,131,82,95,169,54,4.4,False,98.3
979413,COBB-WILKINS,Dalton,William,Male,True,123,82,20,178,60,4.1,False,95.7
632809,SARSAM,,James,Male,False,122,85,38,147,83,9.1,False,97.3
97209,,,Sierra,Female,False,132,85,39,172,48,6.1,False,100.7
667595,CASTANON,,Torina,Female,False,116,86,92,161,67,2.8,False,96.0
645932,JOJOLA,,Taylor,Male,False,122,89,91,170,81,2.2,False,100.0
607854,AVILA,,Christian,Male,False,130,NA,29,195,70,6.8,False,
480300,KAGIYAMA,Ian,Raul,Male,True,122,84,33,163,65,4.3,False,96.7
791003,BUSICK,,Fanny,F,False,129,83,77,181,91,4.7,False,98.3
195825,,,"Crowe, Charles",Male,False,128,82,90,160,63,4.9,False,97.3
35968,doan,Roberto,Isaac,Male,True,125,88,37,189,76,7.4,False,100.3
910337,JENNINGS,,Taylor,Female,True,111,NA,16,174,108,6.1,False,
787443,BELTRAN GONZALEZ,,Jennifer,Female,False,126,81,75,154,55,5.5,False,96.0
569127,HAMM,,Maximino,Male,True,135,78,23,157,77,6.7,False,97.0
942540,MORGAN,,Brian,Male,True,130,75,NA,166,NA,3.7,False,93.3
90071,SORTERS,Jenny,,Female,True,126,83,39,189,52,4.0,False,97.3
215722,ZAMORA,Atif,Vincent,Male,True,140,76,56,175,91,5.0,False,97.3
373859,LILLY,Miriam,Vanessa,Female,False,118,78,60,175,66,5.7,False,91.3
578155,OLGUIN OVIEDO,Kyla,Kanchana,Female,False,119,27,77,162,55,5.8,False,57.7
872344,HENN,Destin,Emanuel,Male,NA,113,84,88,167,80,7.5,False,93.7
592542,MENDINGHALL,,Melissa,Female,False,126,79,73,183,52,NA,False,94.7
838949,POITRA,,Hiroki,Male,False,117,82,49,185,78,5.6,False,93.7
722697,JALLOW,,Jacqueline,NA,True,112,76,25,180,46,4.5,False,88.0
60783,BABCOCK,,Joshua,Male,True,114,77,80,184,82,3.1,False,89.3
132709,,,Rian,Female,False,117,87,29,161,76,5.2,True,97.0
230886,ABBOTT,,Megan,Female,False,127,80,46,158,51,3.3,False,95.7
697736,SHEPHERD,Randy,Jose,Male,True,119,90,84,176,96,4.5,NA,99.7
634507,NA,,Gennifer,Female,True,126,78,27,193,86,6.6,False,94.0
242052,NA,NA,Dylon Fan,Male,False,122,86,27,148,77,4.6,False,98.0
951608,NA,NA,Travis Jennings,Male,False,127,79,85,174,91,6.5,False,95.0
241311,DAHMER,Gabriell,Allison,Female,NA,123,85,63,170,51,3.1,False,97.7
985238,ZHAO,Sergio,Jairo,Male,True,117,75,54,176,58,4.8,False,89.0
105047,EUBANKS,,Tasha,Female,True,306,82,53,183,108,5.0,False,156.7
944494,JEFFERSON,,Adan,Male,False,134,75,36,179,83,7.1,False,94.7
141781,SINGH,,Christian,Male,False,117,78,63,162,71,6.2,False,91.0
828604,HER,,Diego,Male,False,117,73,NA,181,46,5.5,False,87.7
733044,Kayla Panuco Gamez,NA,NA,Female,True,127,74,53,154,71,10.2,False,91.7
417442,NA,NA,Rachel Holt Jones,Female,True,124,77,43,168,67,5.5,False,92.7
919373,,,"Olarte, Mateo",Male,False,123,78,50,159,80,7.1,False,93.0
306035,GARNER,,,NA,False,131,83,47,171,66,8.3,False,99.0
386718,TRUONG,Dominick,Lameke,Male,True,131,81,45,181,80,4.9,False,97.7
589096,ARELLANO,,Hope,Female,True,121,85,19,126,79,4.2,False,97.0
30340,LANE,Freddie,Joshua,Male,False,126,77,38,167,NA,5.8,False,93.3
329922,TRAN,,Brandon,Male,False,123,83,19,NA,51,3.1,False,96.3
493800,HUFF,,Jonathan,Male,NA,143,31,82,163,76,4.8,False,68.3
239513,Lauren Miller,NA,NA,Female,False,298,86,77,NA,41,5.6,False,156.7
72881,NA,NA,Devon Nguyen,Male,True,120,80,25,166,76,5.2,False,93.3
757973,PAVISOOK,Lance,Devon,Male,False,125,25,58,NA,58,5.1,False,58.3
78303,BLACKWATER,Brady,Kayle,NA,True,134,80,36,142,55,3.4,False,98.0
804746,arrieta,Annastasia,Brianna,Female,False,115,84,43,191,92,NA,False,94.3
233999,FARLEY,,Cody,NA,False,131,92,20,182,82,5.6,False,105.0
244580,,,"Sita, Mikayla",Female,True,118,NA,38,160,59,NA,False,
681943,FLEMING,,Justin,Male,False,339,89,44,165,79,3.9,False,172.3
112693,HARDIE,,Vanessa,Female,False,108,81,NA,179,67,5.5,False,90.0
501077,KOEUTH,,Jose,Male,True,128,77,35,164,68,1.8,False,94.0
591669,ATENCIO,Kiera,NA,Female,False,124,90,28,165,67,NA,False,101.3
605731,NA,NA,Tasia Anderson,Female,True,112,83,78,163,45,3.5,False,92.7
205008,JUMBO,,,Male,True,130,90,66,173,75,3.4,False,103.3
369895,,,Kanchana,Female,True,122,86,93,167,76,3.5,True,98.0
590945,NA,,Mikaela,Female,True,121,86,41,168,57,4.8,False,97.7
163191,RODRIGUEZ,Mikayla,Jennifer,Female,False,128,93,77,191,50,0.5,False,104.7
355482,,,Alexander,Male,True,122,86,78,192,84,7.3,True,98.0
444563,SANCHEZ-VALENTE,,,Female,True,124,78,86,173,NA,3.2,False,93.3
342197,YAMANE,,Zachery,Male,False,136,81,85,177,91,2.9,False,99.3
816874,,,"Hartman, Angeles",NA,False,133,77,98,172,46,4.6,False,95.7
926360,ROMERO,Sarah,Nikka,Female,True,120,85,41,152,89,4.0,False,96.7
757457,VAZQUEZ,Ella Nikita,Rebecca,Female,True,118,83,89,166,85,4.7,False,94.7
125799,HATCHER,,Kyle,Male,True,126,86,29,162,77,1.5,False,99.3
629629,TELLEZ-GUTIERREZ,Sylkin,Brittany,Female,True,127,67,49,145,74,3.1,True,87.0
882158,TERRY,Braden,Thorsen,Male,True,122,68,25,185,63,7.6,False,86.0
707318,revello,,Gabriel,Male,True,119,73,50,146,77,5.8,NA,88.3
422939,CHONG,,Samuel,NA,True,126,89,27,181,39,3.5,False,101.3
384365,VANSTRATEN,,Klayson,Male,False,120,81,65,147,89,3.0,False,94.0
133319,HANSON,,Jordan,Male,True,123,37,21,184,37,7.6,True,65.7
307128,chavez,Andrea,Tesia,Female,False,133,87,94,197,70,6.8,False,102.3
898091,GRIMM,Jobe,Cristhiam,Male,True,123,71,42,162,62,4.0,False,88.3
462124,MACIAS JAUREGUI,,Lily,Female,False,127,83,65,170,76,4.1,False,97.7
311106,SNIDER,,NA,Male,True,124,83,87,171,69,8.4,False,96.7
951441,HEITMAN,,Jordan,Female,True,125,75,66,172,107,8.1,False,91.7
525371,,,"Houston, William",Male,True,126,76,67,202,60,3.2,False,92.7
130421,NA,Ishmael,Terrell,NA,False,129,88,61,158,73,3.1,False,101.7
149941,hernandez ramirez,,Ireshea,Female,False,132,83,34,172,79,4.4,False,99.3
133781,THOMPSON,Master,Gerardo,Male,True,131,77,19,144,98,5.4,False,95.0
357753,NA,NA,Rojan Sherlock,Male,False,128,79,49,165,92,5.4,False,95.3
633934,PACHECO,,Ann,Female,True,122,75,76,184,75,6.6,False,90.7
22697,MCLACHLAN,,Stephanie,Female,False,122,83,92,196,68,5.7,False,96.0
612106,SPANN,Rylie,Jessica,Female,False,123,85,68,175,101,4.6,False,97.7
190334,,,"Cardenas-Regalado, Erin",Female,False,117,76,63,170,75,7.6,False,89.7
411303,ARDILLA-PATTERSON,Jesika,Seunghoo,Female,False,138,86,45,169,58,7.1,False,103.3
515951,TRYELS,Kale,Kayla,Female,True,123,NA,27,143,77,5.2,False,
158613,,,"Golightly, Cameron",1,True,133,70,60,169,85,4.8,False,91.0
207958,SHI,,NA,Male,False,117,77,41,169,72,6.3,False,90.3
278334,CAVE,Shay,David,Male,NA,126,87,70,160,72,5.0,False,100.0
373769,LIZER,,Michael,Male,False,134,77,67,162,65,4.3,False,96.0
489832,,,"Mora, Alicia",Female,False,130,84,21,141,NA,3.9,False,99.3
941236,DIEDERICH,,Donald,Male,False,115,81,29,192,48,6.4,False,92.3
931726,PHAN,,Avery,Male,False,129,81,32,187,NA,5.4,False,97.0
465569,THORPE,,Erica,Female,False,133,81,75,169,86,5.1,False,98.3
35528,BERKLEY,,Brianna,Female,True,122,71,42,165,74,3.5,False,88.0
518996,KELLY,Dalton,Brian,Male,False,132,73,28,173,84,3.4,False,92.7
743206,RUHL,,Taylor,Female,False,110,81,21,168,91,5.4,False,90.7
748842,HINH,Brian,Raymond,Male,False,128,74,33,186,61,4.4,False,92.0
477732,MARTINEZ,Kathryn,Aisha,NA,False,124,84,43,181,85,3.7,False,97.3
94729,RUIZ,Amy,Jenny,NA,False,135,86,98,NA,67,10.2,False,102.3
626643,CASSAVAUGH,Desiree,Jade,Female,True,127,85,77,154,115,8.2,False,99.0
727015,NA,,Matthew,Male,True,126,89,82,171,92,3.7,False,101.3
161078,MILLER,,Brittni,Female,NA,120,80,70,NA,59,2.7,False,93.3
67647,TRUJILLO,,Joseph,NA,False,124,70,72,165,109,5.5,False,88.0
439058,,,"Jones, Stephanie",Female,True,130,79,73,182,49,5.4,False,96.0
712030,OSBORNE,Ryan,Jack,Male,False,130,75,22,159,97,8.7,True,93.3
876756,Lance Snyder-Jones,NA,NA,Male,True,125,81,30,171,58,4.1,False,95.7
205177,THANH,,Johnpaul,Male,True,137,85,47,173,87,5.9,True,102.3
30619,deavila,Sequest,Shanel,Female,True,126,39,45,163,39,5.5,False,68.0
134769,MURPHY,,Ashley,Female,False,123,83,NA,197,104,5.9,False,96.3
324984,MENDOZA,Brijeah,Monique,Female,NA,121,78,50,171,56,6.8,False,92.3
184385,DANE,,,Female,True,129,74,87,182,79,4.0,True,92.3
78659,THAMMAVONG,Tarik,Demetri,Male,True,134,92,39,154,67,3.0,False,106.0
64238,CRASK,,Dejanae,Female,False,123,84,94,194,82,4.5,False,97.0
470016,DELGADO,,Selena,NA,False,116,87,30,163,75,7.0,False,96.7
659174,Fakiya Giner-Arzaga,NA,NA,Female,True,130,85,83,179,79,3.6,False,100.0
574799,Bailey Dominguez,NA,NA,Female,True,126,79,94,NA,41,4.9,True,94.7
285616,DE LA TORRE,Kiara,Bianca,Female,False,126,83,19,171,90,NA,False,97.3
675717,BRALEY,,Franklin,Male,NA,118,90,92,121,61,5.0,False,99.3
358732,PANYAVONG,,,M,True,132,72,82,161,58,7.3,False,92.0
372701,HALASEH,,,Male,False,126,83,90,181,80,5.9,False,97.3
662302,DO,,Angelo,Male,False,132,78,54,186,70,4.4,False,96.0
891702,PERSONS,,Blia,Female,False,126,84,96,194,NA,6.9,False,98.0
248921,NA,NA,Aaron Clark,Male,False,124,83,63,174,66,7.6,False,96.7
807056,JONES,,Leslie,Female,True,141,86,62,177,76,7.7,True,104.3
901298,KUSCHEL,,Lindsay,Female,True,138,87,93,164,41,2.3,False,104.0
904910,LIGGETT,,Zachariah,Male,True,121,82,62,157,92,3.9,False,95.0
638974,SILVERA,,Makalah,Female,True,132,86,NA,163,77,6.0,False,101.3
760912,NGUYEN,Terry,Brandyn,Male,NA,123,80,52,169,65,8.0,False,94.3
925491,BOOKMAN,,Miranda,Female,False,122,82,32,166,74,4.9,False,95.3
695884,NA,NA,Amy Mijares,Female,False,133,83,23,194,55,3.2,False,99.7
583055,janis,,Jordan,Male,True,120,87,71,197,69,3.9,False,98.0
156757,MCGRIER,,Luke,Male,False,112,83,79,157,146,5.1,False,92.7
79997,,Tyler,Jerald,Male,False,126,76,89,177,74,4.2,False,92.7
878785,NA,Tanisha,Alaura,Female,True,123,75,33,192,70,4.8,False,91.0
357613,Chiahci Casias,NA,NA,Female,True,136,84,95,174,49,7.0,False,101.3
591087,CHEE,,Jarrett,Male,True,126,80,NA,185,69,2.8,False,95.3
370714,YEUNG,,Langston,Male,True,131,81,34,158,80,5.8,False,97.7
362956,DEJESUS,Karissa,Xiaoyun,Female,False,122,80,52,149,78,6.6,False,94.0
383125,ENTZI,,Essiance,Female,True,NA,81,58,201,140,3.4,False,
768688,ROUZE,Paul,Sean,Male,True,286,81,89,177,78,2.7,False,149.3
759130,HUNT,Carsen,Alexandria,Female,False,126,74,43,162,94,NA,False,91.3
368389,DIERENFIELD,,Alexandria,Female,False,315,39,38,158,83,9.1,NA,131.0
598963,PEMBERTON,,Makayla,Female,False,133,81,49,150,96,6.5,NA,98.3
745718,CORDOVA,Kincaid,Deion,NA,False,130,85,NA,164,68,3.7,False,100.0
775481,ROBERTS,Dakota,Keeny,Male,False,123,75,71,186,69,6.2,False,91.0
932851,HELM,Dora,Jessica,Female,False,343,89,31,180,92,5.3,False,173.7
534297,KRUEGER,,Jharrimarshae,Female,True,123,80,29,NA,42,NA,False,94.3
910338,GHRAYYEB,Derrel,Antone,Male,True,131,81,47,136,66,3.8,False,97.7
480739,Adrian Johnson,NA,NA,Male,True,122,80,86,173,70,4.2,False,94.0
893946,SAIZ,,Grace,Female,True,127,76,51,170,91,6.6,False,93.0
538425,MARKS,Chandler,Taju,Male,True,124,73,59,182,70,7.5,False,90.0
313760,GILMAN,,Joshua,Male,False,122,88,51,167,50,3.7,False,99.3
543835,CARR,,Taylor,Male,True,114,79,23,163,74,6.4,False,90.7
52641,CARRASCO,,Lily,,True,125,83,77,167,120,-0.4,True,97.0
57116,GARCIA,,Xiaorui,Female,False,121,79,60,189,51,9.5,False,93.0
623934,ioane,,Juan,Male,False,NA,73,38,159,72,2.8,False,
707984,,,"Garden, Jafer",Male,False,128,86,18,155,63,7.9,True,100.0
29368,MARRUFO,,Lohitha,Female,True,138,89,57,169,43,4.6,False,105.3
458142,HOYT,,Trenice,Female,True,117,72,76,162,86,4.4,False,87.0
827276,,,"Walsh, Brittany",Female,False,130,78,96,160,73,4.8,False,95.3
159656,NA,NA,Sara Sanchez,Female,False,128,79,19,172,97,4.3,False,95.3
171713,LEHMAN,Selena,Brizay,NA,False,120,71,24,183,69,5.6,False,87.3
971528,CLARK,Eric,Shamuel,Male,False,119,76,89,NA,75,6.1,False,90.3
191324,KIPER,Bradly,Bryson,Male,True,127,84,76,184,84,6.0,False,98.3
706149,BERUMEN DE LA CRUZ,,Angela,NA,False,128,79,NA,181,83,4.0,False,95.3
348622,CHRISTIANSEN,,Jamie,2,True,136,77,64,166,87,5.3,False,96.7
386532,KOGUT,,Kirsten,Female,False,314,73,98,156,63,7.7,False,153.3
1326,SANCHEZ,,Chiana,Female,NA,141,87,20,147,53,5.5,False,105.0
922031,DORSEY,,Cassidy,Female,False,119,82,41,178,65,NA,False,94.3
22746,BATEMAN,,,Male,True,138,73,27,186,77,3.7,False,94.7
239789,TRELOAR,,Bernadette,Female,False,121,80,90,201,79,4.8,False,93.7
344082,HATCHETT,,Dylan,Male,False,120,84,31,158,63,NA,False,96.0
625476,,,"Taase, Miguel",Male,False,115,70,48,188,66,NA,False,85.0
19480,CHANG,,,Male,NA,132,78,96,174,85,4.6,False,96.0
657346,MORIARTY,Kasmira,Aubrie,Female,False,125,73,57,163,91,6.1,False,90.3
284550,HANNAN,Kira,Paige,Female,False,132,85,84,151,59,6.6,False,100.7
758203,NA,NA,Hannah Kasper,Female,True,129,73,68,179,63,4.5,False,91.7
393107,NA,NA,Kimberly Servantez,Female,False,108,80,36,153,82,3.5,False,89.3
836809,LYON,,Annie,Female,True,128,88,NA,167,86,6.4,False,101.3
940434,LOR,,Walter,NA,True,126,89,51,181,71,9.0,False,101.3
88140,,Maritza,Paola,NA,True,121,83,62,169,81,8.0,False,95.7
877424,YEON,,Fortunato,Male,True,128,81,24,169,71,4.3,False,96.7
171125,NGUYEN,,Alex,NA,False,326,83,21,149,75,6.4,False,164.0
188697,AGUILAR,,Mimi,Female,True,126,83,80,155,40,4.9,False,97.3
304993,BOOK,,Samone,2,True,134,87,78,164,79,6.8,False,102.7
514152,SMITH,,Lluvia,Female,True,120,78,89,177,64,5.8,False,92.0
174428,LINDLEY,Taquaysha,Cora,F,False,125,81,34,163,77,4.5,False,95.7
541129,STENGER,Kelby,Shursteen,Female,True,122,79,55,169,98,3.9,False,93.3
546693,YONG,,Patricio,NA,True,128,91,22,176,68,3.7,False,103.3
781809,NA,NA,Tyra Starks,Female,True,127,76,74,178,87,7.0,False,93.0
361057,PAN,,Jessey,Male,False,109,78,92,172,81,4.9,True,88.3
483788,BARTLETT,,Jasmine,Female,NA,135,78,18,163,95,5.9,False,97.0
478862,RICHARD,,Stephanie,NA,False,120,76,44,129,73,6.8,False,90.7
584131,DIMAS,Arfa,Dollee,Female,False,134,88,93,147,NA,3.9,True,103.3
858505,WINCHESTER,Jordan,Colton,Male,True,120,74,17,172,63,6.5,False,89.3
912306,BRUNER,Cheyenne,Thomas,M,False,131,81,50,164,67,3.6,NA,97.7
679543,COOLEY,,Corey,Male,False,122,81,NA,188,105,5.4,False,94.7
863993,TERRY,Franklin,Corey,Male,True,118,88,73,159,96,3.3,False,98.0
90688,NA,NA,Sydney Scholey,Female,False,NA,82,NA,187,71,6.2,False,
219085,CERVANTES,,Deon,Male,True,126,80,73,158,73,4.1,False,95.3
299547,PRATT,,Delrey,Female,True,122,84,19,182,52,4.5,False,96.7
218306,BOATENG,,Michael,Male,False,125,77,42,180,66,7.0,True,93.0
20599,BRADLEY,Holden,Ryan,Male,False,118,30,36,182,71,5.6,False,59.3
594830,,,"Le, Justin",Male,True,131,74,90,162,66,5.7,False,93.0
353712,VIGIL,Nyla,Aubreylin,Female,True,126,81,77,189,101,8.3,False,96.0
500774,FELVER,Audrey,Jordan,Female,True,120,84,17,162,59,2.7,False,96.0
559254,SUMUAL,,Javier,Male,False,128,78,68,173,38,3.8,False,94.7
