{
  "project_info": {
    "project_number": "1054518873724",
    "project_id": "count-runner-98116",
    "storage_bucket": "count-runner-98116.appspot.com"
  },
  "client": [
    {
      "client_info": {
        "mobilesdk_app_id": "1:1054518873724:android:7fa557844b7475c1aac3f9",
        "android_client_info": {
          "package_name": "com.Toy.Stream.Doors"
        }
      },
      "oauth_client": [
        {
          "client_id": "1054518873724-e7q104uvif17lj1qebiiap1s7t278vs3.apps.googleusercontent.com",
          "client_type": 3
        }
      ],
      "api_key": [
        {
          "current_key": "AIzaSyDnJ06EEO7l4Vo3Wk2k_y_gcWCWwh-eJKs"
        }
      ],
      "services": {
        "appinvite_service": {
          "other_platform_oauth_client": [
            {
              "client_id": "1054518873724-e7q104uvif17lj1qebiiap1s7t278vs3.apps.googleusercontent.com",
              "client_type": 3
            }
          ]
        }
      }
    }
  ],
  "configuration_version": "1"
}