{
  "Name": "EDR v0.12.0 Part 2",
  "Date": "2021-12-02",
  "User": {
    "Id": 8293593,
    "Name": "reduct-o-bot",
    "Email": "cicd@reduc.tech"
  },
  "Epic": null,
  "Milestone": {
    "Id": 2242901,
    "Name": "EDR v0.12.0",
    "Url": "https://gitlab.com/groups/reductech/-/milestones/24"
  },
  "Iteration": {
    "Id": 37506,
    "Name": "2021 December 1",
    "Url": "https://gitlab.com/groups/reductech/-/iterations/37506"
  },
  "Projects": [
    {
      "Name": "EDR",
      "Id": "17378877",
      "DependsOn": [
        "ConnectorManager",
        "Core",
        "FileSystem",
        "StructuredData",
        "Nuix",
        "Pwsh",
        "REST",
        "Singer",
        "SQL",
        "Relativity",
        "Tesseract",
        "TSK"
      ],
      "VersionIncrement": "Minor",
      "ReleaseBranch": "master",
      "LastReleaseDate": "2021-09-17T13:04:56",
      "CurrentVersion": "0.11.0",
      "ReleaseVersion": "0.12.0",
      "IssueTitle": "Prepare for release v0.12.0",
      "MergeRequests": 5,
      "ChangelogCount": 2,
      "WebUrl": "https://gitlab.com/reductech/edr/edr",
      "RepositoryUrl": "https://gitlab.com/reductech/edr/edr.git"
    }
  ],
  "IssueMR": {
    "IgnoreLabel": "excludecl",
    "IssueDescription": "Release checklist:\n\n- Project version matches the release version\n- Reductech projects have been updated to the latest release version\n- Changelog has been updated, including the release summary\n- Readme has been updated with the latest changes/examples",
    "IssueLabels": ["backstage", "area::release/packaging", "wf::doing", "excludecl"],
    "MergeRequestDescription": "- [ ] Check that project version(s) match the release version\n- [ ] Check changelog issues are correctly categorized\n- [ ] Add release summary to the changelog if one was not automatically generated\n- [ ] Update README with any changes since last release",
    "MergeRequestLabels": ["backstage", "area::release/packaging", "excludecl"]
  },
  "NoChangelogDescription": "Maintenance release - dependency updates only.",
  "DependencyFilter": "Reductech",
  "ReleasePackageRegex": "sign|package dll"
}
