{
	"id":3,
	"userId": "12345ASKGKLEW",
	"transactionDate": "2021-01-25T15:00:00Z",
	"status": "pending",
	"total": 1,
},
{
	"id":4,
	"userId": "12314DFHGG111",
	"transactionDate": "2021-01-25T15:00:00Z",
	"status": "pending",
	"total": 2,
},

//=== Reference Model===
{
	"id": Number
	"userId": String
	"transactionDate": String
	"status": String
	"total": Number
}

