{
	"info": {
		"_postman_id": "ab3d8b04-8060-42c5-931b-0959d3df452f",
		"name": "Scores JS",
		"schema": "https://schema.getpostman.com/json/collection/v2.1.0/collection.json"
	},
	"item": [
		{
			"name": "classement => get",
			"protocolProfileBehavior": {
				"disableBodyPruning": true
			},
			"request": {
				"method": "GET",
				"header": [
					{
						"key": "Accept",
						"value": "application/json",
						"type": "text"
					}
				],
				"body": {
					"mode": "raw",
					"raw": "",
					"options": {
						"raw": {
							"language": "json"
						}
					}
				},
				"url": {
					"raw": "http://localhost:8000/api/classement",
					"protocol": "http",
					"host": [
						"localhost"
					],
					"port": "8000",
					"path": [
						"api",
						"classement"
					]
				}
			},
			"response": []
		},
		{
			"name": "classement => post",
			"request": {
				"method": "POST",
				"header": [
					{
						"key": "Accept",
						"value": "application/json",
						"type": "text"
					}
				],
				"body": {
					"mode": "raw",
					"raw": "{\n    \"scoreGame\":1000,\n    \"scorePseudo\": \"Thomas Pe\"\n}",
					"options": {
						"raw": {
							"language": "json"
						}
					}
				},
				"url": {
					"raw": "http://localhost:8000/api/classement",
					"protocol": "http",
					"host": [
						"localhost"
					],
					"port": "8000",
					"path": [
						"api",
						"classement"
					]
				}
			},
			"response": []
		},
		{
			"name": "classement{id} => delete",
			"request": {
				"method": "DELETE",
				"header": [],
				"url": {
					"raw": "http://localhost:8000/api/classement/13",
					"protocol": "http",
					"host": [
						"localhost"
					],
					"port": "8000",
					"path": [
						"api",
						"classement",
						"13"
					]
				}
			},
			"response": []
		},
		{
			"name": "login => post",
			"request": {
				"method": "POST",
				"header": [],
				"body": {
					"mode": "raw",
					"raw": "{\n    \"username\": \"guiguisep@hotmail.fr\",\n    \"password\": \"123456\"\n}",
					"options": {
						"raw": {
							"language": "json"
						}
					}
				},
				"url": {
					"raw": "http://localhost:8000/api/login",
					"protocol": "http",
					"host": [
						"localhost"
					],
					"port": "8000",
					"path": [
						"api",
						"login"
					]
				}
			},
			"response": []
		},
		{
			"name": "me => get",
			"protocolProfileBehavior": {
				"disableBodyPruning": true
			},
			"request": {
				"auth": {
					"type": "bearer",
					"bearer": [
						{
							"key": "token",
							"value": "eyJ0eXAiOiJKV1QiLCJhbGciOiJSUzI1NiJ9.eyJpYXQiOjE2Mzc4Mzg4MjQsImV4cCI6MTYzNzg0MjQyNCwicm9sZXMiOlsiUk9MRV9VU0VSIl0sImlkIjoxLCJlbWFpbCI6Imd1aWd1aXNlcEBob3RtYWlsLmZyIn0.yIfkAO3k-xVmsyXsa5KjGzH0fDylnaLTxyDMPAqZTScWNz34RkMcNu3K-FpFIcdk6ax1YnvbDgOULpoYml2YLK5v-jwe6Y-ebA5spwgmT-P0KjVyjjiLAbKE7gHQD_wckBK7ylx4iIyD1aYspKzK9HugVu5vpiDi9_YljRj_2AN47RN2dxHe8oNdYda_f1_JSNSZZemrpVrMH5MKh1vs2TntwQ4nMeYGxYDsKiA9JG_gJB-10MQ1OPiytp-BKlRkXlse8HJNwthjnZ3c9Ps3hKIGZo-N2vBvxHw7xC6TQNwNN6fWR_8P_HJe1tqTwdHN8KBFErnEsjHoWnQWDeTdPg",
							"type": "string"
						}
					]
				},
				"method": "GET",
				"header": [
					{
						"warning": "This is a duplicate header and will be overridden by the Authorization header generated by Postman.",
						"key": "Authorization",
						"value": "Bearer",
						"type": "text"
					}
				],
				"body": {
					"mode": "raw",
					"raw": "{\n    \"username\": \"guiguisep@hotmail.fr\",\n    \"password\": \"123456\"\n}",
					"options": {
						"raw": {
							"language": "json"
						}
					}
				},
				"url": {
					"raw": "http://localhost:8000/api/me",
					"protocol": "http",
					"host": [
						"localhost"
					],
					"port": "8000",
					"path": [
						"api",
						"me"
					]
				}
			},
			"response": []
		},
		{
			"name": "scores => get",
			"request": {
				"method": "GET",
				"header": [],
				"url": {
					"raw": "http://localhost:8000/api/scores",
					"protocol": "http",
					"host": [
						"localhost"
					],
					"port": "8000",
					"path": [
						"api",
						"scores"
					]
				}
			},
			"response": []
		}
	]
}