<?xml version="1.0" encoding="utf-8"?>
<!-- Generator: Adobe Illustrator 23.1.0, SVG Export Plug-In . SVG Version: 6.00 Build 0)  -->
<svg version="1.1" id="Layer_1" xmlns="http://www.w3.org/2000/svg" xmlns:xlink="http://www.w3.org/1999/xlink" x="0px" y="0px"
	 viewBox="0 0 370.6 63.6" style="enable-background:new 0 0 370.6 63.6;" xml:space="preserve">
<style type="text/css">
	.st0{fill:#F7CCDB;}
	.st1{fill:#556270;}
</style>
<g>
	<path class="st0" d="M22.9,31.8c0,0,5.1-0.1,14-0.3c4.4-0.1,9.8-0.1,16-0.2c6.2-0.1,13.2-0.2,20.8-0.2c7.6-0.1,15.9-0.1,24.6-0.2
		c8.7-0.1,17.9-0.2,27.5-0.2c19.1-0.1,39.4-0.1,59.7-0.2c20.3,0.1,40.6,0.1,59.7,0.2c9.5,0,18.7,0.1,27.5,0.2
		c8.7,0.1,17,0.1,24.6,0.2c7.6,0.1,14.6,0.2,20.8,0.2c6.2,0.1,11.6,0.2,16,0.2c8.9,0.2,14,0.3,14,0.3s-5.1,0.1-14,0.3
		c-4.4,0.1-9.8,0.1-16,0.2c-6.2,0.1-13.2,0.2-20.8,0.2c-7.6,0.1-15.9,0.1-24.6,0.2c-8.7,0.1-17.9,0.2-27.5,0.2
		c-19.1,0.1-39.4,0.1-59.7,0.2c-20.3-0.1-40.6-0.1-59.7-0.2c-9.5,0-18.7-0.1-27.5-0.2c-8.7-0.1-17-0.1-24.6-0.2
		c-7.6-0.1-14.6-0.2-20.8-0.2c-6.2-0.1-11.6-0.2-16-0.2C28,31.9,22.9,31.8,22.9,31.8z"/>
	<g>
		<g>
			<path class="st0" d="M21.3,28.5c-0.1-0.5-0.3-1-0.5-1.5c-0.2-0.5-0.5-1-0.7-1.4c-0.5-0.9-1-1.9-1.5-2.8c-0.5-0.9-1.1-1.8-1.6-2.7
				c-0.6-0.9-1.1-1.8-1.7-2.6c-0.3-0.4-0.6-0.8-0.9-1.2c-0.4-0.4-0.7-0.7-1.1-1.1c-0.7-0.7-1.5-1.4-2.4-1.9c-0.8-0.6-1.8-1-2.8-1.3
				c-0.2-0.1-0.5-0.1-0.8-0.1c-0.3,0-0.5,0-0.7,0c-0.5,0.1-0.9,0.3-1.3,0.6c-0.4,0.3-0.6,0.7-0.7,1.2c-0.1,0.5-0.2,1-0.1,1.5
				c0.1,1,0.5,2,1,2.8c0.5,0.9,1.3,1.6,2,2.3c0.8,0.7,1.6,1.4,2.4,2c1.6,1.3,3.4,2.4,5.2,3.4c1.8,1,3.7,1.8,5.7,2.6L20.1,30
				c-0.5-0.2-1-0.4-1.6-0.6c-0.5-0.2-1.1-0.3-1.7-0.4c-1.1-0.2-2.3-0.2-3.5-0.1c-0.3,0-0.6,0.1-0.9,0.1c-0.3,0-0.6,0.1-0.9,0.2
				c-0.6,0.1-1.1,0.3-1.7,0.5c-0.5,0.2-1.1,0.5-1.5,0.8C8.2,30.6,8,30.8,7.8,31c-0.2,0.2-0.3,0.5-0.5,0.7l0,0c0,0-0.1,0.1-0.1,0
				c0,0-0.1-0.1,0-0.1c0.1-0.3,0.2-0.6,0.3-0.9C7.6,30.5,7.8,30.3,8,30c0.4-0.5,1-0.9,1.5-1.2c0.6-0.3,1.2-0.6,1.8-0.8
				c0.3-0.1,0.6-0.2,0.9-0.3c0.3-0.1,0.6-0.2,0.9-0.2c0.6-0.1,1.3-0.2,1.9-0.2c0.6,0,1.3,0,1.9,0c1.3,0.1,2.6,0.3,3.8,0.9L20.2,30
				c-2.1-0.7-4.1-1.6-6-2.7c-1.9-1.1-3.7-2.4-5.3-3.9c-0.8-0.7-1.6-1.5-2.3-2.3c-0.7-0.8-1.4-1.7-1.9-2.8c-0.5-1-0.8-2.1-0.8-3.2
				c0-0.6,0.1-1.1,0.2-1.7c0.2-0.5,0.4-1.1,0.9-1.5c0.5-0.4,1-0.6,1.6-0.7c0.3-0.1,0.6-0.1,0.9-0.1c0.3,0,0.6,0,0.8,0.1
				c1.1,0.1,2.2,0.5,3.2,1c1,0.5,2,1.1,2.8,1.8c0.4,0.4,0.9,0.8,1.2,1.1c0.4,0.4,0.8,0.9,1.1,1.3c1.2,1.8,2.2,3.8,3.1,5.7
				c0.4,1,0.8,2,1.2,3c0.2,0.5,0.3,1,0.5,1.6c0.1,0.5,0.3,1.1,0.2,1.6C21.5,28.5,21.4,28.6,21.3,28.5C21.3,28.5,21.3,28.5,21.3,28.5
				z"/>
			<path class="st0" d="M21.3,35.1c-0.1,0.5-0.3,1-0.5,1.5c-0.2,0.5-0.5,1-0.7,1.4c-0.5,0.9-1,1.9-1.5,2.8c-0.5,0.9-1.1,1.8-1.6,2.7
				c-0.6,0.9-1.1,1.8-1.7,2.6c-0.3,0.4-0.6,0.8-0.9,1.2c-0.4,0.4-0.7,0.7-1.1,1.1c-0.7,0.7-1.5,1.4-2.4,1.9c-0.8,0.6-1.8,1-2.8,1.3
				c-0.2,0.1-0.5,0.1-0.8,0.1c-0.3,0-0.5,0-0.7,0c-0.5-0.1-0.9-0.3-1.3-0.6c-0.4-0.3-0.6-0.7-0.7-1.2c-0.1-0.5-0.2-1-0.1-1.5
				c0.1-1,0.5-2,1-2.8c0.5-0.9,1.3-1.6,2-2.3c0.8-0.7,1.6-1.4,2.4-2c1.6-1.3,3.4-2.4,5.2-3.4c1.8-1,3.7-1.8,5.7-2.6l-0.7-1.8
				c-0.5,0.2-1,0.4-1.6,0.6c-0.5,0.2-1.1,0.3-1.7,0.4c-1.1,0.2-2.3,0.2-3.5,0.1c-0.3,0-0.6-0.1-0.9-0.1c-0.3,0-0.6-0.1-0.9-0.2
				c-0.6-0.1-1.1-0.3-1.7-0.5c-0.5-0.2-1.1-0.5-1.5-0.8C8.2,33,8,32.8,7.8,32.5c-0.2-0.2-0.3-0.5-0.5-0.7l0,0c0,0-0.1-0.1-0.1,0
				c0,0-0.1,0.1,0,0.1c0.1,0.3,0.2,0.6,0.3,0.9C7.6,33,7.8,33.3,8,33.5c0.4,0.5,1,0.9,1.5,1.2c0.6,0.3,1.2,0.6,1.8,0.8
				c0.3,0.1,0.6,0.2,0.9,0.3c0.3,0.1,0.6,0.2,0.9,0.2c0.6,0.1,1.3,0.2,1.9,0.2c0.6,0,1.3,0,1.9,0c1.3-0.1,2.6-0.3,3.8-0.9l-0.7-1.8
				c-2.1,0.7-4.1,1.6-6,2.7c-1.9,1.1-3.7,2.4-5.3,3.9c-0.8,0.7-1.6,1.5-2.3,2.3c-0.7,0.8-1.4,1.7-1.9,2.8c-0.5,1-0.8,2.1-0.8,3.2
				c0,0.6,0.1,1.1,0.2,1.7c0.2,0.5,0.4,1.1,0.9,1.5c0.5,0.4,1,0.6,1.6,0.7c0.3,0.1,0.6,0.1,0.9,0.1c0.3,0,0.6,0,0.8-0.1
				c1.1-0.1,2.2-0.5,3.2-1c1-0.5,2-1.1,2.8-1.8c0.4-0.4,0.9-0.8,1.2-1.1c0.4-0.4,0.8-0.9,1.1-1.3c1.2-1.8,2.2-3.8,3.1-5.7
				c0.4-1,0.8-2,1.2-3c0.2-0.5,0.3-1,0.5-1.6c0.1-0.5,0.3-1.1,0.2-1.6C21.5,35.1,21.4,35,21.3,35.1C21.3,35,21.3,35.1,21.3,35.1z"/>
		</g>
		<circle class="st0" cx="23.2" cy="31.9" r="2.2"/>
	</g>
	<g>
		<g>
			<path class="st0" d="M349.3,28.5c0.1-0.5,0.3-1,0.5-1.5c0.2-0.5,0.5-1,0.7-1.4c0.5-0.9,1-1.9,1.5-2.8c0.5-0.9,1.1-1.8,1.6-2.7
				c0.6-0.9,1.1-1.8,1.7-2.6c0.3-0.4,0.6-0.8,0.9-1.2c0.4-0.4,0.7-0.7,1.1-1.1c0.7-0.7,1.5-1.4,2.4-1.9c0.8-0.6,1.8-1,2.8-1.3
				c0.2-0.1,0.5-0.1,0.8-0.1c0.3,0,0.5,0,0.7,0c0.5,0.1,0.9,0.3,1.3,0.6c0.4,0.3,0.6,0.7,0.7,1.2c0.1,0.5,0.2,1,0.1,1.5
				c-0.1,1-0.5,2-1,2.8c-0.5,0.9-1.3,1.6-2,2.3c-0.8,0.7-1.6,1.4-2.4,2c-1.6,1.3-3.4,2.4-5.2,3.4c-1.8,1-3.7,1.8-5.7,2.6l0.7,1.8
				c0.5-0.2,1-0.4,1.6-0.6c0.5-0.2,1.1-0.3,1.7-0.4c1.1-0.2,2.3-0.2,3.5-0.1c0.3,0,0.6,0.1,0.9,0.1c0.3,0,0.6,0.1,0.9,0.2
				c0.6,0.1,1.1,0.3,1.7,0.5c0.5,0.2,1.1,0.5,1.5,0.8c0.2,0.2,0.4,0.4,0.6,0.6c0.2,0.2,0.3,0.5,0.5,0.7l0,0c0,0,0.1,0.1,0.1,0
				c0,0,0.1-0.1,0-0.1c-0.1-0.3-0.2-0.6-0.3-0.9c-0.2-0.3-0.3-0.6-0.6-0.8c-0.4-0.5-1-0.9-1.5-1.2c-0.6-0.3-1.2-0.6-1.8-0.8
				c-0.3-0.1-0.6-0.2-0.9-0.3c-0.3-0.1-0.6-0.2-0.9-0.2c-0.6-0.1-1.3-0.2-1.9-0.2c-0.6,0-1.3,0-1.9,0c-1.3,0.1-2.6,0.3-3.8,0.9
				l0.7,1.8c2.1-0.7,4.1-1.6,6-2.7c1.9-1.1,3.7-2.4,5.3-3.9c0.8-0.7,1.6-1.5,2.3-2.3c0.7-0.8,1.4-1.7,1.9-2.8c0.5-1,0.8-2.1,0.8-3.2
				c0-0.6-0.1-1.1-0.2-1.7c-0.2-0.5-0.4-1.1-0.9-1.5c-0.5-0.4-1-0.6-1.6-0.7c-0.3-0.1-0.6-0.1-0.9-0.1c-0.3,0-0.6,0-0.8,0.1
				c-1.1,0.1-2.2,0.5-3.2,1c-1,0.5-2,1.1-2.8,1.8c-0.4,0.4-0.9,0.8-1.2,1.1c-0.4,0.4-0.8,0.9-1.1,1.3c-1.2,1.8-2.2,3.8-3.1,5.7
				c-0.4,1-0.8,2-1.2,3c-0.2,0.5-0.3,1-0.5,1.6c-0.1,0.5-0.3,1.1-0.2,1.6C349.2,28.5,349.2,28.6,349.3,28.5
				C349.3,28.5,349.3,28.5,349.3,28.5z"/>
			<path class="st0" d="M349.3,35.1c0.1,0.5,0.3,1,0.5,1.5c0.2,0.5,0.5,1,0.7,1.4c0.5,0.9,1,1.9,1.5,2.8c0.5,0.9,1.1,1.8,1.6,2.7
				c0.6,0.9,1.1,1.8,1.7,2.6c0.3,0.4,0.6,0.8,0.9,1.2c0.4,0.4,0.7,0.7,1.1,1.1c0.7,0.7,1.5,1.4,2.4,1.9c0.8,0.6,1.8,1,2.8,1.3
				c0.2,0.1,0.5,0.1,0.8,0.1c0.3,0,0.5,0,0.7,0c0.5-0.1,0.9-0.3,1.3-0.6c0.4-0.3,0.6-0.7,0.7-1.2c0.1-0.5,0.2-1,0.1-1.5
				c-0.1-1-0.5-2-1-2.8c-0.5-0.9-1.3-1.6-2-2.3c-0.8-0.7-1.6-1.4-2.4-2c-1.6-1.3-3.4-2.4-5.2-3.4c-1.8-1-3.7-1.8-5.7-2.6l0.7-1.8
				c0.5,0.2,1,0.4,1.6,0.6c0.5,0.2,1.1,0.3,1.7,0.4c1.1,0.2,2.3,0.2,3.5,0.1c0.3,0,0.6-0.1,0.9-0.1c0.3,0,0.6-0.1,0.9-0.2
				c0.6-0.1,1.1-0.3,1.7-0.5c0.5-0.2,1.1-0.5,1.5-0.8c0.2-0.2,0.4-0.4,0.6-0.6c0.2-0.2,0.3-0.5,0.5-0.7l0,0c0,0,0.1-0.1,0.1,0
				c0,0,0.1,0.1,0,0.1c-0.1,0.3-0.2,0.6-0.3,0.9c-0.2,0.3-0.3,0.6-0.6,0.8c-0.4,0.5-1,0.9-1.5,1.2c-0.6,0.3-1.2,0.6-1.8,0.8
				c-0.3,0.1-0.6,0.2-0.9,0.3c-0.3,0.1-0.6,0.2-0.9,0.2c-0.6,0.1-1.3,0.2-1.9,0.2c-0.6,0-1.3,0-1.9,0c-1.3-0.1-2.6-0.3-3.8-0.9
				l0.7-1.8c2.1,0.7,4.1,1.6,6,2.7c1.9,1.1,3.7,2.4,5.3,3.9c0.8,0.7,1.6,1.5,2.3,2.3c0.7,0.8,1.4,1.7,1.9,2.8c0.5,1,0.8,2.1,0.8,3.2
				c0,0.6-0.1,1.1-0.2,1.7c-0.2,0.5-0.4,1.1-0.9,1.5c-0.5,0.4-1,0.6-1.6,0.7c-0.3,0.1-0.6,0.1-0.9,0.1c-0.3,0-0.6,0-0.8-0.1
				c-1.1-0.1-2.2-0.5-3.2-1c-1-0.5-2-1.1-2.8-1.8c-0.4-0.4-0.9-0.8-1.2-1.1c-0.4-0.4-0.8-0.9-1.1-1.3c-1.2-1.8-2.2-3.8-3.1-5.7
				c-0.4-1-0.8-2-1.2-3c-0.2-0.5-0.3-1-0.5-1.6c-0.1-0.5-0.3-1.1-0.2-1.6C349.2,35.1,349.2,35,349.3,35.1
				C349.3,35,349.3,35.1,349.3,35.1z"/>
		</g>
		<circle class="st0" cx="347.4" cy="31.9" r="2.2"/>
	</g>
	<g>
		<circle class="st0" cx="185.5" cy="31.8" r="4.2"/>
		<path class="st1" d="M185.5,29.4c1.3,0,2.4,1.1,2.4,2.4c0,1.3-1.1,2.4-2.4,2.4s-2.4-1.1-2.4-2.4C183.1,30.4,184.2,29.4,185.5,29.4
			 M185.5,25.9c-3.3,0-5.9,2.6-5.9,5.9s2.6,5.9,5.9,5.9s5.9-2.6,5.9-5.9S188.8,25.9,185.5,25.9L185.5,25.9z"/>
	</g>
</g>
</svg>
