<svg width="16" height="16" viewBox="0 0 16 16" fill="none" xmlns="http://www.w3.org/2000/svg">
<path d="M11.6 9.73343L10.5954 9.73343C10.3744 9.73343 10.1953 9.55435 10.1953 9.33343C10.1953 9.11252 10.3744 8.93343 10.5953 8.93343L11.6 8.93343C11.8209 8.93343 12 9.11252 12 9.33343C12 9.55435 11.8209 9.73343 11.6 9.73343Z" fill="#1F1F1F"/>
<path d="M8.58605 9.73344L7.41395 9.73344C7.19304 9.73344 7.01395 9.55435 7.01395 9.33344C7.01395 9.11252 7.19304 8.93344 7.41395 8.93344L8.58605 8.93344C8.80696 8.93343 8.98605 9.11252 8.98605 9.33344C8.98605 9.55435 8.80696 9.73344 8.58605 9.73344Z" fill="#1F1F1F"/>
<path d="M5.40465 9.73344L4.4 9.73344C4.17909 9.73344 4 9.55436 4 9.33344C4 9.11253 4.17909 8.93344 4.4 8.93344L5.40465 8.93344C5.62556 8.93344 5.80465 9.11252 5.80465 9.33344C5.80465 9.55435 5.62557 9.73344 5.40465 9.73344Z" fill="#1F1F1F"/>
<path d="M7.41395 11.7334L8.58605 11.7334C8.80696 11.7334 8.98605 11.5543 8.98605 11.3334C8.98605 11.1125 8.80696 10.9334 8.58605 10.9334L7.41395 10.9334C7.19304 10.9334 7.01395 11.1125 7.01395 11.3334C7.01395 11.5543 7.19304 11.7334 7.41395 11.7334Z" fill="#1F1F1F"/>
<path d="M4.4 11.7334L5.40465 11.7334C5.62557 11.7334 5.80465 11.5543 5.80465 11.3334C5.80465 11.1125 5.62556 10.9334 5.40465 10.9334L4.4 10.9334C4.17909 10.9334 4 11.1125 4 11.3334C4 11.5544 4.17909 11.7334 4.4 11.7334Z" fill="#1F1F1F"/>
<path fill-rule="evenodd" clip-rule="evenodd" d="M5.73327 1.7335C5.73327 1.51258 5.55418 1.3335 5.33327 1.3335C5.11235 1.3335 4.93327 1.51258 4.93327 1.7335V2.66683H4C2.89543 2.66683 2 3.56226 2 4.66683V12.6668C2 13.7714 2.89543 14.6668 4 14.6668H12C13.1046 14.6668 14 13.7714 14 12.6668V4.66683C14 3.56226 13.1046 2.66683 12 2.66683H11.0666V1.7335C11.0666 1.51258 10.8875 1.3335 10.6666 1.3335C10.4457 1.3335 10.2666 1.51258 10.2666 1.7335V2.66683H5.73327L5.73327 1.7335ZM12 3.46683H4C3.33726 3.46683 2.8 4.00409 2.8 4.66683V6.00016L13.2 6.00016V4.66683C13.2 4.00409 12.6627 3.46683 12 3.46683ZM2.8 12.6668V6.80016L13.2 6.80016V12.6668C13.2 13.3296 12.6627 13.8668 12 13.8668H4C3.33726 13.8668 2.8 13.3296 2.8 12.6668Z" fill="#1F1F1F"/>
</svg>
