<svg width="17" height="16" viewBox="0 0 17 16" fill="none" xmlns="http://www.w3.org/2000/svg">
<path fill-rule="evenodd" clip-rule="evenodd" d="M8.00016 1.0835C4.18019 1.0835 1.0835 4.18019 1.0835 8.00016C1.0835 11.8201 4.18019 14.9168 8.00016 14.9168C11.6732 14.9168 14.6778 12.0535 14.9032 8.43758C14.9204 8.16198 15.1578 7.95248 15.4334 7.96966C15.709 7.98684 15.9185 8.22419 15.9013 8.4998C15.6432 12.6395 12.2046 15.9168 8.00016 15.9168C3.62791 15.9168 0.0834961 12.3724 0.0834961 8.00016C0.0834961 3.62791 3.62791 0.0834961 8.00016 0.0834961C10.9142 0.0834961 13.4599 1.6582 14.8337 4.00068C14.9734 4.23888 14.8935 4.54523 14.6553 4.68492C14.4171 4.82462 14.1108 4.74476 13.9711 4.50656C12.7694 2.45753 10.545 1.0835 8.00016 1.0835Z" fill="#5B5C5B"/>
<path fill-rule="evenodd" clip-rule="evenodd" d="M15.5694 0.238364C15.844 0.267228 16.0433 0.513259 16.0144 0.787889L15.666 4.10296C15.589 4.83531 14.9329 5.36659 14.2006 5.28962L10.8855 4.94119C10.6109 4.91233 10.4116 4.6663 10.4405 4.39167C10.4694 4.11704 10.7154 3.9178 10.99 3.94667L14.3051 4.2951C14.4882 4.31434 14.6522 4.18152 14.6714 3.99843L15.0199 0.68336C15.0487 0.408731 15.2948 0.209499 15.5694 0.238364Z" fill="#5B5C5B"/>
</svg>
