<svg width="16" height="16" viewBox="0 0 16 16" fill="none" xmlns="http://www.w3.org/2000/svg">
<path d="M3.94944 3.38376C3.79323 3.22755 3.53997 3.22755 3.38376 3.38376C3.22755 3.53997 3.22755 3.79323 3.38376 3.94944L7.43432 8L3.38389 12.0504C3.22768 12.2066 3.22768 12.4599 3.38389 12.6161C3.5401 12.7723 3.79336 12.7723 3.94957 12.6161L8 8.56569L12.0504 12.6161C12.2066 12.7723 12.4599 12.7723 12.6161 12.6161C12.7723 12.4599 12.7723 12.2066 12.6161 12.0504L8.56569 8L12.6162 3.94944C12.7724 3.79323 12.7724 3.53997 12.6162 3.38376C12.46 3.22755 12.2068 3.22755 12.0506 3.38376L8 7.43432L3.94944 3.38376Z" fill="#979998"/>
</svg>
