<svg width="10" height="10" viewBox="0 0 10 10" fill="none" xmlns="http://www.w3.org/2000/svg">
<path fill-rule="evenodd" clip-rule="evenodd" d="M5.26517 1.86056C5.26024 1.85562 5.25521 1.85085 5.25008 1.84625L5.25008 8.15322C5.25521 8.14862 5.26024 8.14385 5.26516 8.13892L6.69822 6.70417C6.79585 6.60642 6.95415 6.60642 7.05178 6.70417C7.14941 6.80192 7.14941 6.96039 7.05178 7.05814L5.61872 8.49289C5.45281 8.659 5.23685 8.74445 5.01945 8.74926C5.01306 8.74975 5.0066 8.75 5.00008 8.75C4.99359 8.75 4.98715 8.74975 4.98078 8.74927C4.7633 8.74451 4.54725 8.65905 4.38128 8.49289L2.94822 7.05814C2.85059 6.96039 2.85059 6.80192 2.94822 6.70417C3.04585 6.60642 3.20415 6.60642 3.30178 6.70417L4.73484 8.13892C4.73981 8.14391 4.7449 8.14872 4.75008 8.15337L4.75008 1.84611C4.7449 1.85076 4.73981 1.85557 4.73484 1.86056L3.30178 3.29531C3.20415 3.39305 3.04586 3.39305 2.94822 3.29531C2.85059 3.19756 2.85059 3.03908 2.94822 2.94134L4.38128 1.50658C4.72299 1.16447 5.27701 1.16447 5.61872 1.50658L7.05178 2.94134C7.14941 3.03908 7.14941 3.19756 7.05178 3.29531C6.95415 3.39305 6.79586 3.39305 6.69822 3.29531L5.26517 1.86056Z" fill="#5B5C5B"/>
</svg>
