<svg width="20" height="20" viewBox="0 0 20 20" fill="none" xmlns="http://www.w3.org/2000/svg">
<path fill-rule="evenodd" clip-rule="evenodd" d="M11.5629 4.81403L10.7177 5.68613C10.5294 5.88049 10.2703 5.9902 9.99962 5.9902C9.72897 5.9902 9.46987 5.88049 9.28152 5.68613L8.43635 4.81403C7.79869 4.15606 6.94066 3.79243 6.05284 3.79243C5.16503 3.79243 4.30699 4.15606 3.66934 4.81403C3.03065 5.47307 2.6665 6.37342 2.6665 7.31855C2.6665 8.26368 3.03065 9.16403 3.66934 9.82306L9.8201 16.1698C9.91832 16.2712 10.0809 16.2712 10.1792 16.1698L16.3299 9.82306C16.646 9.49707 16.8985 9.10815 17.0712 8.67807C17.2439 8.24794 17.3332 7.78588 17.3332 7.31855C17.3332 6.85121 17.2439 6.38915 17.0712 5.95903C16.8985 5.52895 16.6461 5.1402 16.3301 4.8142C16.0142 4.48811 15.6405 4.23083 15.2319 4.05613C14.8234 3.88146 14.3867 3.79199 13.9464 3.79199C13.5061 3.79199 13.0694 3.88146 12.6609 4.05613C12.2523 4.23083 11.8788 4.48794 11.5629 4.81403ZM17.048 4.1181C16.6408 3.69769 16.1573 3.36418 15.6251 3.13664C15.0929 2.90911 14.5225 2.79199 13.9464 2.79199C13.3703 2.79199 12.7999 2.90911 12.2677 3.13664C11.7356 3.36418 11.252 3.69769 10.8448 4.1181L9.99962 4.9902L9.15446 4.1181C8.33186 3.26929 7.21617 2.79243 6.05284 2.79243C4.88951 2.79243 3.77383 3.26929 2.95123 4.1181C2.12863 4.96691 1.6665 6.11815 1.6665 7.31855C1.6665 8.51895 2.12863 9.67018 2.95123 10.519L9.10199 16.8658C9.59312 17.3725 10.4061 17.3725 10.8973 16.8658L17.048 10.519C17.4554 10.0988 17.7787 9.59985 17.9992 9.0507C18.2197 8.50156 18.3332 7.91297 18.3332 7.31855C18.3332 6.72413 18.2197 6.13554 17.9992 5.58639C17.7787 5.03725 17.4554 4.53832 17.048 4.1181Z" fill="#5B5C5B"/>
</svg>
