<svg width="17" height="16" viewBox="0 0 17 16" fill="none" xmlns="http://www.w3.org/2000/svg">
<path fill-rule="evenodd" clip-rule="evenodd" d="M12.0107 7.601C12.2127 7.82833 12.2127 8.1709 12.0107 8.39823L7.26787 13.7339C7.1211 13.899 7.13598 14.1518 7.30109 14.2986C7.4662 14.4453 7.71903 14.4305 7.8658 14.2654L12.6086 8.92972C13.0801 8.39928 13.0801 7.59994 12.6086 7.0695L7.8658 1.73387C7.71903 1.56875 7.4662 1.55388 7.30109 1.70065C7.13598 1.84742 7.1211 2.10025 7.26787 2.26536L12.0107 7.601Z" fill="#5B5C5B"/>
<path fill-rule="evenodd" clip-rule="evenodd" d="M8.67732 7.601C8.8794 7.82833 8.8794 8.1709 8.67733 8.39823L3.93454 13.7339C3.78777 13.899 3.80264 14.1518 3.96775 14.2986C4.13287 14.4453 4.3857 14.4305 4.53246 14.2654L9.27525 8.92972C9.74676 8.39928 9.74675 7.59994 9.27525 7.0695L4.53246 1.73387C4.3857 1.56875 4.13287 1.55388 3.96775 1.70065C3.80264 1.84742 3.78777 2.10025 3.93454 2.26536L8.67732 7.601Z" fill="#5B5C5B"/>
</svg>
