<svg width="12" height="12" viewBox="0 0 12 12" fill="none" xmlns="http://www.w3.org/2000/svg">
<path d="M6.75 6C6.75 6.41421 6.41421 6.75 6 6.75C5.58579 6.75 5.25 6.41421 5.25 6C5.25 5.58579 5.58579 5.25 6 5.25C6.41421 5.25 6.75 5.58579 6.75 6Z" fill="#5B5C5B"/>
<path d="M6.75 9.75C6.75 10.1642 6.41421 10.5 6 10.5C5.58579 10.5 5.25 10.1642 5.25 9.75C5.25 9.33579 5.58579 9 6 9C6.41421 9 6.75 9.33579 6.75 9.75Z" fill="#5B5C5B"/>
<path d="M6.75 2.25C6.75 2.66421 6.41421 3 6 3C5.58579 3 5.25 2.66421 5.25 2.25C5.25 1.83579 5.58579 1.5 6 1.5C6.41421 1.5 6.75 1.83579 6.75 2.25Z" fill="#5B5C5B"/>
</svg>
