<svg width="16" height="16" viewBox="0 0 16 16" fill="none" xmlns="http://www.w3.org/2000/svg">
<path fill-rule="evenodd" clip-rule="evenodd" d="M13.8673 8.00016C13.8673 4.76009 11.2407 2.1335 8.00065 2.1335C4.76058 2.1335 2.13398 4.76009 2.13398 8.00016C2.13398 11.2402 4.76058 13.8668 8.00065 13.8668C11.2407 13.8668 13.8673 11.2402 13.8673 8.00016ZM14.6673 8.00016C14.6673 4.31826 11.6825 1.3335 8.00065 1.3335C4.31875 1.3335 1.33398 4.31826 1.33398 8.00016C1.33398 11.6821 4.31875 14.6668 8.00065 14.6668C11.6825 14.6668 14.6673 11.6821 14.6673 8.00016ZM4.66551 7.99504C4.66551 7.77412 4.8446 7.59504 5.06551 7.59504L10.2462 7.59503L8.26255 5.61137C8.10634 5.45516 8.10634 5.2019 8.26255 5.04569C8.41876 4.88948 8.67203 4.88948 8.82824 5.04569L11.0235 7.24095C11.4401 7.65751 11.4401 8.33289 11.0235 8.74944L8.82824 10.9447C8.67203 11.1009 8.41876 11.1009 8.26255 10.9447C8.10634 10.7885 8.10634 10.5352 8.26255 10.379L10.2465 8.39503H5.06551C4.8446 8.39503 4.66551 8.21595 4.66551 7.99504Z" fill="#5B5C5B"/>
</svg>
