<svg width="16" height="16" viewBox="0 0 16 16" fill="none" xmlns="http://www.w3.org/2000/svg">
<path fill-rule="evenodd" clip-rule="evenodd" d="M8.39872 6.28505C8.17139 6.08298 7.82881 6.08298 7.60148 6.28505L2.26585 11.0278C2.10073 11.1746 1.84791 11.1597 1.70114 10.9946C1.55437 10.8295 1.56924 10.5767 1.73436 10.4299L7.06999 5.68712C7.60043 5.21562 8.39977 5.21562 8.93021 5.68712L14.2658 10.4299C14.431 10.5767 14.4458 10.8295 14.2991 10.9946C14.1523 11.1597 13.8995 11.1746 13.7344 11.0278L8.39872 6.28505Z" fill="#5B5C5B"/>
</svg>
