<svg width="20" height="20" viewBox="0 0 20 20" fill="none" xmlns="http://www.w3.org/2000/svg">
<path fill-rule="evenodd" clip-rule="evenodd" d="M18.1862 5.31295C18.3815 5.50821 18.3815 5.8248 18.1862 6.02006L9.27959 14.9267C8.59625 15.61 7.48838 15.6101 6.80493 14.9269L1.81252 9.93627C1.61723 9.74104 1.61717 9.42446 1.8124 9.22916C2.00763 9.03387 2.32421 9.03381 2.51951 9.22904L7.51191 14.2197C7.80482 14.5125 8.27962 14.5125 8.57248 14.2196L17.4791 5.31295C17.6744 5.11769 17.991 5.11769 18.1862 5.31295Z" fill="white"/>
</svg>
