<svg width="16" height="16" viewBox="0 0 16 16" fill="none" xmlns="http://www.w3.org/2000/svg">
<path fill-rule="evenodd" clip-rule="evenodd" d="M14.6673 8.00016C14.6673 11.6821 11.6825 14.6668 8.00065 14.6668C4.31875 14.6668 1.33398 11.6821 1.33398 8.00016C1.33398 4.31826 4.31875 1.3335 8.00065 1.3335C11.6825 1.3335 14.6673 4.31826 14.6673 8.00016ZM6.28375 5.71726C6.12754 5.56105 5.87428 5.56105 5.71807 5.71726C5.56186 5.87346 5.56186 6.12673 5.71807 6.28294L7.43523 8.0001L5.71807 9.71725C5.56186 9.87347 5.56186 10.1267 5.71807 10.2829C5.87428 10.4392 6.12754 10.4392 6.28375 10.2829L8.00091 8.56578L9.71807 10.2829C9.87428 10.4392 10.1275 10.4392 10.2838 10.2829C10.44 10.1267 10.44 9.87347 10.2838 9.71725L8.5666 8.0001L10.2838 6.28294C10.44 6.12673 10.44 5.87346 10.2838 5.71726C10.1275 5.56105 9.87428 5.56105 9.71807 5.71726L8.00091 7.43441L6.28375 5.71726Z" fill="#979998"/>
</svg>
