<svg width="24" height="24" viewBox="0 0 24 24" fill="none" xmlns="http://www.w3.org/2000/svg">
<path fill-rule="evenodd" clip-rule="evenodd" d="M19.5364 14.7635C19.8879 15.115 19.8879 15.6848 19.5364 16.0363L15.5971 19.9756C15.3627 20.21 15.3627 20.5899 15.5971 20.8242C15.8314 21.0585 16.2113 21.0585 16.4456 20.8242L20.3849 16.8848C21.205 16.0647 21.205 14.7351 20.3849 13.915L16.4456 9.97564C16.2113 9.74132 15.8314 9.74132 15.5971 9.97564C15.3627 10.21 15.3627 10.5899 15.5971 10.8242L19.5364 14.7635Z" fill="#5B5C5B"/>
<path fill-rule="evenodd" clip-rule="evenodd" d="M3.6 3C3.26863 3 3 3.26863 3 3.6V13.0999C3 14.7568 4.34315 16.0999 6 16.0999H20C20.3314 16.0999 20.6 15.8313 20.6 15.4999C20.6 15.1685 20.3314 14.8999 20 14.8999H6C5.00589 14.8999 4.2 14.094 4.2 13.0999V3.6C4.2 3.26863 3.93137 3 3.6 3Z" fill="#5B5C5B"/>
</svg>
