<svg width="16" height="16" viewBox="0 0 16 16" fill="none" xmlns="http://www.w3.org/2000/svg">
<path d="M7.60059 14.2668C7.60059 14.4877 7.77967 14.6668 8.00059 14.6668C8.2215 14.6668 8.40059 14.4877 8.40059 14.2668V8.4001H14.2673C14.4882 8.4001 14.6673 8.22101 14.6673 8.0001C14.6673 7.77918 14.4882 7.6001 14.2673 7.6001H8.40059V1.7335C8.40059 1.51258 8.2215 1.3335 8.00059 1.3335C7.77967 1.3335 7.60059 1.51258 7.60059 1.7335V7.6001H1.73398C1.51307 7.6001 1.33398 7.77918 1.33398 8.0001C1.33398 8.22101 1.51307 8.4001 1.73398 8.4001H7.60059V14.2668Z" fill="#5B5C5B"/>
</svg>
