<svg width="17" height="16" viewBox="0 0 17 16" fill="none" xmlns="http://www.w3.org/2000/svg">
<path fill-rule="evenodd" clip-rule="evenodd" d="M6.78505 7.60177C6.58298 7.8291 6.58298 8.17167 6.78505 8.399L11.5278 13.7346C11.6746 13.8998 11.6597 14.1526 11.4946 14.2994C11.3295 14.4461 11.0767 14.4312 10.9299 14.2661L6.18712 8.9305C5.71562 8.40005 5.71562 7.60072 6.18712 7.07028L10.9299 1.73464C11.0767 1.56953 11.3295 1.55466 11.4946 1.70142C11.6597 1.84819 11.6746 2.10102 11.5278 2.26613L6.78505 7.60177Z" fill="#5B5C5B"/>
</svg>
