{
  "project_info": {
    "project_number": "1064318733936",
    "firebase_url": "https://zitagon-9155a.firebaseio.com",
    "project_id": "zitagon-9155a",
    "storage_bucket": "zitagon-9155a.appspot.com"
  },
  "client": [
    {
      "client_info": {
        "mobilesdk_app_id": "1:1064318733936:android:95fe970bc868a35f",
        "android_client_info": {
          "package_name": "com.zitagon.fire"
        }
      },
      "oauth_client": [
        {
          "client_id": "1064318733936-v69s85erennjr33nl3bban27vq5l4i6h.apps.googleusercontent.com",
          "client_type": 3
        }
      ],
      "api_key": [
        {
          "current_key": "AIzaSyDkhlm9XyB3rQcXhvETSJXNv5Z-MzpZoec"
        }
      ],
      "services": {
        "analytics_service": {
          "status": 1
        },
        "appinvite_service": {
          "status": 1,
          "other_platform_oauth_client": []
        },
        "ads_service": {
          "status": 2
        }
      }
    }
  ],
  "configuration_version": "1"
}