<svg width="1390" height="310" viewBox="0 0 1390 310" fill="none" xmlns="http://www.w3.org/2000/svg">
<rect x="11" y="11" width="1368" height="288" rx="4" fill="#009688" stroke="white" stroke-width="2"/>
<rect x="0.5" y="0.5" width="1389" height="309" rx="4.5" stroke="white"/>
<path d="M582.41 229C578.187 229 574.766 228.243 572.148 226.73C569.53 225.216 568.22 223.065 568.22 220.276C568.22 217.209 569.946 214.918 573.397 213.404C571.449 212.448 570.474 211.213 570.474 209.699C570.474 207.787 571.652 206.373 574.006 205.457C572.341 204.461 571.062 203.106 570.17 201.392C569.276 199.68 568.829 197.748 568.829 195.598C568.829 193.446 569.327 191.503 570.321 189.77C571.315 188.037 572.736 186.673 574.584 185.677C576.432 184.681 578.615 184.183 581.132 184.183C583.811 184.183 586.247 184.94 588.44 186.453C590.592 185.258 593.068 184.661 595.869 184.661H596.358L595.687 188.246H594.286C593.92 188.246 593.393 188.286 592.704 188.366C592.013 188.446 591.404 188.545 590.877 188.665C591.729 189.621 592.378 190.697 592.824 191.892C593.271 193.087 593.495 194.322 593.495 195.598C593.495 197.828 592.997 199.829 592.001 201.602C591.007 203.375 589.576 204.77 587.709 205.785C585.841 206.801 583.648 207.309 581.132 207.309C579.67 207.309 578.329 207.129 577.111 206.77C576.178 207.09 575.711 207.608 575.711 208.325C575.711 209.28 576.828 209.918 579.061 210.238L587.038 211.492C590.368 212.009 592.885 212.946 594.591 214.301C596.296 215.654 597.149 217.526 597.149 219.917C597.149 222.904 595.839 225.165 593.219 226.699C590.601 228.233 586.998 229 582.41 229ZM581.132 203.006C583.405 203.006 585.161 202.339 586.4 201.004C587.637 199.669 588.256 197.887 588.256 195.657C588.256 193.505 587.637 191.772 586.4 190.457C585.161 189.143 583.405 188.486 581.132 188.486C578.858 188.486 577.111 189.143 575.893 190.457C574.675 191.772 574.066 193.505 574.066 195.657C574.066 197.887 574.675 199.669 575.893 201.004C577.111 202.339 578.858 203.006 581.132 203.006ZM582.897 224.219C585.699 224.219 587.851 223.861 589.354 223.144C590.855 222.427 591.606 221.392 591.606 220.037C591.606 219.001 591.149 218.175 590.236 217.557C589.322 216.939 587.952 216.451 586.125 216.093L577.598 214.659C576.38 215.217 575.386 215.904 574.615 216.722C573.843 217.537 573.457 218.443 573.457 219.439C573.457 221.073 574.29 222.278 575.955 223.055C577.62 223.831 579.933 224.219 582.897 224.219ZM600.681 214.061V184.78H605.189L605.858 189.622C607.4 187.749 608.872 186.375 610.272 185.498C611.674 184.621 613.146 184.183 614.689 184.183C615.176 184.183 615.643 184.243 616.089 184.362L615.542 190.278C615.013 190.159 614.404 190.1 613.715 190.1C612.212 190.1 610.791 190.428 609.452 191.085C608.111 191.743 607.136 192.509 606.527 193.386V214.061H600.681ZM632.168 214.659C629.123 214.659 626.484 213.991 624.251 212.657C622.018 211.322 620.312 209.499 619.134 207.189C617.957 204.879 617.369 202.289 617.369 199.421C617.369 196.552 617.957 193.963 619.134 191.652C620.312 189.342 622.018 187.52 624.251 186.185C626.484 184.85 629.123 184.183 632.168 184.183C635.172 184.183 637.8 184.85 640.054 186.185C642.308 187.52 644.023 189.342 645.2 191.652C646.378 193.963 646.967 196.552 646.967 199.421C646.967 202.289 646.378 204.879 645.2 207.189C644.023 209.499 642.308 211.322 640.054 212.657C637.8 213.991 635.172 214.659 632.168 214.659ZM632.168 209.878C635.092 209.878 637.355 208.962 638.958 207.13C640.562 205.297 641.363 202.727 641.363 199.421C641.363 196.114 640.562 193.545 638.958 191.713C637.355 189.88 635.092 188.963 632.168 188.963C629.244 188.963 626.981 189.88 625.378 191.713C623.773 193.545 622.971 196.114 622.971 199.421C622.971 202.727 623.773 205.297 625.378 207.13C626.981 208.962 629.244 209.878 632.168 209.878ZM658.294 214.061L649.343 184.78H655.798L661.523 208.146L667.856 185.677H673.52L679.914 208.146L685.64 184.78H692.095L683.082 214.061H676.931L670.719 192.429L664.446 214.061H658.294ZM706.774 214.659C704.135 214.659 702.176 213.982 700.897 212.628C699.618 211.273 698.979 209.619 698.979 207.667V188.963H693.862L694.349 184.78H698.979V177.551L704.46 177.012V184.78H712.315V188.963H704.46V204.38C704.46 206.413 704.581 207.807 704.824 208.563C705.067 209.32 705.585 209.809 706.378 210.028C707.169 210.247 708.621 210.356 710.732 210.356H712.133L711.706 214.659H706.774ZM731.257 184.183C735.033 184.183 737.915 185.398 739.903 187.829C741.893 190.259 742.888 193.565 742.888 197.748V214.061H737.407V198.404C737.407 195.178 736.808 192.798 735.611 191.264C734.412 189.73 732.555 188.963 730.039 188.963C728.495 188.963 727.074 189.312 725.776 190.01C724.476 190.707 723.38 191.692 722.486 192.967V214.061H716.945V169.244H722.486V187.589C723.664 186.474 724.953 185.628 726.354 185.051C727.754 184.472 729.388 184.183 731.257 184.183Z" fill="white"/>
<path d="M504.183 172.374L528.742 147.072" stroke="white" stroke-width="5" stroke-miterlimit="3" stroke-linecap="square"/>
<path d="M549.341 140.917C549.341 133.13 543.155 126.807 535.536 126.807C527.915 126.807 521.729 133.13 521.729 140.917C521.729 148.705 527.915 155.028 535.536 155.028C543.155 155.028 549.341 148.705 549.341 140.917Z" fill="white"/>
<path fill-rule="evenodd" clip-rule="evenodd" d="M504.004 112.333L476.262 85.1187L504.004 112.333ZM448.073 73.123C448.073 64.4761 455.274 57.4553 464.145 57.4553C473.014 57.4553 480.216 64.4761 480.216 73.123C480.216 81.7719 473.014 88.7927 464.145 88.7927C455.274 88.7927 448.073 81.7719 448.073 73.123Z" stroke="white" stroke-width="5" stroke-miterlimit="3" stroke-linecap="square"/>
<path d="M504.004 112.333L551.019 69.3414M593.079 29C565.176 29.4366 545.319 35.246 533.51 46.4281C519.095 60.0744 514.63 76.999 520.114 97.2017C542.286 102.506 560.53 98.38 574.846 84.8251C586.535 73.7562 592.612 55.1479 593.079 29Z" stroke="white" stroke-width="5" stroke-miterlimit="3" stroke-linecap="square"/>
<path d="M502.955 206.108L462.434 165.145" stroke="white" stroke-width="5" stroke-miterlimit="3" stroke-linecap="square"/>
<path d="M417 120.537C442.213 121.007 460.168 126.506 470.864 137.035C483.917 149.885 487.989 165.794 483.079 184.76C463.057 189.694 446.564 185.778 433.599 173.014C423.012 162.593 417.479 145.1 417 120.537Z" fill="white" stroke="white" stroke-width="5" stroke-miterlimit="3" stroke-linecap="square"/>
<path d="M503.914 113.402V228.423" stroke="white" stroke-width="5" stroke-miterlimit="3" stroke-linecap="square"/>
<path d="M734.012 268.575C733.932 270.306 733.465 271.839 732.61 273.172C731.756 274.493 730.554 275.519 729.004 276.248C727.466 276.977 725.706 277.342 723.724 277.342C720.454 277.342 717.879 276.277 715.999 274.146C714.119 272.015 713.179 269.008 713.179 265.123V263.892C713.179 261.454 713.601 259.323 714.444 257.5C715.298 255.666 716.523 254.253 718.118 253.262C719.713 252.26 721.559 251.758 723.655 251.758C726.674 251.758 729.101 252.556 730.936 254.151C732.77 255.735 733.812 257.922 734.063 260.713H728.082C728.036 259.198 727.654 258.11 726.937 257.449C726.219 256.788 725.125 256.458 723.655 256.458C722.163 256.458 721.069 257.016 720.374 258.133C719.679 259.249 719.314 261.032 719.28 263.482V265.242C719.28 267.897 719.611 269.794 720.271 270.933C720.944 272.072 722.094 272.642 723.724 272.642C725.102 272.642 726.156 272.317 726.885 271.668C727.614 271.019 728.002 269.987 728.047 268.575H734.012ZM735.857 267.583C735.857 265.738 736.216 264.097 736.934 262.662C737.652 261.215 738.683 260.104 740.027 259.329C741.372 258.554 742.95 258.167 744.761 258.167C747.53 258.167 749.712 259.027 751.307 260.748C752.902 262.457 753.699 264.786 753.699 267.737V267.942C753.699 270.825 752.896 273.115 751.29 274.812C749.694 276.499 747.53 277.342 744.795 277.342C742.164 277.342 740.05 276.556 738.455 274.983C736.86 273.4 736 271.258 735.875 268.558L735.857 267.583ZM741.617 267.942C741.617 269.651 741.884 270.905 742.42 271.702C742.955 272.5 743.747 272.898 744.795 272.898C746.846 272.898 747.894 271.32 747.94 268.165V267.583C747.94 264.268 746.88 262.61 744.761 262.61C742.836 262.61 741.793 264.04 741.634 266.9L741.617 267.942ZM761.68 258.509L761.868 260.679C763.178 259.004 764.939 258.167 767.149 258.167C769.485 258.167 771.062 259.096 771.883 260.953C773.136 259.096 774.948 258.167 777.317 258.167C781.066 258.167 782.991 260.434 783.094 264.969V277H777.317V265.328C777.317 264.382 777.158 263.693 776.839 263.26C776.52 262.827 775.939 262.61 775.096 262.61C773.956 262.61 773.108 263.117 772.549 264.131L772.566 264.371V277H766.79V265.362C766.79 264.393 766.636 263.693 766.329 263.26C766.021 262.827 765.434 262.61 764.568 262.61C763.463 262.61 762.62 263.117 762.039 264.131V277H756.28V258.509H761.68ZM791.827 258.509L792.015 260.679C793.325 259.004 795.085 258.167 797.295 258.167C799.631 258.167 801.209 259.096 802.029 260.953C803.283 259.096 805.094 258.167 807.464 258.167C811.212 258.167 813.138 260.434 813.24 264.969V277H807.464V265.328C807.464 264.382 807.304 263.693 806.985 263.26C806.666 262.827 806.085 262.61 805.242 262.61C804.103 262.61 803.254 263.117 802.696 264.131L802.713 264.371V277H796.937V265.362C796.937 264.393 796.783 263.693 796.475 263.26C796.167 262.827 795.581 262.61 794.715 262.61C793.61 262.61 792.767 263.117 792.186 264.131V277H786.426V258.509H791.827ZM815.804 267.583C815.804 265.738 816.163 264.097 816.88 262.662C817.598 261.215 818.629 260.104 819.974 259.329C821.318 258.554 822.896 258.167 824.708 258.167C827.476 258.167 829.658 259.027 831.253 260.748C832.848 262.457 833.646 264.786 833.646 267.737V267.942C833.646 270.825 832.842 273.115 831.236 274.812C829.641 276.499 827.476 277.342 824.742 277.342C822.11 277.342 819.996 276.556 818.401 274.983C816.806 273.4 815.946 271.258 815.821 268.558L815.804 267.583ZM821.563 267.942C821.563 269.651 821.831 270.905 822.366 271.702C822.902 272.5 823.694 272.898 824.742 272.898C826.792 272.898 827.841 271.32 827.886 268.165V267.583C827.886 264.268 826.827 262.61 824.708 262.61C822.782 262.61 821.74 264.04 821.58 266.9L821.563 267.942ZM841.473 258.509L841.661 260.679C842.937 259.004 844.697 258.167 846.941 258.167C848.867 258.167 850.302 258.742 851.248 259.893C852.205 261.044 852.701 262.776 852.735 265.088V277H846.958V265.328C846.958 264.393 846.771 263.71 846.395 263.277C846.019 262.833 845.335 262.61 844.344 262.61C843.216 262.61 842.378 263.055 841.832 263.943V277H836.072V258.509H841.473ZM865.621 271.805C865.621 271.315 865.364 270.922 864.852 270.625C864.339 270.329 863.365 270.022 861.929 269.703C860.494 269.384 859.309 268.968 858.375 268.455C857.44 267.931 856.728 267.299 856.238 266.558C855.748 265.818 855.503 264.969 855.503 264.012C855.503 262.314 856.204 260.918 857.605 259.825C859.007 258.72 860.841 258.167 863.108 258.167C865.547 258.167 867.506 258.72 868.987 259.825C870.468 260.93 871.209 262.382 871.209 264.183H865.433C865.433 262.701 864.652 261.961 863.091 261.961C862.487 261.961 861.98 262.132 861.57 262.474C861.16 262.804 860.955 263.22 860.955 263.721C860.955 264.234 861.206 264.65 861.707 264.969C862.208 265.288 863.006 265.55 864.1 265.755C865.205 265.96 866.173 266.205 867.005 266.49C869.785 267.447 871.175 269.161 871.175 271.634C871.175 273.32 870.423 274.693 868.919 275.752C867.426 276.812 865.49 277.342 863.108 277.342C861.525 277.342 860.112 277.057 858.87 276.487C857.628 275.918 856.66 275.143 855.965 274.163C855.27 273.183 854.922 272.152 854.922 271.07H860.306C860.328 271.924 860.613 272.551 861.16 272.95C861.707 273.337 862.408 273.531 863.262 273.531C864.048 273.531 864.635 273.371 865.022 273.052C865.421 272.733 865.621 272.317 865.621 271.805Z" fill="white"/>
</svg>
