<svg width="83" height="83" viewBox="0 0 83 83" fill="none" xmlns="http://www.w3.org/2000/svg">
<rect y="0.5" width="82.5" height="82.5" rx="15" fill="#1E1F29"/>
<path d="M54.9336 35.5441L45.9674 26.5836L49.3482 23.1647C50.1474 22.3633 51.1135 21.9627 52.2465 21.9627C53.3794 21.9627 54.3455 22.3633 55.1447 23.1647L58.3144 26.3428C59.1136 27.1441 59.5132 28.1127 59.5132 29.2486C59.5132 30.3845 59.1136 31.3531 58.3144 32.1544L54.9336 35.5441ZM21.2151 60.3614V51.2906L30.94 41.5402L19.5 30.0769L29.4472 20L40.9905 31.5443L45.9674 26.5836L54.9336 35.5441L49.9567 40.5341L61.5 52.0492L51.472 62L40.0095 50.5592L30.233 60.3614H21.2151ZM33.6272 38.8752L38.3034 34.1868L34.7968 30.6711L32.3185 33.1852L30.0623 30.8939L32.5407 28.409L29.5281 25.3592L24.8519 30.0769L33.6272 38.8752ZM51.3687 56.7151L56.0448 52.0559L53.0322 49.0061L50.5246 51.491L48.2685 49.1996L50.7469 46.7148L47.2695 43.2283L42.5934 47.9167L51.3687 56.7151ZM24.9844 56.5823H28.6278L49.5301 35.5958L45.9158 31.9428L24.9844 52.9V56.5823Z" fill="white"/>
</svg>
