<svg width="83" height="83" viewBox="0 0 83 83" fill="none" xmlns="http://www.w3.org/2000/svg">
<rect y="0.5" width="82.5" height="82.5" rx="15" fill="#1E1F29"/>
<path d="M23.5143 62C22.4161 62 21.4725 61.6055 20.6835 60.8165C19.8945 60.0275 19.5 59.0839 19.5 57.9857V34.1777C19.5 33.0717 19.8945 32.1213 20.6835 31.3267C21.4725 30.5321 22.4161 30.1348 23.5143 30.1348H34.5502V23.7851C34.5502 22.7829 34.9243 21.9015 35.6727 21.1409C36.421 20.3803 37.299 20 38.3067 20H42.7153C43.7176 20 44.599 20.3803 45.3596 21.1409C46.1202 21.9015 46.5005 22.7829 46.5005 23.7851V30.1348H57.4571C58.5631 30.1348 59.5135 30.5321 60.3081 31.3267C61.1027 32.1213 61.5 33.0717 61.5 34.1777V57.9857C61.5 59.0839 61.1027 60.0275 60.3081 60.8165C59.5135 61.6055 58.5631 62 57.4571 62H23.5143ZM23.5143 57.9857H57.4571V34.1777H46.5005C46.4432 35.1427 46.081 35.8907 45.4139 36.4217C44.7468 36.9527 43.9252 37.2182 42.9489 37.2182H38.0225C37.08 37.2182 36.2752 36.9527 35.6081 36.4217C34.941 35.8907 34.5884 35.1427 34.5502 34.1777H23.5143V57.9857ZM27.9185 53.0791H40.0296V52.3697C40.0296 51.7616 39.8776 51.2211 39.5736 50.7481C39.2695 50.2752 38.881 49.9542 38.4081 49.7853C37.327 49.4137 36.4824 49.1688 35.8743 49.0506C35.2663 48.9323 34.6751 48.8732 34.1008 48.8732C33.4589 48.8732 32.7748 48.9492 32.0485 49.1012C31.3221 49.2533 30.5029 49.4813 29.5908 49.7853C29.084 49.9542 28.6786 50.2752 28.3746 50.7481C28.0705 51.2211 27.9185 51.7616 27.9185 52.3697V53.0791ZM44.945 49.684H53.5596V47.1503H44.945V49.684ZM34.1008 47.1503C34.8609 47.1503 35.507 46.8842 36.039 46.3522C36.5711 45.8201 36.8372 45.174 36.8372 44.4139C36.8372 43.6538 36.5711 43.0077 36.039 42.4756C35.507 41.9435 34.8609 41.6775 34.1008 41.6775C33.3406 41.6775 32.6946 41.9435 32.1625 42.4756C31.6304 43.0077 31.3644 43.6538 31.3644 44.4139C31.3644 45.174 31.6304 45.8201 32.1625 46.3522C32.6946 46.8842 33.3406 47.1503 34.1008 47.1503ZM44.945 43.9578H53.5596V41.4241H44.945V43.9578ZM38.5645 33.1752H42.4576V24.0429H38.5645V33.1752Z" fill="white"/>
</svg>
