<svg width="83" height="83" viewBox="0 0 83 83" fill="none" xmlns="http://www.w3.org/2000/svg">
<rect width="82.5" height="82.5" rx="15" fill="#1E1F29"/>
<path d="M55.3044 61.5C55.0538 61.5 54.8149 61.4558 54.5878 61.3674C54.3605 61.279 54.1472 61.1398 53.9476 60.9497L41.7155 49.2962C41.516 49.1061 41.3698 48.9028 41.2771 48.6863C41.1844 48.4699 41.138 48.2423 41.138 48.0036C41.138 47.7649 41.1844 47.533 41.2771 47.3077C41.3698 47.0825 41.516 46.8749 41.7155 46.6847L45.9217 42.6775C46.1213 42.4874 46.3347 42.3437 46.5619 42.2466C46.7891 42.1496 47.0371 42.101 47.3061 42.101C47.5566 42.101 47.7955 42.1496 48.0227 42.2466C48.2499 42.3437 48.4632 42.4874 48.6628 42.6775L60.8949 54.3573C61.0945 54.5474 61.2452 54.7464 61.3471 54.9541C61.449 55.1617 61.5 55.3936 61.5 55.6499C61.5 55.8886 61.4444 56.1205 61.3333 56.3457C61.2222 56.571 61.0761 56.7699 60.8949 56.9425L56.6887 60.9497C56.4891 61.1398 56.2758 61.279 56.0485 61.3674C55.8214 61.4558 55.5733 61.5 55.3044 61.5ZM55.3319 57.4927L57.2662 55.6499L47.2785 46.1082L45.3442 47.951L55.3319 57.4927ZM25.7784 61.4735C25.5279 61.4735 25.2809 61.4338 25.0374 61.3544C24.7939 61.2747 24.5724 61.1398 24.3728 60.9497L20.2155 56.989C20.016 56.8164 19.8744 56.6185 19.7909 56.3953C19.7074 56.1721 19.6656 55.9324 19.6656 55.6762C19.6656 55.4375 19.7074 55.2055 19.7909 54.9803C19.8744 54.7551 20.0159 54.5474 20.2155 54.3573L31.8382 43.3107H36.2376L38.0105 41.6216L29.1332 33.1642H26.184L19.5 26.7963L24.9695 21.5855L31.6535 27.9534V30.7631L40.5308 39.2205L46.9621 33.0934L43.5522 29.8447L46.2869 27.2656H40.7686L39.6411 26.1652L46.6096 19.5L47.7647 20.6267V25.8577L50.4994 23.2523L59.3322 31.6936C59.8573 32.2114 60.2767 32.799 60.5902 33.4565C60.9037 34.1139 61.0605 34.8101 61.0605 35.5451C61.0605 36.2706 60.9179 36.9684 60.6326 37.6387C60.3474 38.3089 59.9727 38.9117 59.5084 39.4471L55.109 35.2558L52.2086 38.019L49.5312 35.4682L38.7579 45.732V49.903L27.1352 60.9497C26.9356 61.1398 26.7268 61.2747 26.5088 61.3544C26.2908 61.4338 26.0474 61.4735 25.7784 61.4735ZM25.7784 57.4927L35.8214 47.951V46.1082H33.8871L23.8442 55.6499L25.7784 57.4927ZM25.7784 57.4927L23.8442 55.6499L24.8357 56.548L25.7784 57.4927Z" fill="white"/>
</svg>
