<svg width="20" height="23" viewBox="0 0 20 23" fill="none" xmlns="http://www.w3.org/2000/svg">
<path d="M9.16667 22.2222V17.2222H3.05556L0 14.1667L3.05556 11.1111H9.16667V8.61111H1V2.5H9.16667V0H10.8333V2.5H16.9444L20 5.55556L16.9444 8.61111H10.8333V11.1111H19V17.2222H10.8333V22.2222H9.16667Z" fill="#1E1F29"/>
</svg>
