<svg width="86" height="57" viewBox="0 0 86 57" fill="none" xmlns="http://www.w3.org/2000/svg">
<g filter="url(#filter0_d_968_144)">
<circle cx="37.125" cy="52.875" r="1.40625" fill="white"/>
</g>
<g filter="url(#filter1_d_968_144)">
<circle cx="42.75" cy="52.875" r="1.40625" fill="white"/>
</g>
<g filter="url(#filter2_d_968_144)">
<circle cx="48.375" cy="52.875" r="1.40625" fill="white"/>
</g>
<g filter="url(#filter3_d_968_144)">
<path d="M12.343 8.50781C12.2834 7.94957 12.032 7.51491 11.5888 7.20384C11.1499 6.89276 10.5788 6.73722 9.87571 6.73722C9.38139 6.73722 8.95739 6.81179 8.60369 6.96094C8.25 7.11008 7.9794 7.3125 7.7919 7.56818C7.6044 7.82386 7.50852 8.11577 7.50426 8.44389C7.50426 8.71662 7.56605 8.95312 7.68963 9.15341C7.81747 9.35369 7.99006 9.52415 8.20739 9.66477C8.42472 9.80114 8.66548 9.91619 8.92969 10.0099C9.19389 10.1037 9.46023 10.1825 9.72869 10.2464L10.956 10.5533C11.4503 10.6683 11.9254 10.8239 12.3814 11.0199C12.8416 11.2159 13.2528 11.4631 13.6151 11.7614C13.9815 12.0597 14.2713 12.4197 14.4844 12.8416C14.6974 13.2635 14.804 13.7578 14.804 14.3246C14.804 15.0916 14.608 15.767 14.2159 16.3509C13.8239 16.9304 13.2571 17.3842 12.5156 17.7124C11.7784 18.0362 10.8857 18.1982 9.83736 18.1982C8.81889 18.1982 7.93466 18.0405 7.18466 17.7251C6.43892 17.4098 5.85511 16.9496 5.43324 16.3445C5.01563 15.7393 4.78977 15.0021 4.75568 14.1328H7.08878C7.12287 14.5888 7.26349 14.968 7.51065 15.2706C7.75781 15.5732 8.07955 15.799 8.47585 15.9482C8.87642 16.0973 9.32386 16.1719 9.81818 16.1719C10.3338 16.1719 10.7855 16.0952 11.1733 15.9418C11.5653 15.7841 11.8722 15.5668 12.0938 15.2898C12.3153 15.0085 12.4283 14.6804 12.4325 14.3054C12.4283 13.9645 12.3281 13.6832 12.1321 13.4616C11.9361 13.2358 11.6612 13.0483 11.3075 12.8991C10.9581 12.7457 10.549 12.6094 10.0803 12.4901L8.59091 12.1065C7.51278 11.8295 6.66051 11.4098 6.03409 10.8473C5.41193 10.2805 5.10085 9.52841 5.10085 8.59091C5.10085 7.8196 5.30966 7.14418 5.72727 6.56463C6.14915 5.98509 6.7223 5.53551 7.44673 5.21591C8.17116 4.89204 8.99148 4.73011 9.90767 4.73011C10.8366 4.73011 11.6506 4.89204 12.3494 5.21591C13.0526 5.53551 13.6044 5.98082 14.005 6.55185C14.4055 7.11861 14.6122 7.7706 14.625 8.50781H12.343ZM19.6412 18.1982C19.019 18.1982 18.4586 18.0874 17.96 17.8658C17.4657 17.6399 17.0737 17.3075 16.7839 16.8686C16.4984 16.4297 16.3556 15.8885 16.3556 15.245C16.3556 14.6911 16.4579 14.233 16.6625 13.8707C16.867 13.5085 17.1461 13.2188 17.4998 13.0014C17.8535 12.7841 18.252 12.62 18.6951 12.5092C19.1426 12.3942 19.6049 12.3111 20.0822 12.2599C20.6575 12.2003 21.1241 12.147 21.4821 12.1001C21.84 12.049 22.1 11.9723 22.2619 11.87C22.4281 11.7635 22.5112 11.5994 22.5112 11.3778V11.3395C22.5112 10.858 22.3684 10.4851 22.0829 10.2209C21.7974 9.95668 21.3862 9.82457 20.8493 9.82457C20.2825 9.82457 19.8329 9.94815 19.5005 10.1953C19.1724 10.4425 18.9508 10.7344 18.8358 11.071L16.6752 10.7642C16.8457 10.1676 17.127 9.66903 17.519 9.26847C17.911 8.86364 18.3904 8.56108 18.9572 8.3608C19.524 8.15625 20.1504 8.05398 20.8365 8.05398C21.3095 8.05398 21.7804 8.10938 22.2491 8.22017C22.7179 8.33097 23.1461 8.5142 23.5339 8.76989C23.9217 9.02131 24.2328 9.36435 24.4672 9.79901C24.7058 10.2337 24.8251 10.777 24.8251 11.429V18H22.6007V16.6513H22.524C22.3833 16.924 22.1852 17.1797 21.9295 17.4183C21.6781 17.6527 21.3606 17.8423 20.9771 17.9872C20.5978 18.1278 20.1525 18.1982 19.6412 18.1982ZM20.242 16.4979C20.7065 16.4979 21.1092 16.4062 21.4501 16.223C21.791 16.0355 22.0531 15.7884 22.2363 15.4815C22.4238 15.1747 22.5176 14.8402 22.5176 14.478V13.321C22.4451 13.3807 22.3216 13.4361 22.1468 13.4872C21.9764 13.5384 21.7846 13.5831 21.5716 13.6214C21.3585 13.6598 21.1475 13.6939 20.9387 13.7237C20.7299 13.7536 20.5488 13.7791 20.3954 13.8004C20.0502 13.8473 19.7413 13.924 19.4686 14.0305C19.1958 14.1371 18.9806 14.2862 18.823 14.478C18.6653 14.6655 18.5865 14.9084 18.5865 15.2067C18.5865 15.6328 18.742 15.9545 19.0531 16.1719C19.3642 16.3892 19.7605 16.4979 20.242 16.4979ZM29.4657 4.90909V18H27.1518V4.90909H29.4657ZM40.6151 8.18182L37.1186 18H34.5618L31.0653 8.18182H33.5327L35.7891 15.4751H35.8913L38.1541 8.18182H40.6151ZM44.7603 18.1982C44.1381 18.1982 43.5778 18.0874 43.0792 17.8658C42.5849 17.6399 42.1928 17.3075 41.9031 16.8686C41.6175 16.4297 41.4748 15.8885 41.4748 15.245C41.4748 14.6911 41.5771 14.233 41.7816 13.8707C41.9862 13.5085 42.2653 13.2188 42.619 13.0014C42.9727 12.7841 43.3711 12.62 43.8143 12.5092C44.2617 12.3942 44.7241 12.3111 45.2013 12.2599C45.7766 12.2003 46.2433 12.147 46.6012 12.1001C46.9592 12.049 47.2191 11.9723 47.381 11.87C47.5472 11.7635 47.6303 11.5994 47.6303 11.3778V11.3395C47.6303 10.858 47.4876 10.4851 47.2021 10.2209C46.9165 9.95668 46.5053 9.82457 45.9684 9.82457C45.4016 9.82457 44.9521 9.94815 44.6197 10.1953C44.2915 10.4425 44.07 10.7344 43.9549 11.071L41.7944 10.7642C41.9648 10.1676 42.2461 9.66903 42.6381 9.26847C43.0302 8.86364 43.5096 8.56108 44.0763 8.3608C44.6431 8.15625 45.2695 8.05398 45.9556 8.05398C46.4286 8.05398 46.8995 8.10938 47.3683 8.22017C47.837 8.33097 48.2653 8.5142 48.6531 8.76989C49.0408 9.02131 49.3519 9.36435 49.5863 9.79901C49.8249 10.2337 49.9442 10.777 49.9442 11.429V18H47.7198V16.6513H47.6431C47.5025 16.924 47.3043 17.1797 47.0487 17.4183C46.7972 17.6527 46.4798 17.8423 46.0962 17.9872C45.717 18.1278 45.2717 18.1982 44.7603 18.1982ZM45.3612 16.4979C45.8256 16.4979 46.2283 16.4062 46.5692 16.223C46.9102 16.0355 47.1722 15.7884 47.3555 15.4815C47.543 15.1747 47.6367 14.8402 47.6367 14.478V13.321C47.5643 13.3807 47.4407 13.4361 47.266 13.4872C47.0955 13.5384 46.9038 13.5831 46.6907 13.6214C46.4776 13.6598 46.2667 13.6939 46.0579 13.7237C45.8491 13.7536 45.668 13.7791 45.5146 13.8004C45.1694 13.8473 44.8604 13.924 44.5877 14.0305C44.315 14.1371 44.0998 14.2862 43.9421 14.478C43.7844 14.6655 43.7056 14.9084 43.7056 15.2067C43.7056 15.6328 43.8612 15.9545 44.1722 16.1719C44.4833 16.3892 44.8796 16.4979 45.3612 16.4979Z" fill="white"/>
</g>
<g filter="url(#filter4_d_968_144)">
<path d="M25.9773 32.5966C25.9773 35.4176 25.4489 37.8338 24.392 39.8452C23.3438 41.848 21.9119 43.3821 20.0966 44.4474C18.2898 45.5128 16.2401 46.0455 13.9474 46.0455C11.6548 46.0455 9.60085 45.5128 7.78551 44.4474C5.97869 43.3736 4.54688 41.8352 3.49006 39.8324C2.44176 37.821 1.91761 35.4091 1.91761 32.5966C1.91761 29.7756 2.44176 27.3636 3.49006 25.3608C4.54688 23.3494 5.97869 21.8111 7.78551 20.7457C9.60085 19.6804 11.6548 19.1477 13.9474 19.1477C16.2401 19.1477 18.2898 19.6804 20.0966 20.7457C21.9119 21.8111 23.3438 23.3494 24.392 25.3608C25.4489 27.3636 25.9773 29.7756 25.9773 32.5966ZM21.2088 32.5966C21.2088 30.6108 20.8977 28.9361 20.2756 27.5724C19.6619 26.2003 18.8097 25.1648 17.7188 24.4659C16.6278 23.7585 15.3707 23.4048 13.9474 23.4048C12.5241 23.4048 11.267 23.7585 10.1761 24.4659C9.08523 25.1648 8.22869 26.2003 7.60653 27.5724C6.9929 28.9361 6.68608 30.6108 6.68608 32.5966C6.68608 34.5824 6.9929 36.2614 7.60653 37.6335C8.22869 38.9972 9.08523 40.0327 10.1761 40.7401C11.267 41.4389 12.5241 41.7884 13.9474 41.7884C15.3707 41.7884 16.6278 41.4389 17.7188 40.7401C18.8097 40.0327 19.6619 38.9972 20.2756 37.6335C20.8977 36.2614 21.2088 34.5824 21.2088 32.5966ZM30.4613 45.6875V19.5057H35.0891V29.2983H35.2809C35.5195 28.821 35.8562 28.3139 36.2908 27.777C36.7255 27.2315 37.3136 26.767 38.055 26.3835C38.7965 25.9915 39.7425 25.7955 40.8931 25.7955C42.4102 25.7955 43.7781 26.1832 44.9968 26.9588C46.2241 27.7259 47.1957 28.8636 47.9116 30.3722C48.636 31.8722 48.9982 33.7131 48.9982 35.8949C48.9982 38.0511 48.6445 39.8835 47.9371 41.392C47.2298 42.9006 46.2667 44.0511 45.0479 44.8438C43.8292 45.6364 42.4485 46.0327 40.9059 46.0327C39.7809 46.0327 38.8477 45.8452 38.1062 45.4702C37.3647 45.0952 36.7681 44.6435 36.3164 44.1151C35.8732 43.5781 35.5281 43.071 35.2809 42.5938H35.0124V45.6875H30.4613ZM34.9996 35.8693C34.9996 37.1392 35.1786 38.2514 35.5366 39.206C35.9031 40.1605 36.4272 40.9062 37.109 41.4432C37.7994 41.9716 38.6346 42.2358 39.6147 42.2358C40.6374 42.2358 41.494 41.9631 42.1843 41.4176C42.8746 40.8636 43.3945 40.1094 43.744 39.1548C44.1019 38.1918 44.2809 37.0966 44.2809 35.8693C44.2809 34.6506 44.1062 33.5682 43.7567 32.6222C43.4073 31.6761 42.8874 30.9347 42.1971 30.3977C41.5067 29.8608 40.646 29.5923 39.6147 29.5923C38.6261 29.5923 37.7866 29.8523 37.0962 30.3722C36.4059 30.892 35.8817 31.6207 35.5238 32.5582C35.1744 33.4957 34.9996 34.5994 34.9996 35.8693ZM52.9325 45.6875V26.0511H57.4197V29.3239H57.6243C57.9822 28.1903 58.5959 27.3168 59.4652 26.7031C60.343 26.081 61.3445 25.7699 62.4695 25.7699C62.7251 25.7699 63.0107 25.7827 63.326 25.8082C63.6499 25.8253 63.9183 25.8551 64.1314 25.8977V30.1548C63.9354 30.0866 63.6243 30.027 63.1982 29.9759C62.7805 29.9162 62.3757 29.8864 61.9837 29.8864C61.1399 29.8864 60.3814 30.0696 59.7081 30.4361C59.0433 30.794 58.5192 31.2926 58.1357 31.9318C57.7521 32.571 57.5604 33.3082 57.5604 34.1435V45.6875H52.9325ZM72.505 46.0838C71.2607 46.0838 70.1399 45.8622 69.1428 45.419C68.1541 44.9673 67.37 44.3026 66.7905 43.4247C66.2195 42.5469 65.9339 41.4645 65.9339 40.1776C65.9339 39.0696 66.1385 38.1534 66.5476 37.429C66.9567 36.7045 67.5149 36.125 68.2223 35.6903C68.9297 35.2557 69.7266 34.9276 70.6129 34.706C71.5078 34.4759 72.4325 34.3097 73.3871 34.2074C74.5376 34.0881 75.4709 33.9815 76.1868 33.8878C76.9027 33.7855 77.4226 33.6321 77.7464 33.4276C78.0788 33.2145 78.245 32.8864 78.245 32.4432V32.3665C78.245 31.4034 77.9595 30.6577 77.3885 30.1293C76.8175 29.6009 75.995 29.3366 74.9212 29.3366C73.7876 29.3366 72.8885 29.5838 72.2237 30.0781C71.5675 30.5724 71.1243 31.1562 70.8942 31.8295L66.5732 31.2159C66.9141 30.0227 67.4766 29.0256 68.2607 28.2244C69.0447 27.4148 70.0036 26.8097 71.1371 26.4091C72.2706 26 73.5234 25.7955 74.8956 25.7955C75.8416 25.7955 76.7834 25.9062 77.7209 26.1278C78.6584 26.3494 79.5149 26.7159 80.2905 27.2273C81.0661 27.7301 81.6882 28.4162 82.157 29.2855C82.6342 30.1548 82.8729 31.2415 82.8729 32.5455V45.6875H78.424V42.9901H78.2706C77.9893 43.5355 77.593 44.0469 77.0817 44.5241C76.5788 44.9929 75.9439 45.3722 75.1768 45.6619C74.4183 45.9432 73.5277 46.0838 72.505 46.0838ZM73.7067 42.6832C74.6357 42.6832 75.4411 42.5 76.1229 42.1335C76.8047 41.7585 77.3288 41.2642 77.6953 40.6506C78.0703 40.0369 78.2578 39.3679 78.2578 38.6435V36.3295C78.1129 36.4489 77.8658 36.5597 77.5163 36.6619C77.1754 36.7642 76.7919 36.8537 76.3658 36.9304C75.9396 37.0071 75.5178 37.0753 75.1001 37.1349C74.6825 37.1946 74.3203 37.2457 74.0135 37.2884C73.3232 37.3821 72.7053 37.5355 72.1598 37.7486C71.6143 37.9616 71.1839 38.2599 70.8686 38.6435C70.5533 39.0185 70.3956 39.5043 70.3956 40.1009C70.3956 40.9531 70.7067 41.5966 71.3288 42.0312C71.951 42.4659 72.7436 42.6832 73.7067 42.6832Z" fill="white"/>
</g>
<defs>
<filter id="filter0_d_968_144" x="34.5938" y="51.4688" width="5.0625" height="5.0625" filterUnits="userSpaceOnUse" color-interpolation-filters="sRGB">
<feFlood flood-opacity="0" result="BackgroundImageFix"/>
<feColorMatrix in="SourceAlpha" type="matrix" values="0 0 0 0 0 0 0 0 0 0 0 0 0 0 0 0 0 0 127 0" result="hardAlpha"/>
<feOffset dy="1.125"/>
<feGaussianBlur stdDeviation="0.5625"/>
<feComposite in2="hardAlpha" operator="out"/>
<feColorMatrix type="matrix" values="0 0 0 0 0 0 0 0 0 0 0 0 0 0 0 0 0 0 0.25 0"/>
<feBlend mode="normal" in2="BackgroundImageFix" result="effect1_dropShadow_968_144"/>
<feBlend mode="normal" in="SourceGraphic" in2="effect1_dropShadow_968_144" result="shape"/>
</filter>
<filter id="filter1_d_968_144" x="40.2188" y="51.4688" width="5.0625" height="5.0625" filterUnits="userSpaceOnUse" color-interpolation-filters="sRGB">
<feFlood flood-opacity="0" result="BackgroundImageFix"/>
<feColorMatrix in="SourceAlpha" type="matrix" values="0 0 0 0 0 0 0 0 0 0 0 0 0 0 0 0 0 0 127 0" result="hardAlpha"/>
<feOffset dy="1.125"/>
<feGaussianBlur stdDeviation="0.5625"/>
<feComposite in2="hardAlpha" operator="out"/>
<feColorMatrix type="matrix" values="0 0 0 0 0 0 0 0 0 0 0 0 0 0 0 0 0 0 0.25 0"/>
<feBlend mode="normal" in2="BackgroundImageFix" result="effect1_dropShadow_968_144"/>
<feBlend mode="normal" in="SourceGraphic" in2="effect1_dropShadow_968_144" result="shape"/>
</filter>
<filter id="filter2_d_968_144" x="45.8438" y="51.4688" width="5.0625" height="5.0625" filterUnits="userSpaceOnUse" color-interpolation-filters="sRGB">
<feFlood flood-opacity="0" result="BackgroundImageFix"/>
<feColorMatrix in="SourceAlpha" type="matrix" values="0 0 0 0 0 0 0 0 0 0 0 0 0 0 0 0 0 0 127 0" result="hardAlpha"/>
<feOffset dy="1.125"/>
<feGaussianBlur stdDeviation="0.5625"/>
<feComposite in2="hardAlpha" operator="out"/>
<feColorMatrix type="matrix" values="0 0 0 0 0 0 0 0 0 0 0 0 0 0 0 0 0 0 0.25 0"/>
<feBlend mode="normal" in2="BackgroundImageFix" result="effect1_dropShadow_968_144"/>
<feBlend mode="normal" in="SourceGraphic" in2="effect1_dropShadow_968_144" result="shape"/>
</filter>
<filter id="filter3_d_968_144" x="3.63086" y="4.7301" width="47.4385" height="15.718" filterUnits="userSpaceOnUse" color-interpolation-filters="sRGB">
<feFlood flood-opacity="0" result="BackgroundImageFix"/>
<feColorMatrix in="SourceAlpha" type="matrix" values="0 0 0 0 0 0 0 0 0 0 0 0 0 0 0 0 0 0 127 0" result="hardAlpha"/>
<feOffset dy="1.125"/>
<feGaussianBlur stdDeviation="0.5625"/>
<feComposite in2="hardAlpha" operator="out"/>
<feColorMatrix type="matrix" values="0 0 0 0 0 0 0 0 0 0 0 0 0 0 0 0 0 0 0.25 0"/>
<feBlend mode="normal" in2="BackgroundImageFix" result="effect1_dropShadow_968_144"/>
<feBlend mode="normal" in="SourceGraphic" in2="effect1_dropShadow_968_144" result="shape"/>
</filter>
<filter id="filter4_d_968_144" x="0.79248" y="19.1477" width="83.2056" height="29.1862" filterUnits="userSpaceOnUse" color-interpolation-filters="sRGB">
<feFlood flood-opacity="0" result="BackgroundImageFix"/>
<feColorMatrix in="SourceAlpha" type="matrix" values="0 0 0 0 0 0 0 0 0 0 0 0 0 0 0 0 0 0 127 0" result="hardAlpha"/>
<feOffset dy="1.125"/>
<feGaussianBlur stdDeviation="0.5625"/>
<feComposite in2="hardAlpha" operator="out"/>
<feColorMatrix type="matrix" values="0 0 0 0 0 0 0 0 0 0 0 0 0 0 0 0 0 0 0.25 0"/>
<feBlend mode="normal" in2="BackgroundImageFix" result="effect1_dropShadow_968_144"/>
<feBlend mode="normal" in="SourceGraphic" in2="effect1_dropShadow_968_144" result="shape"/>
</filter>
</defs>
</svg>
