<svg width="45" height="60" viewBox="0 0 45 60" fill="none" xmlns="http://www.w3.org/2000/svg">
<path d="M19.0312 0.703125C18.8555 0.28125 18.4453 0 17.9883 0H15.7617C15.3047 0 14.8828 0.28125 14.7188 0.703125L12.293 6.76172C11.918 7.69922 10.582 7.69922 10.207 6.76172L7.78125 0.703125C7.60547 0.28125 7.19531 0 6.73828 0H5.625C2.51953 0 0 2.51953 0 5.625V26.25V28.875V30H1.125H43.875H45V28.875V26.25V5.625C45 2.51953 42.4805 0 39.375 0H27.0117C26.5547 0 26.1328 0.28125 25.9688 0.703125L23.543 6.76172C23.168 7.69922 21.832 7.69922 21.457 6.76172L19.0312 0.703125ZM0 33.75V37.5C0 41.6367 3.36328 45 7.5 45H15V52.5C15 56.6367 18.3633 60 22.5 60C26.6367 60 30 56.6367 30 52.5V45H37.5C41.6367 45 45 41.6367 45 37.5V33.75H0ZM22.5 50.625C22.9973 50.625 23.4742 50.8225 23.8258 51.1742C24.1775 51.5258 24.375 52.0027 24.375 52.5C24.375 52.9973 24.1775 53.4742 23.8258 53.8258C23.4742 54.1775 22.9973 54.375 22.5 54.375C22.0027 54.375 21.5258 54.1775 21.1742 53.8258C20.8225 53.4742 20.625 52.9973 20.625 52.5C20.625 52.0027 20.8225 51.5258 21.1742 51.1742C21.5258 50.8225 22.0027 50.625 22.5 50.625Z" fill="white"/>
</svg>
