<svg width="88" height="49" viewBox="0 0 88 57" fill="none" xmlns="http://www.w3.org/2000/svg">
<mask id="mask0_313_216" style="mask-type:alpha" maskUnits="userSpaceOnUse" x="40" y="0" width="48" height="48">
<rect x="40" width="48" height="48" fill="#D9D9D9"/>
</mask>
<g mask="url(#mask0_313_216)">
<path d="M64 44C61.2667 44 58.6833 43.475 56.25 42.425C53.8167 41.375 51.6917 39.9417 49.875 38.125C48.0583 36.3083 46.625 34.1833 45.575 31.75C44.525 29.3167 44 26.7333 44 24C44 21.2333 44.525 18.6333 45.575 16.2C46.625 13.7667 48.0583 11.65 49.875 9.85C51.6917 8.05 53.8167 6.625 56.25 5.575C58.6833 4.525 61.2667 4 64 4C66.7667 4 69.3667 4.525 71.8 5.575C74.2333 6.625 76.35 8.05 78.15 9.85C79.95 11.65 81.375 13.7667 82.425 16.2C83.475 18.6333 84 21.2333 84 24C84 26.7333 83.475 29.3167 82.425 31.75C81.375 34.1833 79.95 36.3083 78.15 38.125C76.35 39.9417 74.2333 41.375 71.8 42.425C69.3667 43.475 66.7667 44 64 44ZM64 8C60.3 8 57.0333 9.10833 54.2 11.325C51.3667 13.5417 49.4833 16.3667 48.55 19.8C49.2167 19.6333 49.9083 19.3083 50.625 18.825C51.3417 18.3417 52.1667 17.1667 53.1 15.3C53.6 14.2667 54.3333 13.4583 55.3 12.875C56.2667 12.2917 57.3333 12 58.5 12H69.5C70.6667 12 71.7333 12.2917 72.7 12.875C73.6667 13.4583 74.4 14.2667 74.9 15.3C75.8333 17.2 76.675 18.3833 77.425 18.85C78.175 19.3167 78.85 19.6333 79.45 19.8C78.5167 16.3667 76.6417 13.5417 73.825 11.325C71.0083 9.10833 67.7333 8 64 8ZM64 40C68.4667 40 72.2583 38.4333 75.375 35.3C78.4917 32.1667 80.0333 28.3667 80 23.9C77.6333 23.6667 75.8167 22.925 74.55 21.675C73.2833 20.425 72.2 18.9 71.3 17.1C71.1333 16.7333 70.8917 16.4583 70.575 16.275C70.2583 16.0917 69.9167 16 69.55 16H58.5C58.1 16 57.7417 16.0917 57.425 16.275C57.1083 16.4583 56.8667 16.7333 56.7 17.1C55.8 18.9333 54.7 20.475 53.4 21.725C52.1 22.975 50.3 23.7167 48 23.95C48 28.4167 49.5583 32.2083 52.675 35.325C55.7917 38.4417 59.5667 40 64 40ZM58 28.5C57.3 28.5 56.7083 28.2583 56.225 27.775C55.7417 27.2917 55.5 26.7 55.5 26C55.5 25.3 55.7417 24.7083 56.225 24.225C56.7083 23.7417 57.3 23.5 58 23.5C58.7 23.5 59.2917 23.7417 59.775 24.225C60.2583 24.7083 60.5 25.3 60.5 26C60.5 26.7 60.2583 27.2917 59.775 27.775C59.2917 28.2583 58.7 28.5 58 28.5ZM70 28.5C69.3 28.5 68.7083 28.2583 68.225 27.775C67.7417 27.2917 67.5 26.7 67.5 26C67.5 25.3 67.7417 24.7083 68.225 24.225C68.7083 23.7417 69.3 23.5 70 23.5C70.7 23.5 71.2917 23.7417 71.775 24.225C72.2583 24.7083 72.5 25.3 72.5 26C72.5 26.7 72.2583 27.2917 71.775 27.775C71.2917 28.2583 70.7 28.5 70 28.5Z" fill="#401B00"/>
</g>
<mask id="mask1_313_216" style="mask-type:alpha" maskUnits="userSpaceOnUse" x="0" y="9" width="48" height="48">
<rect y="9" width="48" height="48" fill="#D9D9D9"/>
</mask>
<g mask="url(#mask1_313_216)">
<path d="M18 41.5C17.3 41.5 16.7083 41.2583 16.225 40.775C15.7417 40.2917 15.5 39.7 15.5 39C15.5 38.3 15.7417 37.7083 16.225 37.225C16.7083 36.7417 17.3 36.5 18 36.5C18.7 36.5 19.2917 36.7417 19.775 37.225C20.2583 37.7083 20.5 38.3 20.5 39C20.5 39.7 20.2583 40.2917 19.775 40.775C19.2917 41.2583 18.7 41.5 18 41.5ZM30 41.5C29.3 41.5 28.7083 41.2583 28.225 40.775C27.7417 40.2917 27.5 39.7 27.5 39C27.5 38.3 27.7417 37.7083 28.225 37.225C28.7083 36.7417 29.3 36.5 30 36.5C30.7 36.5 31.2917 36.7417 31.775 37.225C32.2583 37.7083 32.5 38.3 32.5 39C32.5 39.7 32.2583 40.2917 31.775 40.775C31.2917 41.2583 30.7 41.5 30 41.5ZM24 53C28.4667 53 32.25 51.45 35.35 48.35C38.45 45.25 40 41.4667 40 37C40 36.2 39.95 35.425 39.85 34.675C39.75 33.925 39.5667 33.2 39.3 32.5C38.6 32.6667 37.9 32.7917 37.2 32.875C36.5 32.9583 35.7667 33 35 33C31.9667 33 29.1 32.35 26.4 31.05C23.7 29.75 21.4 27.9333 19.5 25.6C18.4333 28.2 16.9083 30.4583 14.925 32.375C12.9417 34.2917 10.6333 35.7333 8 36.7V37C8 41.4667 9.55 45.25 12.65 48.35C15.75 51.45 19.5333 53 24 53ZM21.3 21.25C22.7 23.5833 24.6 25.4583 27 26.875C29.4 28.2917 32.0667 29 35 29C35.4667 29 35.9167 28.975 36.35 28.925C36.7833 28.875 37.2333 28.8167 37.7 28.75C36.3 26.4167 34.4 24.5417 32 23.125C29.6 21.7083 26.9333 21 24 21C23.5333 21 23.0833 21.025 22.65 21.075C22.2167 21.125 21.7667 21.1833 21.3 21.25ZM8.85 31.95C10.55 30.9833 12.0333 29.7333 13.3 28.2C14.5667 26.6667 15.5167 24.95 16.15 23.05C14.45 24.0167 12.9667 25.2667 11.7 26.8C10.4333 28.3333 9.48333 30.05 8.85 31.95ZM6.35 27.65C7.28333 25.8833 8.45833 24.2917 9.875 22.875C11.2917 21.4583 12.8833 20.2833 14.65 19.35C14.0833 18.65 13.4 18.0833 12.6 17.65C11.8 17.2167 10.9167 17 9.95 17C8.28333 17 6.875 17.575 5.725 18.725C4.575 19.875 4 21.2833 4 22.95C4 23.9167 4.21667 24.8 4.65 25.6C5.08333 26.4 5.65 27.0833 6.35 27.65ZM24 57C21.2333 57 18.6333 56.475 16.2 55.425C13.7667 54.375 11.65 52.95 9.85 51.15C8.05 49.35 6.625 47.2333 5.575 44.8C4.525 42.3667 4 39.7667 4 37C4 36.0333 4.06667 35.075 4.2 34.125C4.33333 33.175 4.53333 32.2667 4.8 31.4C3.36667 30.5333 2.20833 29.3583 1.325 27.875C0.441667 26.3917 0 24.75 0 22.95C0 20.1833 0.966667 17.8333 2.9 15.9C4.83333 13.9667 7.18333 13 9.95 13C11.7167 13 13.3417 13.425 14.825 14.275C16.3083 15.125 17.5 16.3 18.4 17.8C19.2667 17.5333 20.175 17.3333 21.125 17.2C22.075 17.0667 23.0333 17 24 17C26.7667 17 29.3667 17.525 31.8 18.575C34.2333 19.625 36.35 21.05 38.15 22.85C39.95 24.65 41.375 26.7667 42.425 29.2C43.475 31.6333 44 34.2333 44 37C44 39.7667 43.475 42.3667 42.425 44.8C41.375 47.2333 39.95 49.35 38.15 51.15C36.35 52.95 34.2333 54.375 31.8 55.425C29.3667 56.475 26.7667 57 24 57Z" fill="#401B00"/>
</g>
</svg>
