<svg width="400" height="150" viewBox="0 0 831 227" fill="none" xmlns="http://www.w3.org/2000/svg">
<path d="M0.842761 34.2391C0.842761 54.4493 12.4706 68.1074 28.5281 68.1074C44.5855 68.1074 56.2134 54.4493 56.2134 34.2391C56.2134 14.0288 44.5855 0.370717 28.5281 0.370717C12.4706 0.370717 0.842761 14.0288 0.842761 34.2391ZM19.0228 34.2391C19.0228 21.873 23.0833 13.7519 28.5281 13.7519C33.9728 13.7519 38.0333 21.873 38.0333 34.2391C38.0333 46.5129 33.9728 54.7262 28.5281 54.7262C23.0833 54.7262 19.0228 46.5129 19.0228 34.2391ZM78.9052 67H105.483V53.6188H100.592V28.1483L111.943 50.4811L123.479 27.9637V53.6188H118.495V67H145.165V53.6188H140.182V14.8594H145.165V1.47813H123.479L112.035 23.8109L100.592 1.47813H78.9052V14.8594H83.7963V53.6188H78.9052V67ZM149.38 67H198.014V44.944L182.879 46.5129V53.6188H171.713V40.6067H189.432V27.2255H171.713V14.8594H182.695V22.8881L197.922 21.227V1.47813H149.38V14.8594H154.271V53.6188H149.38V67ZM201.741 67H248.16V40.7913L233.025 42.3601V53.6188H224.073V14.8594H230.903V1.47813H201.741V14.8594H206.632V53.6188H201.741V67ZM251.668 67H278.246V53.6188H274.001V40.1453H288.028V53.6188H283.783V67H310.361V53.6188H305.47V14.8594H310.361V1.47813H283.783V14.8594H288.028V26.764H274.001V14.8594H278.246V1.47813H251.668V14.8594H256.559V53.6188H251.668V67ZM311.041 34.2391C311.041 54.4493 322.668 68.1074 338.726 68.1074C354.783 68.1074 366.411 54.4493 366.411 34.2391C366.411 14.0288 354.783 0.370717 338.726 0.370717C322.668 0.370717 311.041 14.0288 311.041 34.2391ZM329.221 34.2391C329.221 21.873 333.281 13.7519 338.726 13.7519C344.171 13.7519 348.231 21.873 348.231 34.2391C348.231 46.5129 344.171 54.7262 338.726 54.7262C333.281 54.7262 329.221 46.5129 329.221 34.2391ZM403.843 67H420.915V53.6188H416.578L409.657 40.1453C414.824 36.4539 417.87 30.4554 417.87 22.7958C417.87 10.7988 408.549 1.47813 395.537 1.47813H367.113V14.8594H372.005V53.6188H367.113V67H393.414V53.6188H389.446V44.2058H393.507L403.843 67ZM389.446 31.4705V14.8594H392.399C397.106 14.8594 399.505 17.6279 399.505 23.1649C399.505 28.6097 396.921 31.4705 392.215 31.4705H389.446ZM462.084 34.2391C462.084 57.8639 475.742 68.1074 490.877 68.1074C497.429 68.1074 504.258 66.1694 510.349 63.0318L507.765 50.2965C502.32 52.6036 497.798 53.9879 493.184 53.9879C486.17 53.9879 480.264 49.0968 480.264 34.2391C480.264 20.8578 485.247 13.4751 491.431 13.4751C492.261 13.4751 493.461 13.6597 494.291 13.9365V29.2557L509.518 27.6869V5.16951C504.35 2.03184 497.521 0.370717 491.431 0.370717C474.542 0.370717 462.084 13.5674 462.084 34.2391ZM512.361 14.8594H516.606V43.3752C516.606 61.8321 527.496 68.1074 540.692 68.1074C553.889 68.1074 564.779 61.8321 564.779 43.3752V14.8594H569.024V1.47813H543.461V14.8594H547.337V44.0212C547.337 52.0499 544.291 54.7262 540.692 54.7262C537.093 54.7262 534.048 52.0499 534.048 44.0212V14.8594H538.016V1.47813H512.361V14.8594ZM570.878 67H598.194V53.6188H593.211V14.8594H598.194V1.47813H570.878V14.8594H575.769V53.6188H570.878V67ZM602.33 67H629.277C646.534 67 657.793 53.8033 657.793 34.2391C657.793 14.6748 646.534 1.47813 629.277 1.47813H602.33V14.8594H607.221V53.6188H602.33V67ZM624.663 53.6188V14.8594H628.816C634.814 14.8594 639.613 20.2118 639.613 34.2391C639.613 48.2663 634.814 53.6188 628.816 53.6188H624.663ZM655.909 67H681.011V53.6188H676.673L678.427 46.6974H691.992L693.746 53.6188H689.316V67H715.248V53.6188H711.28L697.345 1.47813H664.861V14.8594H670.49L659.785 53.6188H655.909V67ZM680.457 33.9622L682.026 28.4252L685.163 11.168L688.393 28.4252L689.87 33.9622H680.457ZM717.055 67H744.002C761.259 67 772.518 53.8033 772.518 34.2391C772.518 14.6748 761.259 1.47813 744.002 1.47813H717.055V14.8594H721.946V53.6188H717.055V67ZM739.388 53.6188V14.8594H743.54C749.539 14.8594 754.338 20.2118 754.338 34.2391C754.338 48.2663 749.539 53.6188 743.54 53.6188H739.388ZM775.256 34.2391C775.256 54.4493 786.884 68.1074 802.941 68.1074C818.999 68.1074 830.627 54.4493 830.627 34.2391C830.627 14.0288 818.999 0.370717 802.941 0.370717C786.884 0.370717 775.256 14.0288 775.256 34.2391ZM793.436 34.2391C793.436 21.873 797.496 13.7519 802.941 13.7519C808.386 13.7519 812.447 21.873 812.447 34.2391C812.447 46.5129 808.386 54.7262 802.941 54.7262C797.496 54.7262 793.436 46.5129 793.436 34.2391Z" fill="#30865C"/>
<path d="M476.613 97.84L464.013 119.32H482.733L503.493 98.92L476.613 97.84ZM447.573 211H510.813V182.32L491.133 184.36V193.6H476.613V176.68H499.653V159.28H476.613V143.2H490.893V153.64L510.693 151.48V125.8H447.573V143.2H453.933V193.6H447.573V211ZM539.157 211H571.797V193.6H566.157L568.437 184.6H586.077L588.357 193.6H582.597V211H616.317V193.6H611.157L593.037 125.8H550.797V143.2H558.117L544.197 193.6H539.157V211ZM571.077 168.04L573.117 160.84L577.197 138.4L581.397 160.84L583.317 168.04H571.077ZM613.839 168.4C613.839 194.68 628.959 212.44 649.839 212.44C652.599 212.44 655.479 212.08 657.999 211.48L669.999 226.24L685.959 209.92L676.239 199.6C682.239 191.92 685.839 181.24 685.839 168.4C685.839 142.12 670.719 124.36 649.839 124.36C628.959 124.36 613.839 142.12 613.839 168.4ZM637.479 168.4C637.479 152.32 642.759 141.76 649.839 141.76C656.919 141.76 662.199 152.32 662.199 168.4C662.199 184.36 656.919 195.04 649.839 195.04C642.759 195.04 637.479 184.36 637.479 168.4ZM685.192 143.2H690.712V180.28C690.712 204.28 704.872 212.44 722.032 212.44C739.192 212.44 753.352 204.28 753.352 180.28V143.2H758.872V125.8H725.632V143.2H730.672V181.12C730.672 191.56 726.712 195.04 722.032 195.04C717.352 195.04 713.392 191.56 713.392 181.12V143.2H718.552V125.8H685.192V143.2ZM761.283 211H796.803V193.6H790.323V143.2H796.803V125.8H761.283V143.2H767.643V193.6H761.283V211ZM806.064 180.4H823.464L828.384 125.8H801.264L806.064 180.4ZM803.184 200.32C803.184 207.04 808.224 212.32 814.824 212.32C821.304 212.32 826.464 207.04 826.464 200.32C826.464 193.6 821.304 188.44 814.824 188.44C808.224 188.44 803.184 193.6 803.184 200.32Z" fill="#F58634"/>
</svg>
