<svg width="22" height="21" viewBox="0 0 22 21" fill="none" xmlns="http://www.w3.org/2000/svg">
<path d="M3 20.5V11.125L1.2 12.5L0 10.9L3 8.6V5.5H5V7.075L11 2.5L22 10.9L20.8 12.475L19 11.125V20.5H3ZM5 18.5H10V14.5H12V18.5H17V9.6L11 5.025L5 9.6V18.5ZM3 4.5C3 3.66667 3.29167 2.95833 3.875 2.375C4.45833 1.79167 5.16667 1.5 6 1.5C6.28333 1.5 6.52083 1.40417 6.7125 1.2125C6.90417 1.02083 7 0.783333 7 0.5H9C9 1.33333 8.70833 2.04167 8.125 2.625C7.54167 3.20833 6.83333 3.5 6 3.5C5.71667 3.5 5.47917 3.59583 5.2875 3.7875C5.09583 3.97917 5 4.21667 5 4.5H3Z" fill="#401B00"/>
</svg>
