
A00001,ออโต: คุณได้รับ 10G,Auto: You recieve 10G.,0,0,1,1,1,0,0,1,0,0,0,0,0,0,0,0,0,0,0,0,0,0,0,Case,AtBeginOfPhase,Player,CardController(),-,-,"GetGold(OWNER, 10)",Neutral
A00002,ออโต: คุณได้รับ 20G,Auto: You recieve 20G.,0,0,1,1,1,0,0,1,0,0,0,0,0,0,0,0,0,0,0,0,0,0,0,Case,AtBeginOfPhase,Player,CardController(),-,-,"GetGold(OWNER, 20)",Neutral
A00003,ออโต: คุณได้รับ 30G,Auto: You recieve 30G.,0,0,1,1,1,0,0,1,0,0,0,0,0,0,0,0,0,0,0,0,0,0,0,Case,AtBeginOfPhase,Player,CardController(),-,-,"GetGold(OWNER, 30)",Neutral
A00004,ออโต: คุณได้รับ 40G,Auto: You recieve 40G.,0,0,1,1,1,0,0,1,0,0,0,0,0,0,0,0,0,0,0,0,0,0,0,Case,AtBeginOfPhase,Player,CardController(),-,-,"GetGold(OWNER, 40)",Neutral
A00005,ออโต: คุณได้รับ 50G,Auto: You recieve 50G.,0,0,1,1,1,0,0,1,0,0,0,0,0,0,0,0,0,0,0,0,0,0,0,Case,AtBeginOfPhase,Player,CardController(),-,-,"GetGold(OWNER, 50)",Neutral
A00006,แอร์ยูนิต,Air unit,0,0,1,1,1,0,0,1,1,1,1,1,1,1,1,1,1,1,1,1,1,1,1,Always,AtRemain,BattleCard,-,-,-,AirUnit(),Neutral
A00007,น็อคแบ๊ค,Knockback,0,0,1,1,1,0,0,1,1,1,1,1,1,1,1,1,1,1,1,1,1,1,1,Always,AtRemain,BattleCard,-,-,-,Knockback(),Neutral
A00008,เพียสซิง,Piercing,0,0,1,1,1,0,0,1,1,1,1,1,1,1,1,1,1,1,1,1,1,1,1,Always,AtRemain,BattleCard,-,-,-,Piercing(),Neutral
A00009,"แอร์ยูนิตที่คุณควบคุมสามารถ
เคลื่อนที่เพิ่มได้ อีก 1 ครั้ง","Air units you control get an 
additional move.",0,0,1,1,1,0,0,0,0,0,1,0,1,0,0,0,0,0,0,0,0,0,0,Always,AtRemain,BattleCard,CardController(),-,-,"GetMoveForAIrUnit(1,1)",Neutral
A00010,ทิ้งการ์ดในมือ 1 ใบ: การ์ดใบนี้ได้รับ +2 AT จนจบเทิร์น,Discard a card: This card gets +2 AT until end of turn.,0,0,1,1,1,0,0,0,0,0,1,1,1,0,0,0,0,0,0,0,0,0,0,Use,AtUse,BattleCard,CardMe(),Discard(1),-,"GetAT(2, 1)",Good
A00011,เอนเทอร์: ถ้าคุณมีการ์ดในมือ 2 ใบหรือ น้อยกว่า คุณได้รับ 30G,"Enter: If you have two or less cards in your hand, you recieve 30G.",0,0,1,1,1,0,0,0,0,0,1,1,1,0,0,0,0,0,0,0,0,0,0,Case,AtEnter,Player,-,-,"Enter(),HaveCardLessEqual(2, AtZone(HAND))","GetGold(30, OWNER)",Neutral
A00012,"สร้างความเสียหาย 4 หน่วย ให้ยูนิต
หรือสตรัคเจอร์เป้าหมาย","Deals 4 damage to target unit or 
structure.",0,0,1,1,1,1,0,0,0,0,1,1,1,0,0,0,0,0,0,0,0,0,0,Use,AtUse,BattleCard,"CardType(UNIT),
CardType(STRUCTURE)",-,-,DealDamage(4),Bad
A00013,40G: ค้นสำรับคุณเพื่อหาการ์ดเวพอน ยูนิต แสดงการ์ดใบนั้น นำขึ้นมือแล้ว สับสำรับ,"40G: Search your deck for a Weapon unit card, reveal that card, and put it into your hand. Then shuffle your deck.",0,0,1,1,1,0,0,0,0,0,1,1,1,0,0,0,0,0,0,0,0,0,0,Use,AtUse,UniqueCard,-,PayGold(40),-,"Search(DECK, 1, CardType(UNIT) & CardSubType(WEAPON), 1, HAND)
, ShuffleDeck(OWNER)",Good
A00014,"นำการ์ด 5 ใบบนสำรับคุณลงเกรฟยาร์ด 
คุณได้รับ 50G","Put the top five cards of your deck 
into your graveyard. You receive 50G.",0,0,0,0,0,1,0,0,0,0,1,1,1,0,0,0,0,0,0,0,0,0,0,Use,AtUse,Player,CardController(),-,PutTopDeckCardToGraveyard(5),"GetGold(50, OWNER)",Neutral
A00015,Act: ยูนิตเป้าหมายสามารถเคลื่อนที่ เพิ่มได้อีก 1 ครั้งจนจบเทิร์น,Act: Target unit gets an additional move until end of turn.,0,0,1,1,1,0,0,0,0,0,1,1,1,0,0,0,0,0,0,0,0,0,0,Use,AtUse,BattleCard,CardType(UNIT),CardAct(),-,"GetMove(1, 1)",Good
A00016,"สร้างความเสียหาย 2 หน่วย ให้ยูนิตหรือ
สตรัคเจอร์เป้าหมาย","Deals 2 damage to target unit or 
structure.",0,0,0,0,0,1,0,0,0,0,1,1,1,0,0,0,0,0,0,0,0,0,0,Use,AtUse,BattleCard,"CardType(UNIT),
CardType(STRUCTURE)",-,-,DealDamage(2),Bad
A00017,"นำยูนิตในเกรฟยาร์ดของคุณออกจาก
เกม: คุณได้รับ 10G ถ้าหากคุณควบ
คุมยูนิตยูนีคที่เป็นมิวแตนท์แคลน คุณ
ได้รับ 20G แทน","Remove a unit in your graveyard from the game: You receive 10G. If you control a unique mutant clan unit, you receive 20G instead.",0,0,1,1,1,0,0,0,0,0,1,1,1,0,0,0,0,0,0,0,0,0,0,Use,AtUse,Player,-,"RemoveCard(CardType(UNIT), Zone(Graveyard))",-,"GetGoldIfControl(CardUnique() & CardClan(MUTANT), 20, 10, OWNER)",Good
A00018,"รูอิน: การ์ดใบนี้สร้างความเสียหาย 1 หน่วย
ให้ยูนิตหรือสตรัคเจอร์ทั้งหมด (ระยะ 0)","Ruin: This card deals 1 damage to each 
unit and each structure. (Range 0)",0,0,1,1,1,0,0,1,1,1,1,1,1,1,1,1,1,1,1,1,1,1,1,Case,AtRuin,BattleCard,"AllCardType(UNIT,0),
AllCardType(STRUCTURE,0)",-,Ruin(),DealDamage(1),Bad
A00019,"นำยูนิตเป้าหมายในเกรฟยาร์ดของคุณ
กลับสู่ฟิลด์","Return target unit card from your 
graveyard to the field.",0,0,0,0,0,1,0,0,0,0,1,1,1,0,0,0,0,0,0,0,0,0,0,Use,AtUse,UniqueCard,"CardType(UNIT,Graveyard)",-,-,MoveToZone(PlayerField),Good
A00020,"ทำลายยูนิตเป้าหมายที่ไม่ใช่ลีดเดอร์และ
มี HP ต่ำที่สุด","Destroy target non-leader unit with
lowest HP.",0,0,0,0,0,1,0,0,0,0,1,1,1,0,0,0,0,0,0,0,0,0,0,Use,AtUse,BattleCard,"CardType(UNIT,NonLeader,LowestHP)",-,-,MoveToZone(Graveyard),Bad
A00021,นำยูนิตเป้าหมายที่ไม่ใช่ลีดเดอร์ขึ้นมือเจ้าของ,"Return target non-leader unit to its 
owner's hand.",0,0,0,0,0,1,0,0,0,0,1,1,1,0,0,0,0,0,0,0,0,0,0,Use,AtUse,BattleCard,"CardType(UNIT,NonLeader)",-,-,MoveToZone(Hand),Bad
A00022,"เมื่อการ์ดใบนี้นี้สร้างความเสียหายจากการต่อสู้
ให้เบสฝ่ายตรงข้ามควบคุม 
คุณสามารถจั่วการ์ด 1 ใบ","When this card deals battle damage to 
a base an opponent controls, you may 
draw a card.",0,0,1,1,1,0,0,0,0,0,1,1,1,0,0,0,0,0,0,0,0,0,0,Case,AtDealDamage,Player,CardController(),-,BattleDamageToEnemyBase(),MayDrawCard(1),Good
A00023,"เอนเทอร์: การ์ดใบนี้สร้างความเสียหาย X หน่วย
ให้ยูนิตเป้าหมาย โดย X คือ 2 บวก 
กับจำนวนเวพอนยูนิตที่คุณควบคุม","Enter: This card deals X damage to target unit, 
where X is 2 plus the number of Weapon 
units you control.",0,0,1,1,1,0,0,0,0,0,1,1,1,0,0,0,0,0,0,0,0,0,0,Case,AtEnter,BattleCard,CardType(UNIT),-,-,DealDamage(Count(CardController((CardType(UNIT) & CardSubType(WEAPON)))+2),Bad
A00024,"เอนเทอร์: นำยูนิตเป้าหมายที่ไม่ใช่ลีดเดอร์ขึ้น 
มือเจ้าของ","Enter: Return target non-leader unit to its 
owner's hand.",0,0,1,1,1,0,0,0,0,0,1,1,1,0,0,0,0,0,0,0,0,0,0,Case,AtEnter,BattleCard,"CardType(UNIT,NonLeader)",-,,MoveToZone(Hand),Bad
A00025,รูอิน: สับการ์ดใบนี้เข้าสำรับเจ้าของ,Ruin: Shuffle this card into its owner's deck.,0,0,1,1,1,0,0,1,1,1,1,1,1,1,1,1,1,1,1,1,1,1,1,Case,AtRuin,Player,CardController(),-,Ruin(),ShuffleTo(Deck),Neutral
A00026,การ์ดใบนี้สามารถเคลื่อนที่เพิ่ม ได้อีก 1 ครั้ง,This card gets an additional move.,0,0,1,1,1,0,0,0,0,0,1,0,1,0,0,0,0,0,0,0,0,0,0,Always,AtRemain,BattleCard,CardMe(),-,-,"GetMove(1, 1)",Neutral
A00027,"รูอิน: การ์ดใบนี้สร้างความเสียหาย 2 หน่วยให้
ยูนิตหรือสตรัคเจอร์เป้าหมาย","Ruin: this card deals 2 damage to target 
unit or structure.",0,0,1,1,1,0,0,1,1,1,1,1,1,1,1,1,1,1,1,1,1,1,1,Case,AtRuin,BattleCard,"CardType(UNIT), 
CardType(STRUCTURE)",-,Ruin(),DealDamage(2),Bad
A00028,"การ์ดใบนี้ได้รับ +3 HP/+3 AT ตราบ
เท่าที่คุณควบคุมยูนิตแคลนดิอาลโน 3 ตัวขึ้นไป","This card gets +3 HP/+3 AT as long as you 
control three or more Di alno clan units.",0,0,1,1,1,0,0,1,1,1,1,1,1,1,1,1,1,1,1,1,1,1,1,Always,AtRemain,BattleCard,CardMe(),-,HaveDialnoClanMoreEqual(3),"GetHP(3),GetAT(3)",Neutral
A00029,"นำยูนิตแคลนมิวแตนท์ในเกรฟยาร์ด 
ของคุณออกจากเกม: การ์ดใบนี้ได้รับ +2 AT 
จนจบเทิร์น","Remove a mutant clan unit in your graveyard 
from the game: This card gets +2 AT until end 
of turn.",0,0,1,1,1,0,0,0,0,0,1,1,1,0,0,0,0,0,0,0,0,0,0,Use,AtUse,UniqueCard,CardMe(),"RemoveCard(CardType(UNIT),
CardClan(Mutant),
Zone(Graveyard))",-,"GetAT(2, 1)",Good
A00030,"เอนเทอร์: ยูนิตแคลนมิวแตนท์ที่คุณ 
ควบคุมได้รับ +1 HP/+1 AT จนจบเทิร์น","Enter: Mutant clan units you control 
gets +1 HP/+1 AT until the end of turn.",0,0,1,1,1,0,0,0,0,0,1,1,1,0,0,0,0,0,0,0,0,0,0,Case,AtEnter,BattleCard,"All(CardType(UNIT),CardClan(Mutant),
CardController))",-,Enter(),"GetHP(1,1),GetAT(1,1)",Good
A00031,"ทำลายยูนิตทั้งหมดในฟิลด์ของคุณ
การ์ดใบนี้สร้างความเสียหาย 3 หน่วย
ให้เบสเป้าหมายที่คุณควบคุม","Destroy all units in your player field.
This card deals 3 damage to target 
base you control.",0,0,0,0,0,1,0,0,0,0,1,1,1,0,0,0,0,0,0,0,0,0,0,Use,AtUse,BattleCard,AllCard(AtZone(PlayerField)),-,-,,Bad
A00032,"ค้นหาการ์ดสตรัคเจอร์ 1 ใบในสำรับ ของคุณ 
แสดงการ์ดเหล่านั้น นำขึ้น มือและสับสำรับ","Search your deck for a structure card, 
reveal that card, and put it into your hand. 
Then shuffle your deck.",0,0,0,0,0,1,0,0,0,0,1,1,1,0,0,0,0,0,0,0,0,0,0,Use,AtUse,UniqueCard,CardController(Deck),-,-,"Search(DECK, 1, CardType(Structure), 1, HAND) , SuffleDeck(OWNER)",Good
A00033,เอนเทอร์: คุณจั่วการ์ด 1 ใบ ,Enter: You draw a card.,0,0,1,1,1,0,0,0,0,0,1,1,1,0,0,0,0,0,0,0,0,0,0,Case,AtEnter,Player,CardController(),-,-,DrawCard(1),Good
A00034,"20G: การ์ดใบนี้สร้างความเสีย หาย 1 หน่วย
ให้แอร์ยูนิตเป้าหมาย (ระยะ 0)","20G: This card deals 1 damage to 
target air unit. (Range 0)",0,0,1,1,1,0,0,0,0,0,1,1,1,0,0,0,0,0,0,0,0,0,0,Use,AtUse,BattleCard,"CardType(UNIT,AirUnit)",PayGold(20),-,"DealDamage(1,0)",Bad
A00035,"AT ของยูนิตกลายเป็น 0 จนจบเทิร์น
คุณจั่วการ์ด 1 ใบ","Units's AT becomes 0 until end of turn.
You draw a card.",0,0,0,0,0,1,0,0,0,0,1,1,1,0,0,0,0,0,0,0,0,0,0,Use,AtUse,Player,All(CardType(UNIT)),-,-,"ATBecome(0,1),DrawCard(1)",Bad
A00036,คุณจั่วการ์ด 1 ใบ,You draw a card.,0,0,0,0,0,1,0,0,0,0,1,1,1,0,0,0,0,0,0,0,0,0,0,Use,AtUse,Player,CardController(),-,-,DrawCard(1),Good
A00037,"20G: ค้นสำรับคุณเพื่อหาการ์ดชื่อ ฮาร์เวสเตอร์ 
แสดงการ์ดนั้น นำขึ้นมือ แล้วสับสำรับ","20G: Search your deck for a card named 
Harvester, reveal it, and put it into your hand. 
Then shuffle your deck.",0,0,1,1,1,0,0,0,0,0,1,1,1,0,0,0,0,0,0,0,0,0,0,Use,AtUse,UniqueCard,CardController(Deck),PayGold(20),-,"Search(DECK, 1, CardName(Harvester), 1, HAND) , ShuffleDeck(OWNER)",Good
A00038,"Act: การ์ดใบนี้สร้างความเสีย หาย 1 หน่วยให้
ยูนิตที่ไม่ใช่แอร์ยูนิตทุกตัว (ระยะ 0)","Act: this card deals 1 damage to 
each non-air unit. (Range 0)",0,0,1,1,1,0,0,0,0,0,1,1,1,0,0,0,0,0,0,0,0,0,0,Use,AtUse,BattleCard,"All(CardType(UNIT,NonAirUnit))",CardAct(),-,"DealDamage(1,0)",Bad
A00039,"10G: สตรัคเจอร์เป้าหมายที่คุณควบคุมได้ 
รับ -2 HP/+ 1 AT/+1 SP และกลายเป็น 
ยูนิตจนจบเทิร์น","10G: Target non-base structure you control 
becomes machine robot unit and 
gains -2 HP/+1 AT/+1 SP until end of turn.",0,0,1,1,1,0,0,0,0,0,1,1,1,0,0,0,0,0,0,0,0,0,0,Use,AtUse,BattleCard,CardController(CardType(Structure)),PayGold(10),-,"MinusHP(2,1),GetAT(1,1),GetSP(1,1),BecomeUnit(1)",Good
A00040,"Act: การ์ดใบนี้สร้างความ เสียหาย 4 หน่วย
ให้ยูนิตหรือสตรัคเจอร์ เป้าหมาย (ระยะ 0)","Act: This card deals 4 damage to 
target unit or structure. (Range 0)",0,0,1,1,1,0,0,0,0,0,1,1,1,0,0,0,0,0,0,0,0,0,0,Use,AtUse,BattleCard,"CardType(UNIT), 
CardType(STRUCTURE)",CardAct(),-,"DealDamage(4,0)",Bad
A00041,"Act: นำสตรัคเจอร์การ์ดค่าสร้างไม่เกิน 30G 
จากในมือลงฟิลด์เดียวกับการ์ดใบนี้","Act: Put a structure card with cost 30G or less 
from your hand onto the same field of this card.",0,0,1,1,1,0,0,0,0,0,1,1,1,0,0,0,0,0,0,0,0,0,0,Use,AtUse,UniqueCard,"CardType(STRUCTURE,
AtZone(HAND),CostEqualOrLess(30))",CardAct(),-,MoveToZone(PlayerField),Good
A00042,"80G: การ์ดใบนี้สร้างความเสียหาย 4 หน่วยให้
ยูนิตและสตรัคเจอร์","80G: This card deals 4 damage to each 
unit and structure.",0,0,1,1,1,0,0,0,0,0,1,1,1,0,0,0,0,0,0,0,0,0,0,Use,AtUse,BattleCard,"CardType(UNIT),
CardType(STRUCTURE)",PayGold(80),-,DealDamage(4),Bad
A00043,"Act: ทำลายยูนิตแมชชีนที่ไม่ใช่
ลีดเดอร์",Act: Destroy target non-leader machine unit.,0,0,1,1,1,0,0,0,0,0,1,1,1,0,0,0,0,0,0,0,0,0,0,Use,AtUse,BattleCard,"CardType(UNIT,NonLeader) 
& CardSubType(Machine)",CardAct(),-,MoveToZone(Graveyard),Bad
A00044,"ยูนิตแพลนท์ทั้งหมดที่คุณควบคุม
ได้รับ +1 AT/+1 SP.",Plant units you control get +1 AT/+1 SP.,0,0,1,1,1,0,0,1,1,1,1,1,1,1,1,1,1,1,1,1,1,1,1,Always,AtRemain,BattleCard,"All(CardType(UNIT),
CardSubType(Plant))",-,-,"GetAT(1),GetSP(1)",Neutral
A00045,ทำลายยูนิตที่คุณควบคุม: คุณได้รับ 20G,Destroy a unit you control: You receive 20G.,0,0,1,1,1,0,0,0,0,0,1,1,1,0,0,0,0,0,0,0,0,0,0,Use,AtUse,BattleCard,CardController(),DestroyCard(CardType(UNIT)),-,GetGold(20),Good
A00046,"ค้นสำรับคุณเพื่อหาการ์ดยูนิตแพลนท์ที่มี 
ค่าสร้างไม่เกิน 80G นำลงสู่ฟิลด์ สับสำรับ","Search your deck for a plant unit with cost 80G 
or less then put it onto the field. Shuffle your deck.",0,0,0,0,0,1,0,0,0,0,1,1,1,0,0,0,0,0,0,0,0,0,0,Use,AtUse,Player,CardController(Deck),-,-,"Search(DECK, 1, CardType(Unit) & CardSubType(Plant) 
& CostEqualOrLess(80), 1, HAND) , ShuffleDeck(OWNER)",Good
A00047,สับสำรับ,Shuffle your deck.,0,0,1,1,1,0,0,0,0,0,1,1,1,0,0,0,0,0,0,0,0,0,0,Use,AtUse,Player,CardController(Deck),-,-,ShuffleDeck(OWNER),Neutral
A00048,"ค้นสำรับคุณเพื่อหาการ์ดยูนิต แสดงการ์ด 
นำขึ้นมือ สับสำรับ","Search your deck for an unit card, reveal that card,
 and put it into your hand. Then shuffle your deck.",0,0,0,0,0,1,0,0,0,0,1,1,1,0,0,0,0,0,0,0,0,0,0,Use,AtUse,Player,CardController(Deck),-,-,"Search(DECK, 1, CardType(Unit), 1, HAND) , ShuffleDeck(OWNER)",Good
A00049,ยูนิตทั้งหมดที่คุณควบคุมได้รับ +1 Shield,Units you control get +1 Shield.,0,0,1,1,1,0,0,1,1,1,1,1,1,1,1,1,1,1,1,1,1,1,1,Always,AtRemain,BattleCard,"All(CardType(UNIT),OWNER)",-,-,GetShield(1),Neutral
A00050,"ทำลายยูนิตที่คุณควบคุม: นำสเตรนท์
เคาเตอร์ (+1 HP/+1 AT) วางบนการ์ดใบนี้","Destroy a unit you control: Put a strength 
counter (+1 HP/+1 AT) on this card.",0,0,1,1,1,0,0,0,0,0,1,1,1,0,0,0,0,0,0,0,0,0,0,Use,AtUse,BattleCard,CardMe(),DestroyCard(CardType(UNIT)),-,GetStrengthCounter(1),Good
A00051,"ทิ้งการ์ดในมือ 1 ใบ: นำยูนิตแคลน
ดิอาลโนที่ค่าสร้างไม่เกิน 30G จาก
เกรฟยาร์ดของคุณสู่ฟิลด์","Discard a card: Return target Di alno clan unit 
with cost 30G or less from your graveyard to the 
field.",0,0,1,1,1,0,0,0,0,0,1,1,1,0,0,0,0,0,0,0,0,0,0,Use,AtUse,UniqueCard,"CardType(UNIT,CardClan(Dialno),
AtZone(Graveyard),
CostEqualOrLess(30))",Discard(1),-,MoveToZone(PlayerField),Good
A00052,"Act: ค้นสำรับคุณเพื่อหาการ์ดแคลน
เบรอนโด แสดงการ์ดนั้น นำขึ้นมือ สับสำรับ","Act: Search your deck for a Berondo clan card, 
reveal that card, and put it into your hand. Then 
shuffle your deck.",0,0,1,1,1,0,0,0,0,0,1,1,1,0,0,0,0,0,0,0,0,0,0,Use,AtUse,Player,CardController(Deck),CardAct(),-,"Search(DECK, 1, CardType(Unit) & CardClan(Berondo), 1, HAND) , 
ShuffleDeck(OWNER)",Good
A00053,"ยูนิตโซลเยอร์อื่นที่คุณควบคุมได้รับ 
+1 HP/+1 AT และเพียสซิง","Other Soldier units you control get +1 HP/+1 AT 
and piercing.",0,0,1,1,1,0,0,1,1,1,1,1,1,1,1,1,1,1,1,1,1,1,1,Always,AtRemain,BattleCard,"AllOther(CardType(UNIT),
CardSubType(Soldier))",-,-,"GetHP(1),GetAT(1),GetPiercing()",Neutral
A00054,"Act: การ์ดใบนี้สร้างความ
เสียหาย 1 หน่วยให้ยูนิตหรือสตรัคเจอร์
เป้าหมาย","Act: This card deals 1 damage to target 
unit or structure.",0,0,1,1,1,0,0,0,0,0,1,1,1,0,0,0,0,0,0,0,0,0,0,Use,AtUse,BattleCard,"CardType(UNIT),
CardType(STRUCTURE)",CardAct(),-,DealDamage(1),Bad
A00055,Act: คุณจั่วการ์ด 1 ใบ,Act: You draw a card.,0,0,1,1,1,0,0,0,0,0,1,1,1,0,0,0,0,0,0,0,0,0,0,Use,AtUse,Player,CardController(),CardAct(),-,DrawCard(1),Good
A00056,"เอนเทอร์: ผู้เล่นฝ่ายตรงข้ามเป้าหมายทิ้ง
การ์ดในมือ 1 ใบ",Enter: Target opponent discards a card. ,0,0,1,1,1,0,0,0,0,0,1,1,1,0,0,0,0,0,0,0,0,0,0,Case,AtEnter,Player,Enemy(),-,Enter(),Discard(1),Bad
A00057,"การ์ดใบนี้ได้รับ +1 HP/+1 AT และ
น็อคแบ๊คตราบเท่าที่คุณไม่ได้ควบคุมยูนิต
แคลนอื่นนอกจากมิวแตนท์","This card gets +1 HP/+1 AT and Knockback 
as long as you control no non-Mutant clan unit.",0,0,1,1,1,0,0,1,1,1,1,1,1,1,1,1,1,1,1,1,1,1,1,Always,AtRemain,BattleCard,CardMe(),-,"ControlOnly(CardType(UNIT),CardClan(Mutant))","GetHP(1),GetAT(1),GetKnockback()",Neutral
A00058,"ทำลายการ์ดใบนี้: ยูนิตเป้าหมายได้รับ 
+3 HP/+3 AT จนจบเทิร์น","Destroy this card: Target unit gets +3 HP/+3 AT 
until end of turn.",0,0,1,1,1,0,0,0,0,0,1,1,1,0,0,0,0,0,0,0,0,0,0,Use,AtUse,BattleCard,CardType(UNIT),DestroyCard(This),-,"GetHP(3,1),GetAT(3,1)",Good
A00059,"การ์ดใบนี้สร้างความเสียหาย X หน่วย
ให้ยูนิตเป้าหมาย โดย X คือจำนวนของ
ยูนิตในฟิลด์เดียวกัน","This card deals x damage to target unit, 
where x is the number of units in the same field.",0,0,0,0,0,1,0,0,0,0,1,1,1,0,0,0,0,0,0,0,0,0,0,Use,AtUse,BattleCard,CardType(UNIT),-,-,DealDamage(Count(NumberOfUnitInTheSameField)),Bad
A00060,"การ์ดใบนี้สร้างความเสียหาย 2 หน่วย
ให้ยูนิตทุกตัวในแบทเทิลฟิลด์","This card deals 2 damage to each unit 
in battlefield.",0,0,0,0,0,1,0,0,0,0,1,1,1,0,0,0,0,0,0,0,0,0,0,Use,AtUse,BattleCard,"All(CardType(UNIT),
AtZone(BattleField))",-,-,DealDamge(2),Bad
A00061,"เบสเป้าหมายได้รับ +1 HP ต่อจำนวน
ยูนิตที่คุณควบคุม",Target Base gets +1 HP for each unit you control.,0,0,0,0,0,1,0,0,0,0,1,1,1,0,0,0,0,0,0,0,0,0,0,Use,AtUse,BattleCard,"CardType(Structure) 
& CardSubType(Base)",-,-,GetHP(Count(CardController(CardType(UNIT)))),Good
A00062,10G: ยูนิตสคิราเป้าหมายได้รับ +1 HP จนจบเทิร์น,10G: Target skira unit get +1 HP until end of turn.,0,0,1,1,1,0,0,0,0,0,1,1,1,0,0,0,0,0,0,0,0,0,0,Use,AtUse,BattleCard,CardType(UNIT) & CardSubType(Skira),PayGold(10),-,"GetHP(1,1)",Good
A00063,"ยูนิตแคลนมิวแตนท์เป้าหมายได้รับ 
+2 AT/+1 SP จนจบเทิร์น","Target Mutant clan unit gets +2AT/+1 SP 
until end of turn.",0,0,0,0,0,1,0,0,0,0,1,1,1,0,0,0,0,0,0,0,0,0,0,Use,AtUse,BattleCard,CardType(UNIT) & CardClan(Mutant),-,-,"GetAT(2,1),GetSP(1,1)",Good
A00064,"Act: นำวีคเนสเคาเตอร์ (-1 HP/-1 AT) 
วางบนยูนิตเป้าหมาย (ระยะ 0)","Act: Put a weakness counter (-1 HP/-1 AT) 
on target unit.",0,0,1,1,1,0,0,0,0,0,1,1,1,0,0,0,0,0,0,0,0,0,0,Use,AtUse,BattleCard,CardType(UNIT),CardAct(),-,"GetWeaknessCounter(1,0)",Bad
A00065,"ออโต: คุณได้รับ 10G ต่อจำนวนยูนิต
เวิร์คเกอร์ที่คุณควบคุม","Auto: You receive 10G for each 
worker unit you control.",0,0,1,1,1,0,0,0,1,0,0,0,0,0,0,0,0,0,0,0,0,0,0,Case,AtBeginOfPhase,Player,CardController(),-,-,"GetGold(Count(CardType(Unit)&CardSubType(Worker),Owner))",Neutral
A00066,"ทำลายยูนิตเป้าหมายที่ไม่ใช่ลีดเดอร์
และมีค่าสร้างไม่เกิน 60G","Destroy target non-leader unit 
with cost 60G or less.",0,0,0,0,0,1,0,0,0,0,1,1,1,0,0,0,0,0,0,0,0,0,0,Use,AtUse,BattleCard,"CardType(UNIT,NonLeader,CostEqualorLess(60))",-,-,MoveToZone(Graveyard),Bad
A00067,"เอนเทอร์: การ์ดใบนี้สร้างความเสีย
หาย 5 หน่วยให้เบสเป้าหมายที่คุณควบคุม","Enter: This card deals 5 damage to target base 
you control.",0,0,1,1,1,0,0,0,0,0,1,1,1,0,0,0,0,0,0,0,0,0,0,Case,AtEnter,BattleCard,"CardController(CardType(Structure) 
& CardSubType(Base))",-,Enter(),DealDamage(5),Bad
A00068,"นำยูนิตเป้าหมายที่ไม่ใช่ลีดเดอร์สับเข้า
สำรับเจ้าของ",Shuffle target non-leader unit to owner's deck,0,0,0,0,0,1,0,0,0,0,1,1,1,0,0,0,0,0,0,0,0,0,0,Use,AtUse,BattleCard,"CardType(UNIT,NonLeader)",-,-,ShuffleToDeck(OWNER),Bad
A00069,"ย้ายยูนิตเป้าหมายจาก
ฟิลด์หนึ่งสู่อีกฟิลด์",Move target unit to target field.,0,0,0,0,0,1,0,0,0,0,1,1,1,0,0,0,0,0,0,0,0,0,0,Use,AtUse,BattleCard,CardType(UNIT),-,-,MoveToZone(PlayerField or BattleField or EnemyField),Bad
A00070,"ออโต: คุณสามารถค้นสำรับของคุณเพื่อ
หายูนิตแคลนมิวแตนท์และนำมันสู่เกรฟ
ยาร์ด ถ้าคุณทำ สับสำรับ","Auto: You may search your deck for a Mutant clan 
unit card and put that card into your graveyard. 
If you do, shuffle your deck.",0,0,1,1,1,0,0,0,1,0,0,0,0,0,0,0,0,0,0,0,0,0,0,Case,AtBeginOfPhase,Player,CardController(Deck),-,-,"MaySearch(DECK, 1, CardType(Unit) & CardClan(Mutant), 1, Graveyard) ,  
ShuffleDeck(OWNER)",Good
A00071,"ออโต: คุณสามารถนำยูนิตแคลนมิวแตนท์
ในเกรฟยาร์ดของคุณออกจากเกม ถ้าคุณ
ทำฝ่ายตรงข้ามทุกคนสุ่มทิ้งการ์ดในมือ 1 ใบ ","Auto: You may remove a Mutant clan unit in 
your graveyard from the game. If you do, 
each opponent discards a card at random.",0,0,1,1,1,0,0,0,1,0,0,0,0,0,0,0,0,0,0,0,0,0,0,Case,AtBeginOfPhase,UniqueCard,AllEnemy(),"RemoveCard(CardType(UNIT),
CardClan(Mutant),
Zone(Graveyard))",-,DiscardRandom(1),Bad
A00072,Act: เซราฟมาร์คทูสร้างความเสียหาย 2 หน่วยให้ยูนิตเป้าหมาย (ระยะ 0-1),"Act: Xeraph MK II deals 2 damage to 
target unit. (Range 0-1)",0,0,1,1,1,0,0,0,0,0,1,1,1,0,0,0,0,0,0,0,0,0,0,Use,AtUse,BattleCard,CardType(UNIT),CardAct(),-,"DealDamage(2,0,1)",Bad
A00073,เอนเทอร์: คุณสุ่มทิ้งการ์ดในมือ 2 ใบ,Enter: You discard two cards at random.,0,0,1,1,1,0,0,0,0,0,1,1,1,0,0,0,0,0,0,0,0,0,0,Case,AtEnter,Player,CardController(),-,Enter(),DiscardRandom(2),Bad
A00074,"ยูนิตแคลนเบรอนโดอื่นที่คุณควบคุมได้
รับ +1 HP/+1 AT","Other Berondo clan units you control 
get +1 HP/+1 AT.",0,0,1,1,1,0,0,1,1,1,1,1,1,1,1,1,1,1,1,1,1,1,1,Always,AtRemain,BattleCard,"All(CardType(UNIT) & 
CardClan(Berondo))",-,-,"GetHP(1),GetAT(1)",Neutral
A00075,"ยูนิตแคลนดิอาลโนอื่นที่คุณควบคุมได้
รับ +1 HP/+1 AT","Other Di alno clan units you control 
get +1 HP/+1 AT.",0,0,1,1,1,0,0,1,1,1,1,1,1,1,1,1,1,1,1,1,1,1,1,Always,AtRemain,BattleCard,"All(CardType(UNIT) & 
CardClan(Dialno))",-,-,"GetHP(1),GetAT(1)",Neutral
A00076,"เอนเทอร์: ค้นสำรับคุณเพื่อหาการ์ด 1 ใบขึ้นมือ 
สับสำรับ","Enter: Search your deck for a card, 
put it into your hand. Then shuffle your deck. ",0,0,1,1,1,0,0,0,0,0,1,1,1,0,0,0,0,0,0,0,0,0,0,Case,AtEnter,Player,CardController(Deck),-,Enter(),"Search(DECK, 1, HAND) , ShuffleDeck(OWNER)",Good
A00077,"ยูนิตแคลนมิวแตนท์อื่นที่คุณควบคุมได้
รับ +1 HP/+1 AT","Other Mutant clan units you control
get +1 HP/+1 AT.",0,0,1,1,1,0,0,1,1,1,1,1,1,1,1,1,1,1,1,1,1,1,1,Always,AtRemain,BattleCard,"All(CardType(UNIT) & 
CardClan(Mutant))",-,-,"GetHP(1),GetAT(1)",Neutral
A00078,"รูอิน: นำยูนิตที่ไม่ใช่ลีดเดอร์ทั้งหมด
ในฟิลด์เดียวกันกลับขึ้นมือเจ้าของ ","Ruin: Return all non-leader units in 
the same field to owner's hand.",0,0,1,1,1,0,0,1,1,1,1,1,1,1,1,1,1,1,1,1,1,1,1,Case,AtRuin,BattleCard,"All(CardType(UNIT, NonLeader) & 
SameZoneAs (CardMe()))",-,Ruin(),MoveToZone(Hand),Bad
A00079,ออโต: คุณจั่วการ์ด 1 ใบ ,Auto: Draw a card.,0,0,1,1,1,0,0,0,1,0,0,0,0,0,0,0,0,0,0,0,0,0,0,Case,AtBeginOfPhase,Player,CardController(),-,-,DrawCard(1),Good
A00080,"การ์ดใบนี้ได้รับ 
+1 HP/+ AT ตามจำนวนรีซอร์สในเกรฟ
ยาร์ดของคุณ","This card gets +1 HP/+1 AT for each 
resource card in your graveyard.",0,0,1,1,1,0,0,1,1,1,1,1,1,1,1,1,1,1,1,1,1,1,1,Always,AtRemain,BattleCard,CardMe(),-,-,"GetHP(Count(CardController(CardType(Structure) & 
CardSubType(Resource) & AtZone(Graveyard)))), GetAT
(Count(CardController(CardType(Structure) & 
CardSubType(Resource) & AtZone(Graveyard))))",Neutral
A00081,"ทำลายยูนิตที่คุณควบคุม: การ์ดใบนี้สร้าง
ความเสียหาย 2 หน่วยให้ยูนิตหรือ
สตรัคเจอร์เป้าหมาย (ระยะ 1)","Destroy a unit you control: This card 
deals 2 damage to target unit or structure. 
(Range 1)",0,0,1,1,1,0,0,0,0,0,1,1,1,0,0,0,0,0,0,0,0,0,0,Use,AtUse,BattleCard,"CardType(UNIT),
CardType(STRUCTURE)","DestroyCard(CardController
(CardType(UNIT)))",-,"DealDamage(2,1)",Bad
A00082,"เอนเทอร์: คุณอาจนำยูนิตแพลนท์เป้าหมาย
ที่มีค่าสร้าง 60G หรือต่ำกว่าจากสุสานลงสู่สนามได้","Enter: You may return target plant unit with 
cost 60G or less from your graveyard to the field. ",0,0,1,1,1,0,0,0,0,0,1,1,1,0,0,0,0,0,0,0,0,0,0,Case,AtEnter,UniqueCard,"CardType(UNIT) & CardSubType(Plant) 
& CostEqualorLess(60) 
& AtZone(Graveyard) ",-,Enter(),MoveToZone(PlayerField),Good
A00083,"เอนเทอร์: การ์ดใบนี้สร้างความ 
เสียหาย 2 หน่วยให้ยูนิตเป้าหมาย 2",Enter: This card deals 2 damage to target unit. ,0,0,1,1,1,0,0,0,0,0,1,1,1,0,0,0,0,0,0,0,0,0,0,Case,AtEnter,BattleCard,CardType(UNIT),-,Enter(),DealDamage(2),Bad
A00084,"ออโต: การ์ดใบนี้สร้างความ
เสียหาย 1 หน่วยให้ยูนิตที่ไม่ใช่
แพลนท์ทุกตัว (ระยะ 0)","Auto: This card deals 1 damage to
each non-plant unit. (Range 0)",0,0,1,1,1,0,0,0,1,0,0,0,0,0,0,0,0,0,0,0,0,0,0,Case,AtBeginOfPhase,BattleCard,"CardType(UNIT, 
Not(CardSubType(Plant))) ",-,-,"DealDamage(1,0)",Neutral
A00085,รูอิน: ผู้เล่นทุกคนทิ้งการ์ดในมือทุกใบ ,Ruin: Each player discards his or her hand.,0,0,1,1,1,0,0,1,1,1,1,1,1,1,1,1,1,1,1,1,1,1,1,Case,AtRuin,Player,AllPlayer(),-,Ruin(),Discard(All),Neutral
A00086,"การ์ดใบนี้ได้รับ +5 HP/+5 AT ตราบเท่าที่
คุณควบคุมยูนิตแคลนดิอาลโน 3 ตัวขึ้นไป","This card gets +5 HP/+5 AT as long as
you control three or more Di alno clan units.",0,0,1,1,1,0,0,1,1,1,1,1,1,1,1,1,1,1,1,1,1,1,1,Always,AtRemain,UniqueCard,CardMe(),-,HaveDialnoClanMoreEqual(3),"GetHP(3),GetAT(3)",Neutral
A00087,"เอนเทอร์: ค้นสำรับคุณเพื่อหาการ์ดยูนิต
ชื่อมิวแตนท์โดรน นำลงสู่ฟิลด์ สับสำรับ","Enter: Search your deck for a card named 
Mutant Drone then put it onto the field. 
Shuffle your deck.",0,0,1,1,1,0,0,0,0,0,1,1,1,0,0,0,0,0,0,0,0,0,0,Case,AtEnter,Player,CardController(),-,Enter(),"Search(DECK, 1, CardName(MutantDrone), 1, PlayerField) , 
ShuffleDeck(OWNER)",Good