DeckID,CardID,Amount,,,,
DECK_AIR,C0003,1,,C0003,3,40
DECK_AIR,C0003,1,,C0007,1,
DECK_AIR,C0003,1,,C0008,2,
DECK_AIR,C0011,1,,C0011,3,
DECK_AIR,C0011,1,,C0015,2,
DECK_AIR,C0011,1,,C0026,2,
DECK_AIR,C0038,1,,C0028,1,
DECK_AIR,C0038,1,,C0038,3,
DECK_AIR,C0093,1,,C0046,2,
DECK_AIR,C0093,1,,C0087,2,
DECK_AIR,C0106,1,,C0088,3,
DECK_AIR,C0106,1,,C0093,2,
DECK_AIR,C0015,1,,C0106,2,
DECK_AIR,C0128,1,,C0108,3,
DECK_AIR,C0128,1,,C0115,1,
DECK_AIR,C0108,1,,C0122,2,
DECK_AIR,C0108,1,,C0128,2,
DECK_AIR,C0108,1,,C0134,2,
DECK_AIR,C0134,1,,C0140,2,
DECK_AIR,C0134,1,,,,
DECK_AIR,C0122,1,,,,
DECK_AIR,C0122,1,,,,
DECK_AIR,C0028,1,,,,
DECK_AIR,C0007,1,,,,
DECK_AIR,C0088,1,,,,
DECK_AIR,C0026,1,,,,
DECK_AIR,C0026,1,,,,
DECK_AIR,C0038,1,,,,
DECK_AIR,C0140,1,,,,
DECK_AIR,C0140,1,,,,
DECK_AIR,C0088,1,,,,
DECK_AIR,C0115,1,,,,
DECK_AIR,C0046,1,,,,
DECK_AIR,C0046,1,,,,
DECK_AIR,C0088,1,,,,
DECK_AIR,C0008,1,,,,
DECK_AIR,C0008,1,,,,
DECK_AIR,C0015,1,,,,
DECK_AIR,C0087,1,,,,
DECK_AIR,C0087,1,,,,
DECK_DARK,C0009,1,,C0009,2,40
DECK_DARK,C0009,1,,C0012,1,
DECK_DARK,C0130,1,,C0025,2,
DECK_DARK,C0130,1,,C0028,2,
DECK_DARK,C0130,1,,C0030,2,
DECK_DARK,C0331,1,,C0031,2,
DECK_DARK,C0331,1,,C0034,2,
DECK_DARK,C0331,1,,C0035,1,
DECK_DARK,C0131,1,,C0036,2,
DECK_DARK,C0131,1,,C0041,3,
DECK_DARK,C0131,1,,C0070,2,
DECK_DARK,C0073,1,,C0073,3,
DECK_DARK,C0073,1,,C0079,2,
DECK_DARK,C0073,1,,C0112,1,
DECK_DARK,C0070,1,,C0114,2,
DECK_DARK,C0070,1,,C0115,2,
DECK_DARK,C0041,1,,C0130,3,
DECK_DARK,C0041,1,,C0131,3,
DECK_DARK,C0041,1,,C0331,3,
DECK_DARK,C0036,1,,,,
DECK_DARK,C0036,1,,,,
DECK_DARK,C0034,1,,,,
DECK_DARK,C0012,1,,,,
DECK_DARK,C0112,1,,,,
DECK_DARK,C0025,1,,,,
DECK_DARK,C0025,1,,,,
DECK_DARK,C0030,1,,,,
DECK_DARK,C0030,1,,,,
DECK_DARK,C0079,1,,,,
DECK_DARK,C0079,1,,,,
DECK_DARK,C0115,1,,,,
DECK_DARK,C0115,1,,,,
DECK_DARK,C0034,1,,,,
DECK_DARK,C0114,1,,,,
DECK_DARK,C0114,1,,,,
DECK_DARK,C0028,1,,,,
DECK_DARK,C0028,1,,,,
DECK_DARK,C0035,1,,,,
DECK_DARK,C0031,1,,,,
DECK_DARK,C0031,1,,,,
DECK_EARTH,C0010,1,,C0001,2,40
DECK_EARTH,C0010,1,,C0008,2,
DECK_EARTH,C0074,1,,C0010,2,
DECK_EARTH,C0074,1,,C0030,2,
DECK_EARTH,C0091,1,,C0031,2,
DECK_EARTH,C0091,1,,C0046,2,
DECK_EARTH,C0060,1,,C0060,1,
DECK_EARTH,C0076,1,,C0074,2,
DECK_EARTH,C0076,1,,C0076,2,
DECK_EARTH,C0094,1,,C0079,1,
DECK_EARTH,C0094,1,,C0091,2,
DECK_EARTH,C0094,1,,C0094,3,
DECK_EARTH,C0113,1,,C0112,2,
DECK_EARTH,C0113,1,,C0113,2,
DECK_EARTH,C0112,1,,C0123,3,
DECK_EARTH,C0123,1,,C0127,1,
DECK_EARTH,C0123,1,,C0133,2,
DECK_EARTH,C0123,1,,C0136,3,
DECK_EARTH,C0133,1,,C0138,2,
DECK_EARTH,C0133,1,,C0149,2,
DECK_EARTH,C0149,1,,,,
DECK_EARTH,C0149,1,,,,
DECK_EARTH,C0138,1,,,,
DECK_EARTH,C0138,1,,,,
DECK_EARTH,C0136,1,,,,
DECK_EARTH,C0136,1,,,,
DECK_EARTH,C0136,1,,,,
DECK_EARTH,C0127,1,,,,
DECK_EARTH,C0112,1,,,,
DECK_EARTH,C0079,1,,,,
DECK_EARTH,C0031,1,,,,
DECK_EARTH,C0031,1,,,,
DECK_EARTH,C0030,1,,,,
DECK_EARTH,C0030,1,,,,
DECK_EARTH,C0001,1,,,,
DECK_EARTH,C0001,1,,,,
DECK_EARTH,C0008,1,,,,
DECK_EARTH,C0008,1,,,,
DECK_EARTH,C0046,1,,,,
DECK_EARTH,C0046,1,,,,
DECK_FIRE,C0005,1,,C0001,1,40
DECK_FIRE,C0005,1,,C0005,2,
DECK_FIRE,C0001,1,,C0027,2,
DECK_FIRE,C0028,1,,C0028,3,
DECK_FIRE,C0089,1,,C0031,2,
DECK_FIRE,C0089,1,,C0034,2,
DECK_FIRE,C0031,1,,C0046,3,
DECK_FIRE,C0107,1,,C0079,1,
DECK_FIRE,C0107,1,,C0088,1,
DECK_FIRE,C0124,1,,C0089,2,
DECK_FIRE,C0143,1,,C0092,2,
DECK_FIRE,C0143,1,,C0107,2,
DECK_FIRE,C0027,1,,C0112,2,
DECK_FIRE,C0027,1,,C0124,1,
DECK_FIRE,C0146,1,,C0129,2,
DECK_FIRE,C0147,1,,C0140,2,
DECK_FIRE,C0147,1,,C0141,2,
DECK_FIRE,C0147,1,,C0143,2,
DECK_FIRE,C0148,1,,C0146,1,
DECK_FIRE,C0148,1,,C0147,3,
DECK_FIRE,C0088,1,,C0148,2,
DECK_FIRE,C0141,1,,,,
DECK_FIRE,C0141,1,,,,
DECK_FIRE,C0031,1,,,,
DECK_FIRE,C0140,1,,,,
DECK_FIRE,C0140,1,,,,
DECK_FIRE,C0129,1,,,,
DECK_FIRE,C0129,1,,,,
DECK_FIRE,C0112,1,,,,
DECK_FIRE,C0112,1,,,,
DECK_FIRE,C0028,1,,,,
DECK_FIRE,C0092,1,,,,
DECK_FIRE,C0092,1,,,,
DECK_FIRE,C0028,1,,,,
DECK_FIRE,C0079,1,,,,
DECK_FIRE,C0046,1,,,,
DECK_FIRE,C0046,1,,,,
DECK_FIRE,C0046,1,,,,
DECK_FIRE,C0034,1,,,,
DECK_FIRE,C0034,1,,,,
DECK_HOLY,C0018,1,,C0001,2,40
DECK_HOLY,C0018,1,,C0004,2,
DECK_HOLY,C0018,1,,C0016,2,
DECK_HOLY,C0019,1,,C0017,2,
DECK_HOLY,C0019,1,,C0018,3,
DECK_HOLY,C0017,1,,C0019,2,
DECK_HOLY,C0020,1,,C0020,3,
DECK_HOLY,C0020,1,,C0026,2,
DECK_HOLY,C0020,1,,C0032,2,
DECK_HOLY,C0032,1,,C0039,2,
DECK_HOLY,C0032,1,,C0040,2,
DECK_HOLY,C0111,1,,C0043,1,
DECK_HOLY,C0039,1,,C0044,2,
DECK_HOLY,C0039,1,,C0045,2,
DECK_HOLY,C0040,1,,C0048,3,
DECK_HOLY,C0040,1,,C0087,1,
DECK_HOLY,C0017,1,,C0111,1,
DECK_HOLY,C0044,1,,C0117,3,
DECK_HOLY,C0044,1,,C0129,2,
DECK_HOLY,C0045,1,,C0141,1,
DECK_HOLY,C0045,1,,,,
DECK_HOLY,C0048,1,,,,
DECK_HOLY,C0048,1,,,,
DECK_HOLY,C0048,1,,,,
DECK_HOLY,C0026,1,,,,
DECK_HOLY,C0026,1,,,,
DECK_HOLY,C0001,1,,,,
DECK_HOLY,C0043,1,,,,
DECK_HOLY,C0087,1,,,,
DECK_HOLY,C0129,1,,,,
DECK_HOLY,C0117,1,,,,
DECK_HOLY,C0117,1,,,,
DECK_HOLY,C0117,1,,,,
DECK_HOLY,C0129,1,,,,
DECK_HOLY,C0016,1,,,,
DECK_HOLY,C0016,1,,,,
DECK_HOLY,C0004,1,,,,
DECK_HOLY,C0004,1,,,,
DECK_HOLY,C0001,1,,,,
DECK_HOLY,C0141,1,,,,
DECK_WATER,C0029,1,,C0029,3,40
DECK_WATER,C0029,1,,C0075,2,
DECK_WATER,C0029,1,,C0078,3,
DECK_WATER,C0075,1,,C0090,2,
DECK_WATER,C0075,1,,C0119,2,
DECK_WATER,C0078,1,,C0126,3,
DECK_WATER,C0078,1,,C0145,2,
DECK_WATER,C0078,1,,C0150,2,
DECK_WATER,C0090,1,,C0151,3,
DECK_WATER,C0090,1,,C0120,2,
DECK_WATER,C0119,1,,C0028,3,
DECK_WATER,C0119,1,,C0026,2,
DECK_WATER,C0126,1,,C0001,3,
DECK_WATER,C0126,1,,C0112,2,
DECK_WATER,C0126,1,,C0034,2,
DECK_WATER,C0145,1,,C0129,1,
DECK_WATER,C0145,1,,C0132,1,
DECK_WATER,C0150,1,,C0027,2,
DECK_WATER,C0150,1,,,,
DECK_WATER,C0151,1,,,,
DECK_WATER,C0151,1,,,,
DECK_WATER,C0151,1,,,,
DECK_WATER,C0120,1,,,,
DECK_WATER,C0120,1,,,,
DECK_WATER,C0028,1,,,,
DECK_WATER,C0028,1,,,,
DECK_WATER,C0028,1,,,,
DECK_WATER,C0026,1,,,,
DECK_WATER,C0026,1,,,,
DECK_WATER,C0001,1,,,,
DECK_WATER,C0001,1,,,,
DECK_WATER,C0001,1,,,,
DECK_WATER,C0112,1,,,,
DECK_WATER,C0112,1,,,,
DECK_WATER,C0034,1,,,,
DECK_WATER,C0034,1,,,,
DECK_WATER,C0129,1,,,,
DECK_WATER,C0132,1,,,,
DECK_WATER,C0027,1,,,,
DECK_WATER,C0027,1,,,,
DECK_TUTOR_1,CT0087,1,,,,
DECK_TUTOR_1,CT0004,1,,,,
DECK_TUTOR_1,CT0001,1,,,,
DECK_TUTOR_1,CT0001,1,,,,
DECK_TUTOR_1,CT0001,1,,,,
DECK_TUTOR_1,CT0001,1,,,,
DECK_TUTOR_1,CT0001,1,,,,
DECK_TUTOR_1,CT0001,1,,,,
DECK_TUTOR_1,CT0001,1,,,,
DECK_TUTOR_1,CT0001,1,,,,
DECK_TUTOR_1,CT0001,1,,,,
DECK_TUTOR_1,CT0001,1,,,,
DECK_TUTOR_1,CT0001,1,,,,
DECK_TUTOR_1,CT0001,1,,,,
DECK_TUTOR_1,CT0001,1,,,,
DECK_TUTOR_1,CT0001,1,,,,
DECK_TUTOR_1,CT0001,1,,,,
DECK_TUTOR_1,CT0001,1,,,,
DECK_TUTOR_1,CT0001,1,,,,
DECK_TUTOR_1,CT0001,1,,,,
DECK_TUTOR_1,CT0001,1,,,,
DECK_TUTOR_1,CT0001,1,,,,
DECK_TUTOR_1,CT0001,1,,,,
DECK_TUTOR_1,CT0001,1,,,,
DECK_TUTOR_1,CT0001,1,,,,
DECK_TUTOR_1,CT0001,1,,,,
DECK_TUTOR_1,CT0001,1,,,,
DECK_TUTOR_1,CT0001,1,,,,
DECK_TUTOR_1,CT0001,1,,,,
DECK_TUTOR_1,CT0001,1,,,,
DECK_TUTOR_1,CT0001,1,,,,
DECK_TUTOR_1,CT0001,1,,,,
DECK_TUTOR_1,CT0001,1,,,,
DECK_TUTOR_1,CT0001,1,,,,
DECK_TUTOR_1,CT0001,1,,,,
DECK_TUTOR_1,CT0001,1,,,,
DECK_TUTOR_1,CT0001,1,,,,
DECK_TUTOR_1,CT0001,1,,,,
DECK_TUTOR_1,CT0001,1,,,,
DECK_TUTOR_1,CT0001,1,,,,
DECK_TUTOR_2,CT0173,1,,,,
DECK_TUTOR_2,CT0117,1,,,,
DECK_TUTOR_2,CT0032,1,,,,
DECK_TUTOR_2,CT0018,1,,,,
DECK_TUTOR_2,CT0044,1,,,,
DECK_TUTOR_2,CT0039,1,,,,
DECK_TUTOR_2,CT0016,1,,,,
DECK_TUTOR_2,CT0026,1,,,,
DECK_TUTOR_2,CT0040,1,,,,
DECK_TUTOR_2,CT0032,1,,,,
DECK_TUTOR_2,CT0001,1,,,,
DECK_TUTOR_2,CT0173,1,,,,
DECK_TUTOR_2,CT0117,1,,,,
DECK_TUTOR_2,CT0032,1,,,,
DECK_TUTOR_2,CT0018,1,,,,
DECK_TUTOR_2,CT0044,1,,,,
DECK_TUTOR_2,CT0039,1,,,,
DECK_TUTOR_2,CT0016,1,,,,
DECK_TUTOR_2,CT0026,1,,,,
DECK_TUTOR_2,CT0040,1,,,,
DECK_TUTOR_2,CT0032,1,,,,
DECK_TUTOR_2,CT0001,1,,,,
DECK_TUTOR_2,CT0173,1,,,,
DECK_TUTOR_2,CT0117,1,,,,
DECK_TUTOR_2,CT0032,1,,,,
DECK_TUTOR_2,CT0018,1,,,,
DECK_TUTOR_2,CT0044,1,,,,
DECK_TUTOR_2,CT0039,1,,,,
DECK_TUTOR_2,CT0016,1,,,,
DECK_TUTOR_2,CT0026,1,,,,
DECK_TUTOR_2,CT0040,1,,,,
DECK_TUTOR_2,CT0032,1,,,,
DECK_TUTOR_2,CT0001,1,,,,
DECK_TUTOR_2,CT0173,1,,,,
DECK_TUTOR_2,CT0117,1,,,,
DECK_TUTOR_2,CT0032,1,,,,
DECK_TUTOR_2,CT0018,1,,,,
DECK_TUTOR_2,CT0044,1,,,,
DECK_TUTOR_2,CT0039,1,,,,
DECK_TUTOR_2,CT0016,1,,,,
DECK_TUTOR_3,CT0093,1,,ภูติจิ๋ว,,
DECK_TUTOR_3,CT0308,1,,นักดนตรีพเนจร,,
DECK_TUTOR_3,CT0227,1,,ผู้ฝึกเหยี่ยว,,
DECK_TUTOR_3,CT0053,1,,อิคารัส บุตรแห่งสายลม,,
DECK_TUTOR_3,CT0106,1,,แฟรี่นำทาง,,
DECK_TUTOR_3,CT0093,1,,ภูติจิ๋ว,,
DECK_TUTOR_3,CT0003,1,,โจรแห่งตรอกลับ,,
DECK_TUTOR_3,CT0180,1,,ฟูกะ พายุคลั่ง,,
DECK_TUTOR_3,CT0179,1,,เบวิน พลซุ่มโจมตี,,
DECK_TUTOR_3,CT0339,1,,เมอร์บีสท์หัวขโมย,,
DECK_TUTOR_3,CT0270,1,,ทาร์รากอน ผู้ปกครองเหล่าไวเวิร์น,,
DECK_TUTOR_3,CT0129,1,,นักรบสิงโต,,
DECK_TUTOR_3,CT0011,1,,นินจาจันทราเลือด,,
DECK_TUTOR_3,CT0179,1,,เบวิน พลซุ่มโจมตี,,
DECK_TUTOR_3,CT0215,1,,ดีดี มังกรจักรกลมาเกีย,,
DECK_TUTOR_3,CT0229,1,,ลิงวายุ,,
DECK_TUTOR_3,CT0220,1,,นักสู้แห่งท้องนภา,,
DECK_TUTOR_3,CT0140,1,,เอลฟ์นักดาบ,,
DECK_TUTOR_3,CT0083,1,,จิตวิญญาณแห่งวายุ,,
DECK_TUTOR_3,CT0220,1,,นักสู้แห่งท้องนภา,,
DECK_TUTOR_3,CT0011,1,,นินจาจันทราเลือด,,
DECK_TUTOR_3,CT0106,1,,แฟรี่นำทาง,,
DECK_TUTOR_3,CT0330,1,,กริมม์ นักฆ่าวิกลจริต,,
DECK_TUTOR_3,CT0221,1,,นกฮูกช่างกล,,
DECK_TUTOR_3,CT0140,1,,เอลฟ์นักดาบ,,
DECK_TUTOR_3,CT0270,1,,ทาร์รากอน ผู้ปกครองเหล่าไวเวิร์น,,
DECK_TUTOR_3,CT0180,1,,,,
DECK_TUTOR_3,CT0015,1,,,,
DECK_TUTOR_3,CT0003,1,,,,
DECK_TUTOR_3,CT0270,1,,,,
DECK_TUTOR_3,CT0229,1,,,,
DECK_TUTOR_3,CT0129,1,,,,
DECK_TUTOR_3,CT0140,1,,,,
DECK_TUTOR_3,CT0079,1,,,,
DECK_TUTOR_3,CT0221,1,,,,
DECK_TUTOR_3,CT0220,1,,,,
DECK_TUTOR_3,CT0079,1,,,,
DECK_TUTOR_3,CT0083,1,,,,
DECK_TUTOR_3,CT0083,1,,,,
DECK_TUTOR_3,CT0003,1,,,,
DECK_TUTOR_AI_1,CT0088,1,,,,
DECK_TUTOR_AI_1,CT0030,1,,,,
DECK_TUTOR_AI_1,CT0114,1,,,,
DECK_TUTOR_AI_1,CT0001,1,,,,
DECK_TUTOR_AI_1,CT0001,1,,,,
DECK_TUTOR_AI_1,CT0001,1,,,,
DECK_TUTOR_AI_1,CT0001,1,,,,
DECK_TUTOR_AI_1,CT0001,1,,,,
DECK_TUTOR_AI_1,CT0001,1,,,,
DECK_TUTOR_AI_1,CT0001,1,,,,
DECK_TUTOR_AI_1,CT0001,1,,,,
DECK_TUTOR_AI_1,CT0001,1,,,,
DECK_TUTOR_AI_1,CT0001,1,,,,
DECK_TUTOR_AI_1,CT0001,1,,,,
DECK_TUTOR_AI_1,CT0001,1,,,,
DECK_TUTOR_AI_1,CT0001,1,,,,
DECK_TUTOR_AI_1,CT0001,1,,,,
DECK_TUTOR_AI_1,CT0001,1,,,,
DECK_TUTOR_AI_1,CT0001,1,,,,
DECK_TUTOR_AI_1,CT0001,1,,,,
DECK_TUTOR_AI_1,CT0001,1,,,,
DECK_TUTOR_AI_1,CT0001,1,,,,
DECK_TUTOR_AI_1,CT0001,1,,,,
DECK_TUTOR_AI_1,CT0001,1,,,,
DECK_TUTOR_AI_1,CT0001,1,,,,
DECK_TUTOR_AI_1,CT0001,1,,,,
DECK_TUTOR_AI_1,CT0001,1,,,,
DECK_TUTOR_AI_1,CT0001,1,,,,
DECK_TUTOR_AI_1,CT0001,1,,,,
DECK_TUTOR_AI_1,CT0001,1,,,,
DECK_TUTOR_AI_1,CT0001,1,,,,
DECK_TUTOR_AI_1,CT0001,1,,,,
DECK_TUTOR_AI_1,CT0001,1,,,,
DECK_TUTOR_AI_1,CT0001,1,,,,
DECK_TUTOR_AI_1,CT0001,1,,,,
DECK_TUTOR_AI_1,CT0001,1,,,,
DECK_TUTOR_AI_1,CT0001,1,,,,
DECK_TUTOR_AI_1,CT0001,1,,,,
DECK_TUTOR_AI_1,CT0001,1,,,,
DECK_TUTOR_AI_1,CT0001,1,,,,
DECK_TUTOR_AI_2,CT0021,1,,,,
DECK_TUTOR_AI_2,CT0021,1,,,,
DECK_TUTOR_AI_2,CT0120,1,,,,
DECK_TUTOR_AI_2,CT0073,1,,,,
DECK_TUTOR_AI_2,CT0131,1,,,,
DECK_TUTOR_AI_2,CT0041,1,,,,
DECK_TUTOR_AI_2,CT0120,1,,,,
DECK_TUTOR_AI_2,CT0120,1,,,,
DECK_TUTOR_AI_2,CT0120,1,,,,
DECK_TUTOR_AI_2,CT0001,1,,,,
DECK_TUTOR_AI_2,CT0021,1,,,,
DECK_TUTOR_AI_2,CT0021,1,,,,
DECK_TUTOR_AI_2,CT0120,1,,,,
DECK_TUTOR_AI_2,CT0073,1,,,,
DECK_TUTOR_AI_2,CT0131,1,,,,
DECK_TUTOR_AI_2,CT0041,1,,,,
DECK_TUTOR_AI_2,CT0120,1,,,,
DECK_TUTOR_AI_2,CT0120,1,,,,
DECK_TUTOR_AI_2,CT0120,1,,,,
DECK_TUTOR_AI_2,CT0001,1,,,,
DECK_TUTOR_AI_2,CT0021,1,,,,
DECK_TUTOR_AI_2,CT0021,1,,,,
DECK_TUTOR_AI_2,CT0120,1,,,,
DECK_TUTOR_AI_2,CT0073,1,,,,
DECK_TUTOR_AI_2,CT0131,1,,,,
DECK_TUTOR_AI_2,CT0041,1,,,,
DECK_TUTOR_AI_2,CT0120,1,,,,
DECK_TUTOR_AI_2,CT0120,1,,,,
DECK_TUTOR_AI_2,CT0120,1,,,,
DECK_TUTOR_AI_2,CT0001,1,,,,
DECK_TUTOR_AI_2,CT0021,1,,,,
DECK_TUTOR_AI_2,CT0021,1,,,,
DECK_TUTOR_AI_2,CT0120,1,,,,
DECK_TUTOR_AI_2,CT0073,1,,,,
DECK_TUTOR_AI_2,CT0131,1,,,,
DECK_TUTOR_AI_2,CT0041,1,,,,
DECK_TUTOR_AI_2,CT0120,1,,,,
DECK_TUTOR_AI_2,CT0120,1,,,,
DECK_TUTOR_AI_2,CT0120,1,,,,
DECK_TUTOR_AI_2,CT0001,1,,,,
DECK_TUTOR_AI_3,CT0002,1,,,,
DECK_TUTOR_AI_3,CT0136,1,,,,
DECK_TUTOR_AI_3,CT0114,1,,,,
DECK_TUTOR_AI_3,CT0030,1,,,,
DECK_TUTOR_AI_3,CT0004,1,,,,
DECK_TUTOR_AI_3,CT0001,1,,,,
DECK_TUTOR_AI_3,CT0016,1,,,,
DECK_TUTOR_AI_3,CT0112,1,,,,
DECK_TUTOR_AI_3,CT0004,1,,,,
DECK_TUTOR_AI_3,CT0087,1,,,,
DECK_TUTOR_AI_3,CT0001,1,,,,
DECK_TUTOR_AI_3,CT0088,1,,,,
DECK_TUTOR_AI_3,CT0112,1,,,,
DECK_TUTOR_AI_3,CT0027,1,,,,
DECK_TUTOR_AI_3,CT0004,1,,,,
DECK_TUTOR_AI_3,CT0035,1,,,,
DECK_TUTOR_AI_3,CT0092,1,,,,
DECK_TUTOR_AI_3,CT0027,1,,,,
DECK_TUTOR_AI_3,CT0088,1,,,,
DECK_TUTOR_AI_3,CT0112,1,,,,
DECK_TUTOR_AI_3,CT0088,1,,,,
DECK_TUTOR_AI_3,CT0034,1,,,,
DECK_TUTOR_AI_3,CT0088,1,,,,
DECK_TUTOR_AI_3,CT0016,1,,,,
DECK_TUTOR_AI_3,CT0087,1,,,,
DECK_TUTOR_AI_3,CT0034,1,,,,
DECK_TUTOR_AI_3,CT0035,1,,,,
DECK_TUTOR_AI_3,CT0001,1,,,,
DECK_TUTOR_AI_3,CT0027,1,,,,
DECK_TUTOR_AI_3,CT0092,1,,,,
DECK_TUTOR_AI_3,CT0004,1,,,,
DECK_TUTOR_AI_3,CT0035,1,,,,
DECK_TUTOR_AI_3,CT0092,1,,,,
DECK_TUTOR_AI_3,CT0027,1,,,,
DECK_TUTOR_AI_3,CT0088,1,,,,
DECK_TUTOR_AI_3,CT0112,1,,,,
DECK_TUTOR_AI_3,CT0088,1,,,,
DECK_TUTOR_AI_3,CT0034,1,,,,
DECK_TUTOR_AI_3,CT0088,1,,,,
DECK_TUTOR_AI_3,CT0016,1,,,,
DECK_TUTOR_1_NEW,CT0570,1,,,,
DECK_TUTOR_1_NEW,CT0572,1,,,,
DECK_TUTOR_1_NEW,CT0574,1,,,,
DECK_TUTOR_1_NEW,CT0576,1,,,,
DECK_TUTOR_1_NEW,CT0623,1,,,,
DECK_TUTOR_1_NEW,CT0577,1,,,,
DECK_TUTOR_1_NEW,CT0576,1,,,,
DECK_TUTOR_1_NEW,CT0577,1,,,,
DECK_TUTOR_1_NEW,CT0623,1,,,,
DECK_TUTOR_1_NEW,CT0576,1,,,,
DECK_TUTOR_1_NEW,CT0577,1,,,,
DECK_TUTOR_1_NEW,CT0623,1,,,,
DECK_TUTOR_1_NEW,CT0576,1,,,,
DECK_TUTOR_1_NEW,CT0577,1,,,,
DECK_TUTOR_1_NEW,CT0623,1,,,,
DECK_TUTOR_1_NEW,CT0576,1,,,,
DECK_TUTOR_1_NEW,CT0577,1,,,,
DECK_TUTOR_1_NEW,CT0623,1,,,,
DECK_TUTOR_1_NEW,CT0576,1,,,,
DECK_TUTOR_1_NEW,CT0577,1,,,,
DECK_TUTOR_1_NEW,CT0623,1,,,,
DECK_TUTOR_1_NEW,CT0576,1,,,,
DECK_TUTOR_1_NEW,CT0577,1,,,,
DECK_TUTOR_1_NEW,CT0623,1,,,,
DECK_TUTOR_1_NEW,CT0001,1,,,,
DECK_TUTOR_1_NEW,CT0001,1,,,,
DECK_TUTOR_1_NEW,CT0001,1,,,,
DECK_TUTOR_1_NEW,CT0001,1,,,,
DECK_TUTOR_1_NEW,CT0001,1,,,,
DECK_TUTOR_1_NEW,CT0001,1,,,,
DECK_TUTOR_1_NEW,CT0001,1,,,,
DECK_TUTOR_1_NEW,CT0001,1,,,,
DECK_TUTOR_1_NEW,CT0001,1,,,,
DECK_TUTOR_1_NEW,CT0001,1,,,,
DECK_TUTOR_1_NEW,CT0001,1,,,,
DECK_TUTOR_1_NEW,CT0001,1,,,,
DECK_TUTOR_1_NEW,CT0001,1,,,,
DECK_TUTOR_1_NEW,CT0001,1,,,,
DECK_TUTOR_1_NEW,CT0001,1,,,,
DECK_TUTOR_1_NEW,CT0001,1,,,,
DECK_TUTOR_2_NEW,CT0580,1,,,,
DECK_TUTOR_2_NEW,CT0582,1,,,,
DECK_TUTOR_2_NEW,CT0625,1,,,,
DECK_TUTOR_2_NEW,CT0584,1,,,,
DECK_TUTOR_2_NEW,CT0585,1,,,,
DECK_TUTOR_2_NEW,CT0591,1,,,,
DECK_TUTOR_2_NEW,CT0589,1,,,,
DECK_TUTOR_2_NEW,CT0589,1,,,,
DECK_TUTOR_2_NEW,CT0585,1,,,,
DECK_TUTOR_2_NEW,CT0591,1,,,,
DECK_TUTOR_2_NEW,CT0589,1,,,,
DECK_TUTOR_2_NEW,CT0585,1,,,,
DECK_TUTOR_2_NEW,CT0591,1,,,,
DECK_TUTOR_2_NEW,CT0589,1,,,,
DECK_TUTOR_2_NEW,CT0585,1,,,,
DECK_TUTOR_2_NEW,CT0591,1,,,,
DECK_TUTOR_2_NEW,CT0589,1,,,,
DECK_TUTOR_2_NEW,CT0585,1,,,,
DECK_TUTOR_2_NEW,CT0591,1,,,,
DECK_TUTOR_2_NEW,CT0589,1,,,,
DECK_TUTOR_2_NEW,CT0585,1,,,,
DECK_TUTOR_2_NEW,CT0001,1,,,,
DECK_TUTOR_2_NEW,CT0001,1,,,,
DECK_TUTOR_2_NEW,CT0001,1,,,,
DECK_TUTOR_2_NEW,CT0001,1,,,,
DECK_TUTOR_2_NEW,CT0001,1,,,,
DECK_TUTOR_2_NEW,CT0001,1,,,,
DECK_TUTOR_2_NEW,CT0001,1,,,,
DECK_TUTOR_2_NEW,CT0001,1,,,,
DECK_TUTOR_2_NEW,CT0001,1,,,,
DECK_TUTOR_2_NEW,CT0001,1,,,,
DECK_TUTOR_2_NEW,CT0001,1,,,,
DECK_TUTOR_2_NEW,CT0001,1,,,,
DECK_TUTOR_2_NEW,CT0001,1,,,,
DECK_TUTOR_2_NEW,CT0001,1,,,,
DECK_TUTOR_2_NEW,CT0001,1,,,,
DECK_TUTOR_2_NEW,CT0001,1,,,,
DECK_TUTOR_2_NEW,CT0001,1,,,,
DECK_TUTOR_2_NEW,CT0001,1,,,,
DECK_TUTOR_2_NEW,CT0001,1,,,,
DECK_TUTOR_3_NEW,CT0597,1,,,,
DECK_TUTOR_3_NEW,CT0600,1,,,,
DECK_TUTOR_3_NEW,CT0599,1,,,,
DECK_TUTOR_3_NEW,CT0602,1,,,,
DECK_TUTOR_3_NEW,CT0618,1,,,,
DECK_TUTOR_3_NEW,CT0629,1,,,,
DECK_TUTOR_3_NEW,CT0631,1,,,,
DECK_TUTOR_3_NEW,CT0599,1,,,,
DECK_TUTOR_3_NEW,CT0629,1,,,,
DECK_TUTOR_3_NEW,CT0618,1,,,,
DECK_TUTOR_3_NEW,CT0630,1,,,,
DECK_TUTOR_3_NEW,CT0600,1,,,,
DECK_TUTOR_3_NEW,CT0602,1,,,,
DECK_TUTOR_3_NEW,CT0632,1,,,,
DECK_TUTOR_3_NEW,CT0597,1,,,,
DECK_TUTOR_3_NEW,CT0631,1,,,,
DECK_TUTOR_3_NEW,CT0599,1,,,,
DECK_TUTOR_3_NEW,CT0629,1,,,,
DECK_TUTOR_3_NEW,CT0597,1,,,,
DECK_TUTOR_3_NEW,CT0630,1,,,,
DECK_TUTOR_3_NEW,CT0632,1,,,,
DECK_TUTOR_3_NEW,CT0631,1,,,,
DECK_TUTOR_3_NEW,CT0602,1,,,,
DECK_TUTOR_3_NEW,CT0630,1,,,,
DECK_TUTOR_3_NEW,CT0629,1,,,,
DECK_TUTOR_3_NEW,CT0602,1,,,,
DECK_TUTOR_3_NEW,CT0600,1,,,,
DECK_TUTOR_3_NEW,CT0618,1,,,,
DECK_TUTOR_3_NEW,CT0600,1,,,,
DECK_TUTOR_3_NEW,CT0597,1,,,,
DECK_TUTOR_3_NEW,CT0600,1,,,,
DECK_TUTOR_3_NEW,CT0599,1,,,,
DECK_TUTOR_3_NEW,CT0602,1,,,,
DECK_TUTOR_3_NEW,CT0618,1,,,,
DECK_TUTOR_3_NEW,CT0629,1,,,,
DECK_TUTOR_3_NEW,CT0631,1,,,,
DECK_TUTOR_3_NEW,CT0599,1,,,,
DECK_TUTOR_3_NEW,CT0629,1,,,,
DECK_TUTOR_3_NEW,CT0618,1,,,,
DECK_TUTOR_3_NEW,CT0630,1,,,,
DECK_TUTOR_4_NEW,CT0629,1,,,,
DECK_TUTOR_4_NEW,CT0637,1,,,,
DECK_TUTOR_4_NEW,CT0638,1,,,,
DECK_TUTOR_4_NEW,CT0636,1,,,,
DECK_TUTOR_4_NEW,CT0639,1,,,,
DECK_TUTOR_4_NEW,CT0640,1,,,,
DECK_TUTOR_4_NEW,CT0617,1,,,,
DECK_TUTOR_4_NEW,CT0641,1,,,,
DECK_TUTOR_4_NEW,CT0629,1,,,,
DECK_TUTOR_4_NEW,CT0638,1,,,,
DECK_TUTOR_4_NEW,CT0597,1,,,,
DECK_TUTOR_4_NEW,CT0642,1,,,,
DECK_TUTOR_4_NEW,CT0618,1,,,,
DECK_TUTOR_4_NEW,CT0600,1,,,,
DECK_TUTOR_4_NEW,CT0637,1,,,,
DECK_TUTOR_4_NEW,CT0614,1,,,,
DECK_TUTOR_4_NEW,CT0618,1,,,,
DECK_TUTOR_4_NEW,CT0602,1,,,,
DECK_TUTOR_4_NEW,CT0642,1,,,,
DECK_TUTOR_4_NEW,CT0636,1,,,,
DECK_TUTOR_4_NEW,CT0643,1,,,,
DECK_TUTOR_4_NEW,CT0617,1,,,,
DECK_TUTOR_4_NEW,CT0639,1,,,,
DECK_TUTOR_4_NEW,CT0614,1,,,,
DECK_TUTOR_4_NEW,CT0642,1,,,,
DECK_TUTOR_4_NEW,CT0602,1,,,,
DECK_TUTOR_4_NEW,CT0636,1,,,,
DECK_TUTOR_4_NEW,CT0639,1,,,,
DECK_TUTOR_4_NEW,CT0597,1,,,,
DECK_TUTOR_4_NEW,CT0614,1,,,,
DECK_TUTOR_4_NEW,CT0639,1,,,,
DECK_TUTOR_4_NEW,CT0640,1,,,,
DECK_TUTOR_4_NEW,CT0617,1,,,,
DECK_TUTOR_4_NEW,CT0641,1,,,,
DECK_TUTOR_4_NEW,CT0629,1,,,,
DECK_TUTOR_4_NEW,CT0638,1,,,,
DECK_TUTOR_4_NEW,CT0597,1,,,,
DECK_TUTOR_4_NEW,CT0642,1,,,,
DECK_TUTOR_4_NEW,CT0618,1,,,,
DECK_TUTOR_4_NEW,CT0600,1,,,,
DECK_TUTOR_AI_1_NEW,CT0569,1,,,,
DECK_TUTOR_AI_1_NEW,CT0571,1,,,,
DECK_TUTOR_AI_1_NEW,CT0573,1,,,,
DECK_TUTOR_AI_1_NEW,CT0575,1,,,,
DECK_TUTOR_AI_1_NEW,CT0578,1,,,,
DECK_TUTOR_AI_1_NEW,CT0571,1,,,,
DECK_TUTOR_AI_1_NEW,CT0578,1,,,,
DECK_TUTOR_AI_1_NEW,CT0573,1,,,,
DECK_TUTOR_AI_1_NEW,CT0575,1,,,,
DECK_TUTOR_AI_1_NEW,CT0578,1,,,,
DECK_TUTOR_AI_1_NEW,CT0573,1,,,,
DECK_TUTOR_AI_1_NEW,CT0578,1,,,,
DECK_TUTOR_AI_1_NEW,CT0573,1,,,,
DECK_TUTOR_AI_1_NEW,CT0578,1,,,,
DECK_TUTOR_AI_1_NEW,CT0573,1,,,,
DECK_TUTOR_AI_1_NEW,CT0578,1,,,,
DECK_TUTOR_AI_1_NEW,CT0573,1,,,,
DECK_TUTOR_AI_1_NEW,CT0578,1,,,,
DECK_TUTOR_AI_1_NEW,CT0573,1,,,,
DECK_TUTOR_AI_1_NEW,CT0578,1,,,,
DECK_TUTOR_AI_1_NEW,CT0573,1,,,,
DECK_TUTOR_AI_1_NEW,CT0578,1,,,,
DECK_TUTOR_AI_1_NEW,CT0573,1,,,,
DECK_TUTOR_AI_2_NEW,CT0579,1,,,,
DECK_TUTOR_AI_2_NEW,CT0581,1,,,,
DECK_TUTOR_AI_2_NEW,CT0583,1,,,,
DECK_TUTOR_AI_2_NEW,CT0581,1,,,,
DECK_TUTOR_AI_2_NEW,CT0586,1,,,,
DECK_TUTOR_AI_2_NEW,CT0587,1,,,,
DECK_TUTOR_AI_2_NEW,CT0586,1,,,,
DECK_TUTOR_AI_2_NEW,CT0588,1,,,,
DECK_TUTOR_AI_2_NEW,CT0590,1,,,,
DECK_TUTOR_AI_2_NEW,CT0586,1,,,,
DECK_TUTOR_AI_2_NEW,CT0592,1,,,,
DECK_TUTOR_AI_2_NEW,CT0590,1,,,,
DECK_TUTOR_AI_2_NEW,CT0586,1,,,,
DECK_TUTOR_AI_2_NEW,CT0592,1,,,,
DECK_TUTOR_AI_2_NEW,CT0590,1,,,,
DECK_TUTOR_AI_2_NEW,CT0586,1,,,,
DECK_TUTOR_AI_2_NEW,CT0592,1,,,,
DECK_TUTOR_AI_2_NEW,CT0590,1,,,,
DECK_TUTOR_AI_2_NEW,CT0586,1,,,,
DECK_TUTOR_AI_2_NEW,CT0592,1,,,,
DECK_TUTOR_AI_2_NEW,CT0590,1,,,,
DECK_TUTOR_AI_2_NEW,CT0001,1,,,,
DECK_TUTOR_AI_2_NEW,CT0001,1,,,,
DECK_TUTOR_AI_2_NEW,CT0001,1,,,,
DECK_TUTOR_AI_2_NEW,CT0001,1,,,,
DECK_TUTOR_AI_2_NEW,CT0001,1,,,,
DECK_TUTOR_AI_2_NEW,CT0001,1,,,,
DECK_TUTOR_AI_2_NEW,CT0001,1,,,,
DECK_TUTOR_AI_2_NEW,CT0001,1,,,,
DECK_TUTOR_AI_2_NEW,CT0001,1,,,,
DECK_TUTOR_AI_2_NEW,CT0001,1,,,,
DECK_TUTOR_AI_2_NEW,CT0001,1,,,,
DECK_TUTOR_AI_2_NEW,CT0001,1,,,,
DECK_TUTOR_AI_2_NEW,CT0001,1,,,,
DECK_TUTOR_AI_2_NEW,CT0001,1,,,,
DECK_TUTOR_AI_2_NEW,CT0001,1,,,,
DECK_TUTOR_AI_2_NEW,CT0001,1,,,,
DECK_TUTOR_AI_2_NEW,CT0001,1,,,,
DECK_TUTOR_AI_2_NEW,CT0001,1,,,,
DECK_TUTOR_AI_2_NEW,CT0001,1,,,,
DECK_TUTOR_AI_3_NEW,CT0626,1,,,,
DECK_TUTOR_AI_3_NEW,CT0626,1,,,,
DECK_TUTOR_AI_3_NEW,CT0598,1,,,,
DECK_TUTOR_AI_3_NEW,CT0593,1,,,,
DECK_TUTOR_AI_3_NEW,CT0595,1,,,,
DECK_TUTOR_AI_3_NEW,CT0626,1,,,,
DECK_TUTOR_AI_3_NEW,CT0601,1,,,,
DECK_TUTOR_AI_3_NEW,CT0594,1,,,,
DECK_TUTOR_AI_3_NEW,CT0596,1,,,,
DECK_TUTOR_AI_3_NEW,CT0628,1,,,,
DECK_TUTOR_AI_3_NEW,CT0594,1,,,,
DECK_TUTOR_AI_3_NEW,CT0633,1,,,,
DECK_TUTOR_AI_3_NEW,CT0628,1,,,,
DECK_TUTOR_AI_3_NEW,CT0635,1,,,,
DECK_TUTOR_AI_3_NEW,CT0634,1,,,,
DECK_TUTOR_AI_3_NEW,CT0598,1,,,,
DECK_TUTOR_AI_3_NEW,CT0595,1,,,,
DECK_TUTOR_AI_3_NEW,CT0593,1,,,,
DECK_TUTOR_AI_3_NEW,CT0598,1,,,,
DECK_TUTOR_AI_3_NEW,CT0628,1,,,,
DECK_TUTOR_AI_3_NEW,CT0594,1,,,,
DECK_TUTOR_AI_3_NEW,CT0593,1,,,,
DECK_TUTOR_AI_3_NEW,CT0596,1,,,,
DECK_TUTOR_AI_3_NEW,CT0634,1,,,,
DECK_TUTOR_AI_3_NEW,CT0626,1,,,,
DECK_TUTOR_AI_3_NEW,CT0626,1,,,,
DECK_TUTOR_AI_3_NEW,CT0598,1,,,,
DECK_TUTOR_AI_3_NEW,CT0593,1,,,,
DECK_TUTOR_AI_3_NEW,CT0595,1,,,,
DECK_TUTOR_AI_3_NEW,CT0626,1,,,,
DECK_TUTOR_AI_3_NEW,CT0601,1,,,,
DECK_TUTOR_AI_3_NEW,CT0594,1,,,,
DECK_TUTOR_AI_3_NEW,CT0596,1,,,,
DECK_TUTOR_AI_3_NEW,CT0628,1,,,,
DECK_TUTOR_AI_3_NEW,CT0594,1,,,,
DECK_TUTOR_AI_3_NEW,CT0633,1,,,,
DECK_TUTOR_AI_3_NEW,CT0628,1,,,,
DECK_TUTOR_AI_3_NEW,CT0634,1,,,,
DECK_TUTOR_AI_3_NEW,CT0635,1,,,,
DECK_TUTOR_AI_3_NEW,CT0598,1,,,,
DECK_TUTOR_AI_4_NEW,CT0610,1,,,,
DECK_TUTOR_AI_4_NEW,CT0603,1,,,,
DECK_TUTOR_AI_4_NEW,CT0611,1,,,,
DECK_TUTOR_AI_4_NEW,CT0612,1,,,,
DECK_TUTOR_AI_4_NEW,CT0647,1,,,,
DECK_TUTOR_AI_4_NEW,CT0649,1,,,,
DECK_TUTOR_AI_4_NEW,CT0605,1,,,,
DECK_TUTOR_AI_4_NEW,CT0651,1,,,,
DECK_TUTOR_AI_4_NEW,CT0652,1,,,,
DECK_TUTOR_AI_4_NEW,CT0604,1,,,,
DECK_TUTOR_AI_4_NEW,CT0605,1,,,,
DECK_TUTOR_AI_4_NEW,CT0612,1,,,,
DECK_TUTOR_AI_4_NEW,CT0653,1,,,,
DECK_TUTOR_AI_4_NEW,CT0610,1,,,,
DECK_TUTOR_AI_4_NEW,CT0603,1,,,,
DECK_TUTOR_AI_4_NEW,CT0651,1,,,,
DECK_TUTOR_AI_4_NEW,CT0654,1,,,,
DECK_TUTOR_AI_4_NEW,CT0655,1,,,,
DECK_TUTOR_AI_4_NEW,CT0649,1,,,,
DECK_TUTOR_AI_4_NEW,CT0611,1,,,,
DECK_TUTOR_AI_4_NEW,CT0656,1,,,,
DECK_TUTOR_AI_4_NEW,CT0612,1,,,,
DECK_TUTOR_AI_4_NEW,CT0657,1,,,,
DECK_TUTOR_AI_4_NEW,CT0654,1,,,,
DECK_TUTOR_AI_4_NEW,CT0604,1,,,,
DECK_TUTOR_AI_4_NEW,CT0647,1,,,,
DECK_TUTOR_AI_4_NEW,CT0652,1,,,,
DECK_TUTOR_AI_4_NEW,CT0653,1,,,,
DECK_TUTOR_AI_4_NEW,CT0656,1,,,,
DECK_TUTOR_AI_4_NEW,CT0654,1,,,,
DECK_TUTOR_AI_4_NEW,CT0610,1,,,,
DECK_TUTOR_AI_4_NEW,CT0603,1,,,,
DECK_TUTOR_AI_4_NEW,CT0611,1,,,,
DECK_TUTOR_AI_4_NEW,CT0612,1,,,,
DECK_TUTOR_AI_4_NEW,CT0647,1,,,,
DECK_TUTOR_AI_4_NEW,CT0649,1,,,,
DECK_TUTOR_AI_4_NEW,CT0605,1,,,,
DECK_TUTOR_AI_4_NEW,CT0651,1,,,,
DECK_TUTOR_AI_4_NEW,CT0652,1,,,,
DECK_TUTOR_AI_4_NEW,CT0604,1,,,,