[
  {
    "TableId": "TABLE_STAR_CUBE_COMMON_TIER_1",
    "Nodes": [
      {
        "ResultItemType": "ItemId",
        "ResultItem": "AV0062",
        "Weight": 1
      },
      {
        "ResultItemType": "ItemId",
        "ResultItem": "AV0063",
        "Weight": 1
      },
      {
        "ResultItemType": "ItemId",
        "ResultItem": "AV0064",
        "Weight": 1
      },
      {
        "ResultItemType": "ItemId",
        "ResultItem": "AV0058",
        "Weight": 1
      },
      {
        "ResultItemType": "ItemId",
        "ResultItem": "AV0059",
        "Weight": 1
      },
      {
        "ResultItemType": "ItemId",
        "ResultItem": "AV0060",
        "Weight": 1
      },
      {
        "ResultItemType": "ItemId",
        "ResultItem": "AV0049",
        "Weight": 1
      },
      {
        "ResultItemType": "TableId",
        "ResultItem": "TABLE_STAR_SIGN_TIER_1",
        "Weight": 9
      }
    ]
  },
  {
    "TableId": "TABLE_STAR_CUBE_COMMON_TIER_2",
    "Nodes": [
      {
        "ResultItemType": "ItemId",
        "ResultItem": "AV0062",
        "Weight": 1
      },
      {
        "ResultItemType": "ItemId",
        "ResultItem": "AV0063",
        "Weight": 1
      },
      {
        "ResultItemType": "ItemId",
        "ResultItem": "AV0064",
        "Weight": 1
      },
      {
        "ResultItemType": "ItemId",
        "ResultItem": "AV0058",
        "Weight": 1
      },
      {
        "ResultItemType": "ItemId",
        "ResultItem": "AV0059",
        "Weight": 1
      },
      {
        "ResultItemType": "ItemId",
        "ResultItem": "AV0060",
        "Weight": 1
      },
      {
        "ResultItemType": "ItemId",
        "ResultItem": "AV0049",
        "Weight": 1
      },
      {
        "ResultItemType": "TableId",
        "ResultItem": "TABLE_STAR_SIGN_TIER_2",
        "Weight": 12
      }
    ]
  },
  {
    "TableId": "TABLE_STAR_CUBE_COMMON_TIER_3",
    "Nodes": [
      {
        "ResultItemType": "ItemId",
        "ResultItem": "AV0062",
        "Weight": 1
      },
      {
        "ResultItemType": "ItemId",
        "ResultItem": "AV0063",
        "Weight": 1
      },
      {
        "ResultItemType": "ItemId",
        "ResultItem": "AV0064",
        "Weight": 1
      },
      {
        "ResultItemType": "ItemId",
        "ResultItem": "AV0058",
        "Weight": 1
      },
      {
        "ResultItemType": "ItemId",
        "ResultItem": "AV0059",
        "Weight": 1
      },
      {
        "ResultItemType": "ItemId",
        "ResultItem": "AV0060",
        "Weight": 1
      },
      {
        "ResultItemType": "ItemId",
        "ResultItem": "AV0049",
        "Weight": 1
      },
      {
        "ResultItemType": "TableId",
        "ResultItem": "TABLE_STAR_SIGN_TIER_3",
        "Weight": 15
      }
    ]
  },
  {
    "TableId": "TABLE_STAR_CUBE_EPIC",
    "Nodes": [
      {
        "ResultItemType": "ItemId",
        "ResultItem": "AV0021",
        "Weight": 1
      },
      {
        "ResultItemType": "ItemId",
        "ResultItem": "AV0023",
        "Weight": 1
      },
      {
        "ResultItemType": "ItemId",
        "ResultItem": "AV0024",
        "Weight": 1
      },
      {
        "ResultItemType": "ItemId",
        "ResultItem": "AV0025",
        "Weight": 1
      },
      {
        "ResultItemType": "ItemId",
        "ResultItem": "AV0026",
        "Weight": 1
      },
      {
        "ResultItemType": "ItemId",
        "ResultItem": "AV0027",
        "Weight": 1
      },
      {
        "ResultItemType": "ItemId",
        "ResultItem": "AV0028",
        "Weight": 1
      },
      {
        "ResultItemType": "ItemId",
        "ResultItem": "AV0029",
        "Weight": 1
      },
      {
        "ResultItemType": "ItemId",
        "ResultItem": "AV0032",
        "Weight": 1
      },
      {
        "ResultItemType": "ItemId",
        "ResultItem": "AV0034",
        "Weight": 1
      },
      {
        "ResultItemType": "ItemId",
        "ResultItem": "AV0039",
        "Weight": 1
      },
      {
        "ResultItemType": "ItemId",
        "ResultItem": "AV0042",
        "Weight": 1
      },
      {
        "ResultItemType": "ItemId",
        "ResultItem": "AV0046",
        "Weight": 1
      },
      {
        "ResultItemType": "ItemId",
        "ResultItem": "AV0052",
        "Weight": 1
      },
      {
        "ResultItemType": "ItemId",
        "ResultItem": "HUD0003",
        "Weight": 1
      }
    ]
  },
  {
    "TableId": "TABLE_STAR_CUBE_LEGEND",
    "Nodes": [
      {
        "ResultItemType": "ItemId",
        "ResultItem": "AV0022",
        "Weight": 1
      },
      {
        "ResultItemType": "ItemId",
        "ResultItem": "AV0014",
        "Weight": 1
      },
      {
        "ResultItemType": "ItemId",
        "ResultItem": "AV0015",
        "Weight": 1
      },
      {
        "ResultItemType": "ItemId",
        "ResultItem": "AV0016",
        "Weight": 1
      },
      {
        "ResultItemType": "ItemId",
        "ResultItem": "AV0017",
        "Weight": 1
      },
      {
        "ResultItemType": "ItemId",
        "ResultItem": "AV0018",
        "Weight": 1
      },
      {
        "ResultItemType": "ItemId",
        "ResultItem": "AV0019",
        "Weight": 1
      },
      {
        "ResultItemType": "ItemId",
        "ResultItem": "AV0020",
        "Weight": 1
      },
      {
        "ResultItemType": "ItemId",
        "ResultItem": "HUD0002",
        "Weight": 1
      },
      {
        "ResultItemType": "TableId",
        "ResultItem": "TABLE_STAR_SUPER_SIGN",
        "Weight": 1
      },
      {
        "ResultItemType": "ItemId",
        "ResultItem": "AV0013",
        "Weight": 1
      },
      {
        "ResultItemType": "ItemId",
        "ResultItem": "H0009",
        "Weight": 1
      }
    ]
  },
  {
    "TableId": "TABLE_STAR_CUBE_RARE",
    "Nodes": [
      {
        "ResultItemType": "ItemId",
        "ResultItem": "AV0030",
        "Weight": 1
      },
      {
        "ResultItemType": "ItemId",
        "ResultItem": "AV0031",
        "Weight": 1
      },
      {
        "ResultItemType": "ItemId",
        "ResultItem": "AV0035",
        "Weight": 1
      },
      {
        "ResultItemType": "ItemId",
        "ResultItem": "AV0037",
        "Weight": 1
      },
      {
        "ResultItemType": "ItemId",
        "ResultItem": "AV0038",
        "Weight": 1
      },
      {
        "ResultItemType": "ItemId",
        "ResultItem": "AV0040",
        "Weight": 1
      },
      {
        "ResultItemType": "ItemId",
        "ResultItem": "AV0043",
        "Weight": 1
      },
      {
        "ResultItemType": "ItemId",
        "ResultItem": "AV0044",
        "Weight": 1
      },
      {
        "ResultItemType": "ItemId",
        "ResultItem": "AV0047",
        "Weight": 1
      },
      {
        "ResultItemType": "ItemId",
        "ResultItem": "AV0048",
        "Weight": 1
      },
      {
        "ResultItemType": "ItemId",
        "ResultItem": "AV0054",
        "Weight": 1
      },
      {
        "ResultItemType": "ItemId",
        "ResultItem": "AV0055",
        "Weight": 1
      },
      {
        "ResultItemType": "ItemId",
        "ResultItem": "AV0057",
        "Weight": 1
      },
      {
        "ResultItemType": "ItemId",
        "ResultItem": "AV0061",
        "Weight": 1
      },
      {
        "ResultItemType": "ItemId",
        "ResultItem": "AV0050",
        "Weight": 1
      },
      {
        "ResultItemType": "ItemId",
        "ResultItem": "AV0051",
        "Weight": 1
      },
      {
        "ResultItemType": "ItemId",
        "ResultItem": "AV0053",
        "Weight": 1
      },
      {
        "ResultItemType": "ItemId",
        "ResultItem": "AV0056",
        "Weight": 1
      },
      {
        "ResultItemType": "ItemId",
        "ResultItem": "AV0033",
        "Weight": 1
      },
      {
        "ResultItemType": "ItemId",
        "ResultItem": "AV0036",
        "Weight": 1
      },
      {
        "ResultItemType": "ItemId",
        "ResultItem": "AV0041",
        "Weight": 1
      },
      {
        "ResultItemType": "ItemId",
        "ResultItem": "AV0045",
        "Weight": 1
      }
    ]
  },
  {
    "TableId": "TABLE_STAR_SIGN_TIER_1",
    "Nodes": [
      {
        "ResultItemType": "ItemId",
        "ResultItem": "BUND_STAR_SC_1",
        "Weight": 1
      },
      {
        "ResultItemType": "ItemId",
        "ResultItem": "BUND_STAR_SC_2",
        "Weight": 1
      },
      {
        "ResultItemType": "ItemId",
        "ResultItem": "BUND_STAR_SC_3",
        "Weight": 1
      },
      {
        "ResultItemType": "ItemId",
        "ResultItem": "BUND_STAR_SS_1",
        "Weight": 1
      },
      {
        "ResultItemType": "ItemId",
        "ResultItem": "BUND_STAR_SS_2",
        "Weight": 1
      },
      {
        "ResultItemType": "ItemId",
        "ResultItem": "BUND_STAR_SS_3",
        "Weight": 1
      },
      {
        "ResultItemType": "ItemId",
        "ResultItem": "BUND_STAR_ST_1",
        "Weight": 1
      },
      {
        "ResultItemType": "ItemId",
        "ResultItem": "BUND_STAR_ST_2",
        "Weight": 1
      },
      {
        "ResultItemType": "ItemId",
        "ResultItem": "BUND_STAR_ST_3",
        "Weight": 1
      }
    ]
  },
  {
    "TableId": "TABLE_STAR_SIGN_TIER_2",
    "Nodes": [
      {
        "ResultItemType": "ItemId",
        "ResultItem": "BUND_STAR_SC_1",
        "Weight": 1
      },
      {
        "ResultItemType": "ItemId",
        "ResultItem": "BUND_STAR_SC_2",
        "Weight": 1
      },
      {
        "ResultItemType": "ItemId",
        "ResultItem": "BUND_STAR_SC_3",
        "Weight": 1
      },
      {
        "ResultItemType": "ItemId",
        "ResultItem": "BUND_STAR_SC_4",
        "Weight": 1
      },
      {
        "ResultItemType": "ItemId",
        "ResultItem": "BUND_STAR_SS_1",
        "Weight": 1
      },
      {
        "ResultItemType": "ItemId",
        "ResultItem": "BUND_STAR_SS_2",
        "Weight": 1
      },
      {
        "ResultItemType": "ItemId",
        "ResultItem": "BUND_STAR_SS_3",
        "Weight": 1
      },
      {
        "ResultItemType": "ItemId",
        "ResultItem": "BUND_STAR_SS_4",
        "Weight": 1
      },
      {
        "ResultItemType": "ItemId",
        "ResultItem": "BUND_STAR_ST_1",
        "Weight": 1
      },
      {
        "ResultItemType": "ItemId",
        "ResultItem": "BUND_STAR_ST_2",
        "Weight": 1
      },
      {
        "ResultItemType": "ItemId",
        "ResultItem": "BUND_STAR_ST_3",
        "Weight": 1
      },
      {
        "ResultItemType": "ItemId",
        "ResultItem": "BUND_STAR_ST_4",
        "Weight": 1
      }
    ]
  },
  {
    "TableId": "TABLE_STAR_SIGN_TIER_3",
    "Nodes": [
      {
        "ResultItemType": "ItemId",
        "ResultItem": "BUND_STAR_SC_1",
        "Weight": 1
      },
      {
        "ResultItemType": "ItemId",
        "ResultItem": "BUND_STAR_SC_2",
        "Weight": 1
      },
      {
        "ResultItemType": "ItemId",
        "ResultItem": "BUND_STAR_SC_3",
        "Weight": 1
      },
      {
        "ResultItemType": "ItemId",
        "ResultItem": "BUND_STAR_SC_4",
        "Weight": 1
      },
      {
        "ResultItemType": "ItemId",
        "ResultItem": "BUND_STAR_SC_5",
        "Weight": 1
      },
      {
        "ResultItemType": "ItemId",
        "ResultItem": "BUND_STAR_SS_1",
        "Weight": 1
      },
      {
        "ResultItemType": "ItemId",
        "ResultItem": "BUND_STAR_SS_2",
        "Weight": 1
      },
      {
        "ResultItemType": "ItemId",
        "ResultItem": "BUND_STAR_SS_3",
        "Weight": 1
      },
      {
        "ResultItemType": "ItemId",
        "ResultItem": "BUND_STAR_SS_4",
        "Weight": 1
      },
      {
        "ResultItemType": "ItemId",
        "ResultItem": "BUND_STAR_SS_5",
        "Weight": 1
      },
      {
        "ResultItemType": "ItemId",
        "ResultItem": "BUND_STAR_ST_1",
        "Weight": 1
      },
      {
        "ResultItemType": "ItemId",
        "ResultItem": "BUND_STAR_ST_2",
        "Weight": 1
      },
      {
        "ResultItemType": "ItemId",
        "ResultItem": "BUND_STAR_ST_3",
        "Weight": 1
      },
      {
        "ResultItemType": "ItemId",
        "ResultItem": "BUND_STAR_ST_4",
        "Weight": 1
      },
      {
        "ResultItemType": "ItemId",
        "ResultItem": "BUND_STAR_ST_5",
        "Weight": 1
      }
    ]
  },
  {
    "TableId": "TABLE_STAR_SUPER_SIGN",
    "Nodes": [
      {
        "ResultItemType": "ItemId",
        "ResultItem": "BUND_STAR_S1_1",
        "Weight": 1
      }
    ]
  },
  {
    "TableId": "TABLE_WOE_C5",
    "Nodes": [
      {
        "ResultItemType": "TableId",
        "ResultItem": "TABLE_WOE_COMMON_CARD",
        "Weight": 6780
      },
      {
        "ResultItemType": "TableId",
        "ResultItem": "TABLE_WOE_EPIC_CARD",
        "Weight": 405
      },
      {
        "ResultItemType": "TableId",
        "ResultItem": "TABLE_WOE_RARE_CARD",
        "Weight": 2210
      },
      {
        "ResultItemType": "TableId",
        "ResultItem": "TABLE_WOE_EPIC_HERO",
        "Weight": 10
      },
      {
        "ResultItemType": "TableId",
        "ResultItem": "TABLE_WOE_LEGEND_CARD",
        "Weight": 120
      },
      {
        "ResultItemType": "TableId",
        "ResultItem": "TABLE_WOE_COMMON_CARD_FOIL",
        "Weight": 150
      },
      {
        "ResultItemType": "TableId",
        "ResultItem": "TABLE_WOE_EPIC_CARD_FOIL",
        "Weight": 25
      },
      {
        "ResultItemType": "TableId",
        "ResultItem": "TABLE_WOE_LEGEND_CARD_FOIL",
        "Weight": 10
      },
      {
        "ResultItemType": "TableId",
        "ResultItem": "TABLE_WOE_RARE_CARD_FOIL",
        "Weight": 130
      }
    ]
  },
  {
    "TableId": "TABLE_WOE_C6",
    "Nodes": [
      {
        "ResultItemType": "TableId",
        "ResultItem": "TABLE_WOE_EPIC_CARD",
        "Weight": 405
      },
      {
        "ResultItemType": "TableId",
        "ResultItem": "TABLE_WOE_EPIC_HERO",
        "Weight": 10
      },
      {
        "ResultItemType": "TableId",
        "ResultItem": "TABLE_WOE_LEGEND_CARD",
        "Weight": 120
      },
      {
        "ResultItemType": "TableId",
        "ResultItem": "TABLE_WOE_RARE_CARD",
        "Weight": 9270
      },
      {
        "ResultItemType": "TableId",
        "ResultItem": "TABLE_WOE_EPIC_CARD_FOIL",
        "Weight": 25
      },
      {
        "ResultItemType": "TableId",
        "ResultItem": "TABLE_WOE_LEGEND_CARD_FOIL",
        "Weight": 10
      },
      {
        "ResultItemType": "TableId",
        "ResultItem": "TABLE_WOE_RARE_CARD_FOIL",
        "Weight": 130
      }
    ]
  },
  {
    "TableId": "TABLE_WOE_C7",
    "Nodes": [
      {
        "ResultItemType": "TableId",
        "ResultItem": "TABLE_WOE_EPIC_CARD",
        "Weight": 9830
      },
      {
        "ResultItemType": "TableId",
        "ResultItem": "TABLE_WOE_LEGEND_CARD",
        "Weight": 120
      },
      {
        "ResultItemType": "TableId",
        "ResultItem": "TABLE_WOE_EPIC_HERO",
        "Weight": 10
      },
      {
        "ResultItemType": "TableId",
        "ResultItem": "TABLE_WOE_EPIC_CARD_FOIL",
        "Weight": 25
      },
      {
        "ResultItemType": "TableId",
        "ResultItem": "TABLE_WOE_LEGEND_CARD_FOIL",
        "Weight": 10
      }
    ]
  },
  {
    "TableId": "TABLE_WOE_C8",
    "Nodes": [
      {
        "ResultItemType": "TableId",
        "ResultItem": "TABLE_WOE_LEGEND_CARD",
        "Weight": 9985
      },
      {
        "ResultItemType": "TableId",
        "ResultItem": "TABLE_WOE_LEGEND_CARD_FOIL",
        "Weight": 10
      }
    ]
  },
  {
    "TableId": "TABLE_WOE_COMMON_CARD",
    "Nodes": [
      {
        "ResultItemType": "ItemId",
        "ResultItem": "C0006",
        "Weight": 1
      },
      {
        "ResultItemType": "ItemId",
        "ResultItem": "C0022",
        "Weight": 1
      },
      {
        "ResultItemType": "ItemId",
        "ResultItem": "C0069",
        "Weight": 1
      },
      {
        "ResultItemType": "ItemId",
        "ResultItem": "C0099",
        "Weight": 1
      },
      {
        "ResultItemType": "ItemId",
        "ResultItem": "C0102",
        "Weight": 1
      },
      {
        "ResultItemType": "ItemId",
        "ResultItem": "C0154",
        "Weight": 1
      },
      {
        "ResultItemType": "ItemId",
        "ResultItem": "C0155",
        "Weight": 1
      },
      {
        "ResultItemType": "ItemId",
        "ResultItem": "C0156",
        "Weight": 1
      },
      {
        "ResultItemType": "ItemId",
        "ResultItem": "C0157",
        "Weight": 1
      },
      {
        "ResultItemType": "ItemId",
        "ResultItem": "C0158",
        "Weight": 1
      },
      {
        "ResultItemType": "ItemId",
        "ResultItem": "C0159",
        "Weight": 1
      },
      {
        "ResultItemType": "ItemId",
        "ResultItem": "C0160",
        "Weight": 1
      },
      {
        "ResultItemType": "ItemId",
        "ResultItem": "C0169",
        "Weight": 1
      },
      {
        "ResultItemType": "ItemId",
        "ResultItem": "C0172",
        "Weight": 1
      },
      {
        "ResultItemType": "ItemId",
        "ResultItem": "C0173",
        "Weight": 1
      },
      {
        "ResultItemType": "ItemId",
        "ResultItem": "C0174",
        "Weight": 1
      },
      {
        "ResultItemType": "ItemId",
        "ResultItem": "C0175",
        "Weight": 1
      },
      {
        "ResultItemType": "ItemId",
        "ResultItem": "C0176",
        "Weight": 1
      },
      {
        "ResultItemType": "ItemId",
        "ResultItem": "C0178",
        "Weight": 1
      },
      {
        "ResultItemType": "ItemId",
        "ResultItem": "C0186",
        "Weight": 1
      },
      {
        "ResultItemType": "ItemId",
        "ResultItem": "C0187",
        "Weight": 1
      },
      {
        "ResultItemType": "ItemId",
        "ResultItem": "C0188",
        "Weight": 1
      },
      {
        "ResultItemType": "ItemId",
        "ResultItem": "C0193",
        "Weight": 1
      },
      {
        "ResultItemType": "ItemId",
        "ResultItem": "C0196",
        "Weight": 1
      },
      {
        "ResultItemType": "ItemId",
        "ResultItem": "C0197",
        "Weight": 1
      },
      {
        "ResultItemType": "ItemId",
        "ResultItem": "C0198",
        "Weight": 1
      },
      {
        "ResultItemType": "ItemId",
        "ResultItem": "C0199",
        "Weight": 1
      },
      {
        "ResultItemType": "ItemId",
        "ResultItem": "C0202",
        "Weight": 1
      },
      {
        "ResultItemType": "ItemId",
        "ResultItem": "C0203",
        "Weight": 1
      },
      {
        "ResultItemType": "ItemId",
        "ResultItem": "C0204",
        "Weight": 1
      },
      {
        "ResultItemType": "ItemId",
        "ResultItem": "C0206",
        "Weight": 1
      },
      {
        "ResultItemType": "ItemId",
        "ResultItem": "C0209",
        "Weight": 1
      },
      {
        "ResultItemType": "ItemId",
        "ResultItem": "C0214",
        "Weight": 1
      },
      {
        "ResultItemType": "ItemId",
        "ResultItem": "C0217",
        "Weight": 1
      },
      {
        "ResultItemType": "ItemId",
        "ResultItem": "C0218",
        "Weight": 1
      },
      {
        "ResultItemType": "ItemId",
        "ResultItem": "C0221",
        "Weight": 1
      },
      {
        "ResultItemType": "ItemId",
        "ResultItem": "C0223",
        "Weight": 1
      },
      {
        "ResultItemType": "ItemId",
        "ResultItem": "C0224",
        "Weight": 1
      },
      {
        "ResultItemType": "ItemId",
        "ResultItem": "C0226",
        "Weight": 1
      },
      {
        "ResultItemType": "ItemId",
        "ResultItem": "C0227",
        "Weight": 1
      },
      {
        "ResultItemType": "ItemId",
        "ResultItem": "C0228",
        "Weight": 1
      },
      {
        "ResultItemType": "ItemId",
        "ResultItem": "C0229",
        "Weight": 1
      },
      {
        "ResultItemType": "ItemId",
        "ResultItem": "C0230",
        "Weight": 1
      },
      {
        "ResultItemType": "ItemId",
        "ResultItem": "C0232",
        "Weight": 1
      },
      {
        "ResultItemType": "ItemId",
        "ResultItem": "C0233",
        "Weight": 1
      },
      {
        "ResultItemType": "ItemId",
        "ResultItem": "C0235",
        "Weight": 1
      },
      {
        "ResultItemType": "ItemId",
        "ResultItem": "C0238",
        "Weight": 1
      },
      {
        "ResultItemType": "ItemId",
        "ResultItem": "C0239",
        "Weight": 1
      },
      {
        "ResultItemType": "ItemId",
        "ResultItem": "C0250",
        "Weight": 1
      },
      {
        "ResultItemType": "ItemId",
        "ResultItem": "C0251",
        "Weight": 1
      },
      {
        "ResultItemType": "ItemId",
        "ResultItem": "C0252",
        "Weight": 1
      },
      {
        "ResultItemType": "ItemId",
        "ResultItem": "C0253",
        "Weight": 1
      },
      {
        "ResultItemType": "ItemId",
        "ResultItem": "C0254",
        "Weight": 1
      },
      {
        "ResultItemType": "ItemId",
        "ResultItem": "C0255",
        "Weight": 1
      },
      {
        "ResultItemType": "ItemId",
        "ResultItem": "C0256",
        "Weight": 1
      },
      {
        "ResultItemType": "ItemId",
        "ResultItem": "C0257",
        "Weight": 1
      },
      {
        "ResultItemType": "ItemId",
        "ResultItem": "C0258",
        "Weight": 1
      },
      {
        "ResultItemType": "ItemId",
        "ResultItem": "C0259",
        "Weight": 1
      },
      {
        "ResultItemType": "ItemId",
        "ResultItem": "C0260",
        "Weight": 1
      },
      {
        "ResultItemType": "ItemId",
        "ResultItem": "C0261",
        "Weight": 1
      },
      {
        "ResultItemType": "ItemId",
        "ResultItem": "C0262",
        "Weight": 1
      },
      {
        "ResultItemType": "ItemId",
        "ResultItem": "C0263",
        "Weight": 1
      },
      {
        "ResultItemType": "ItemId",
        "ResultItem": "C0264",
        "Weight": 1
      },
      {
        "ResultItemType": "ItemId",
        "ResultItem": "C0266",
        "Weight": 1
      },
      {
        "ResultItemType": "ItemId",
        "ResultItem": "C0267",
        "Weight": 1
      },
      {
        "ResultItemType": "ItemId",
        "ResultItem": "C0268",
        "Weight": 1
      },
      {
        "ResultItemType": "ItemId",
        "ResultItem": "C0269",
        "Weight": 1
      },
      {
        "ResultItemType": "ItemId",
        "ResultItem": "C0273",
        "Weight": 1
      },
      {
        "ResultItemType": "ItemId",
        "ResultItem": "C0283",
        "Weight": 1
      },
      {
        "ResultItemType": "ItemId",
        "ResultItem": "C0286",
        "Weight": 1
      },
      {
        "ResultItemType": "ItemId",
        "ResultItem": "C0287",
        "Weight": 1
      },
      {
        "ResultItemType": "ItemId",
        "ResultItem": "C0288",
        "Weight": 1
      },
      {
        "ResultItemType": "ItemId",
        "ResultItem": "C0289",
        "Weight": 1
      },
      {
        "ResultItemType": "ItemId",
        "ResultItem": "C0290",
        "Weight": 1
      },
      {
        "ResultItemType": "ItemId",
        "ResultItem": "C0291",
        "Weight": 1
      },
      {
        "ResultItemType": "ItemId",
        "ResultItem": "C0292",
        "Weight": 1
      },
      {
        "ResultItemType": "ItemId",
        "ResultItem": "C0293",
        "Weight": 1
      },
      {
        "ResultItemType": "ItemId",
        "ResultItem": "C0294",
        "Weight": 1
      },
      {
        "ResultItemType": "ItemId",
        "ResultItem": "C0295",
        "Weight": 1
      },
      {
        "ResultItemType": "ItemId",
        "ResultItem": "C0296",
        "Weight": 1
      },
      {
        "ResultItemType": "ItemId",
        "ResultItem": "C0297",
        "Weight": 1
      },
      {
        "ResultItemType": "ItemId",
        "ResultItem": "C0298",
        "Weight": 1
      },
      {
        "ResultItemType": "ItemId",
        "ResultItem": "C0307",
        "Weight": 1
      },
      {
        "ResultItemType": "ItemId",
        "ResultItem": "C0308",
        "Weight": 1
      },
      {
        "ResultItemType": "ItemId",
        "ResultItem": "C0309",
        "Weight": 1
      },
      {
        "ResultItemType": "ItemId",
        "ResultItem": "C0312",
        "Weight": 1
      },
      {
        "ResultItemType": "ItemId",
        "ResultItem": "C0314",
        "Weight": 1
      },
      {
        "ResultItemType": "ItemId",
        "ResultItem": "C0315",
        "Weight": 1
      },
      {
        "ResultItemType": "ItemId",
        "ResultItem": "C0316",
        "Weight": 1
      },
      {
        "ResultItemType": "ItemId",
        "ResultItem": "C0320",
        "Weight": 1
      },
      {
        "ResultItemType": "ItemId",
        "ResultItem": "C0322",
        "Weight": 1
      },
      {
        "ResultItemType": "ItemId",
        "ResultItem": "C0323",
        "Weight": 1
      },
      {
        "ResultItemType": "ItemId",
        "ResultItem": "C0325",
        "Weight": 1
      },
      {
        "ResultItemType": "ItemId",
        "ResultItem": "C0327",
        "Weight": 1
      },
      {
        "ResultItemType": "ItemId",
        "ResultItem": "C0328",
        "Weight": 1
      },
      {
        "ResultItemType": "ItemId",
        "ResultItem": "C0329",
        "Weight": 1
      },
      {
        "ResultItemType": "ItemId",
        "ResultItem": "C0332",
        "Weight": 1
      },
      {
        "ResultItemType": "ItemId",
        "ResultItem": "C0334",
        "Weight": 1
      },
      {
        "ResultItemType": "ItemId",
        "ResultItem": "C0335",
        "Weight": 1
      },
      {
        "ResultItemType": "ItemId",
        "ResultItem": "C0339",
        "Weight": 1
      }
    ]
  },
  {
    "TableId": "TABLE_WOE_COMMON_CARD_FOIL",
    "Nodes": [
      {
        "ResultItemType": "ItemId",
        "ResultItem": "C0006:FOIL",
        "Weight": 1
      },
      {
        "ResultItemType": "ItemId",
        "ResultItem": "C0022:FOIL",
        "Weight": 1
      },
      {
        "ResultItemType": "ItemId",
        "ResultItem": "C0069:FOIL",
        "Weight": 1
      },
      {
        "ResultItemType": "ItemId",
        "ResultItem": "C0099:FOIL",
        "Weight": 1
      },
      {
        "ResultItemType": "ItemId",
        "ResultItem": "C0102:FOIL",
        "Weight": 1
      },
      {
        "ResultItemType": "ItemId",
        "ResultItem": "C0154:FOIL",
        "Weight": 1
      },
      {
        "ResultItemType": "ItemId",
        "ResultItem": "C0155:FOIL",
        "Weight": 1
      },
      {
        "ResultItemType": "ItemId",
        "ResultItem": "C0156:FOIL",
        "Weight": 1
      },
      {
        "ResultItemType": "ItemId",
        "ResultItem": "C0157:FOIL",
        "Weight": 1
      },
      {
        "ResultItemType": "ItemId",
        "ResultItem": "C0158:FOIL",
        "Weight": 1
      },
      {
        "ResultItemType": "ItemId",
        "ResultItem": "C0159:FOIL",
        "Weight": 1
      },
      {
        "ResultItemType": "ItemId",
        "ResultItem": "C0160:FOIL",
        "Weight": 1
      },
      {
        "ResultItemType": "ItemId",
        "ResultItem": "C0169:FOIL",
        "Weight": 1
      },
      {
        "ResultItemType": "ItemId",
        "ResultItem": "C0172:FOIL",
        "Weight": 1
      },
      {
        "ResultItemType": "ItemId",
        "ResultItem": "C0173:FOIL",
        "Weight": 1
      },
      {
        "ResultItemType": "ItemId",
        "ResultItem": "C0174:FOIL",
        "Weight": 1
      },
      {
        "ResultItemType": "ItemId",
        "ResultItem": "C0175:FOIL",
        "Weight": 1
      },
      {
        "ResultItemType": "ItemId",
        "ResultItem": "C0176:FOIL",
        "Weight": 1
      },
      {
        "ResultItemType": "ItemId",
        "ResultItem": "C0178:FOIL",
        "Weight": 1
      },
      {
        "ResultItemType": "ItemId",
        "ResultItem": "C0186:FOIL",
        "Weight": 1
      },
      {
        "ResultItemType": "ItemId",
        "ResultItem": "C0187:FOIL",
        "Weight": 1
      },
      {
        "ResultItemType": "ItemId",
        "ResultItem": "C0188:FOIL",
        "Weight": 1
      },
      {
        "ResultItemType": "ItemId",
        "ResultItem": "C0193:FOIL",
        "Weight": 1
      },
      {
        "ResultItemType": "ItemId",
        "ResultItem": "C0196:FOIL",
        "Weight": 1
      },
      {
        "ResultItemType": "ItemId",
        "ResultItem": "C0197:FOIL",
        "Weight": 1
      },
      {
        "ResultItemType": "ItemId",
        "ResultItem": "C0198:FOIL",
        "Weight": 1
      },
      {
        "ResultItemType": "ItemId",
        "ResultItem": "C0199:FOIL",
        "Weight": 1
      },
      {
        "ResultItemType": "ItemId",
        "ResultItem": "C0202:FOIL",
        "Weight": 1
      },
      {
        "ResultItemType": "ItemId",
        "ResultItem": "C0203:FOIL",
        "Weight": 1
      },
      {
        "ResultItemType": "ItemId",
        "ResultItem": "C0204:FOIL",
        "Weight": 1
      },
      {
        "ResultItemType": "ItemId",
        "ResultItem": "C0206:FOIL",
        "Weight": 1
      },
      {
        "ResultItemType": "ItemId",
        "ResultItem": "C0209:FOIL",
        "Weight": 1
      },
      {
        "ResultItemType": "ItemId",
        "ResultItem": "C0214:FOIL",
        "Weight": 1
      },
      {
        "ResultItemType": "ItemId",
        "ResultItem": "C0217:FOIL",
        "Weight": 1
      },
      {
        "ResultItemType": "ItemId",
        "ResultItem": "C0218:FOIL",
        "Weight": 1
      },
      {
        "ResultItemType": "ItemId",
        "ResultItem": "C0221:FOIL",
        "Weight": 1
      },
      {
        "ResultItemType": "ItemId",
        "ResultItem": "C0223:FOIL",
        "Weight": 1
      },
      {
        "ResultItemType": "ItemId",
        "ResultItem": "C0224:FOIL",
        "Weight": 1
      },
      {
        "ResultItemType": "ItemId",
        "ResultItem": "C0226:FOIL",
        "Weight": 1
      },
      {
        "ResultItemType": "ItemId",
        "ResultItem": "C0227:FOIL",
        "Weight": 1
      },
      {
        "ResultItemType": "ItemId",
        "ResultItem": "C0228:FOIL",
        "Weight": 1
      },
      {
        "ResultItemType": "ItemId",
        "ResultItem": "C0229:FOIL",
        "Weight": 1
      },
      {
        "ResultItemType": "ItemId",
        "ResultItem": "C0230:FOIL",
        "Weight": 1
      },
      {
        "ResultItemType": "ItemId",
        "ResultItem": "C0232:FOIL",
        "Weight": 1
      },
      {
        "ResultItemType": "ItemId",
        "ResultItem": "C0233:FOIL",
        "Weight": 1
      },
      {
        "ResultItemType": "ItemId",
        "ResultItem": "C0235:FOIL",
        "Weight": 1
      },
      {
        "ResultItemType": "ItemId",
        "ResultItem": "C0238:FOIL",
        "Weight": 1
      },
      {
        "ResultItemType": "ItemId",
        "ResultItem": "C0239:FOIL",
        "Weight": 1
      },
      {
        "ResultItemType": "ItemId",
        "ResultItem": "C0250:FOIL",
        "Weight": 1
      },
      {
        "ResultItemType": "ItemId",
        "ResultItem": "C0251:FOIL",
        "Weight": 1
      },
      {
        "ResultItemType": "ItemId",
        "ResultItem": "C0252:FOIL",
        "Weight": 1
      },
      {
        "ResultItemType": "ItemId",
        "ResultItem": "C0253:FOIL",
        "Weight": 1
      },
      {
        "ResultItemType": "ItemId",
        "ResultItem": "C0254:FOIL",
        "Weight": 1
      },
      {
        "ResultItemType": "ItemId",
        "ResultItem": "C0255:FOIL",
        "Weight": 1
      },
      {
        "ResultItemType": "ItemId",
        "ResultItem": "C0256:FOIL",
        "Weight": 1
      },
      {
        "ResultItemType": "ItemId",
        "ResultItem": "C0257:FOIL",
        "Weight": 1
      },
      {
        "ResultItemType": "ItemId",
        "ResultItem": "C0258:FOIL",
        "Weight": 1
      },
      {
        "ResultItemType": "ItemId",
        "ResultItem": "C0259:FOIL",
        "Weight": 1
      },
      {
        "ResultItemType": "ItemId",
        "ResultItem": "C0260:FOIL",
        "Weight": 1
      },
      {
        "ResultItemType": "ItemId",
        "ResultItem": "C0261:FOIL",
        "Weight": 1
      },
      {
        "ResultItemType": "ItemId",
        "ResultItem": "C0262:FOIL",
        "Weight": 1
      },
      {
        "ResultItemType": "ItemId",
        "ResultItem": "C0263:FOIL",
        "Weight": 1
      },
      {
        "ResultItemType": "ItemId",
        "ResultItem": "C0264:FOIL",
        "Weight": 1
      },
      {
        "ResultItemType": "ItemId",
        "ResultItem": "C0266:FOIL",
        "Weight": 1
      },
      {
        "ResultItemType": "ItemId",
        "ResultItem": "C0267:FOIL",
        "Weight": 1
      },
      {
        "ResultItemType": "ItemId",
        "ResultItem": "C0268:FOIL",
        "Weight": 1
      },
      {
        "ResultItemType": "ItemId",
        "ResultItem": "C0269:FOIL",
        "Weight": 1
      },
      {
        "ResultItemType": "ItemId",
        "ResultItem": "C0273:FOIL",
        "Weight": 1
      },
      {
        "ResultItemType": "ItemId",
        "ResultItem": "C0283:FOIL",
        "Weight": 1
      },
      {
        "ResultItemType": "ItemId",
        "ResultItem": "C0286:FOIL",
        "Weight": 1
      },
      {
        "ResultItemType": "ItemId",
        "ResultItem": "C0287:FOIL",
        "Weight": 1
      },
      {
        "ResultItemType": "ItemId",
        "ResultItem": "C0288:FOIL",
        "Weight": 1
      },
      {
        "ResultItemType": "ItemId",
        "ResultItem": "C0289:FOIL",
        "Weight": 1
      },
      {
        "ResultItemType": "ItemId",
        "ResultItem": "C0290:FOIL",
        "Weight": 1
      },
      {
        "ResultItemType": "ItemId",
        "ResultItem": "C0291:FOIL",
        "Weight": 1
      },
      {
        "ResultItemType": "ItemId",
        "ResultItem": "C0292:FOIL",
        "Weight": 1
      },
      {
        "ResultItemType": "ItemId",
        "ResultItem": "C0293:FOIL",
        "Weight": 1
      },
      {
        "ResultItemType": "ItemId",
        "ResultItem": "C0294:FOIL",
        "Weight": 1
      },
      {
        "ResultItemType": "ItemId",
        "ResultItem": "C0295:FOIL",
        "Weight": 1
      },
      {
        "ResultItemType": "ItemId",
        "ResultItem": "C0296:FOIL",
        "Weight": 1
      },
      {
        "ResultItemType": "ItemId",
        "ResultItem": "C0297:FOIL",
        "Weight": 1
      },
      {
        "ResultItemType": "ItemId",
        "ResultItem": "C0298:FOIL",
        "Weight": 1
      },
      {
        "ResultItemType": "ItemId",
        "ResultItem": "C0307:FOIL",
        "Weight": 1
      },
      {
        "ResultItemType": "ItemId",
        "ResultItem": "C0308:FOIL",
        "Weight": 1
      },
      {
        "ResultItemType": "ItemId",
        "ResultItem": "C0309:FOIL",
        "Weight": 1
      },
      {
        "ResultItemType": "ItemId",
        "ResultItem": "C0312:FOIL",
        "Weight": 1
      },
      {
        "ResultItemType": "ItemId",
        "ResultItem": "C0314:FOIL",
        "Weight": 1
      },
      {
        "ResultItemType": "ItemId",
        "ResultItem": "C0315:FOIL",
        "Weight": 1
      },
      {
        "ResultItemType": "ItemId",
        "ResultItem": "C0316:FOIL",
        "Weight": 1
      },
      {
        "ResultItemType": "ItemId",
        "ResultItem": "C0320:FOIL",
        "Weight": 1
      },
      {
        "ResultItemType": "ItemId",
        "ResultItem": "C0322:FOIL",
        "Weight": 1
      },
      {
        "ResultItemType": "ItemId",
        "ResultItem": "C0323:FOIL",
        "Weight": 1
      },
      {
        "ResultItemType": "ItemId",
        "ResultItem": "C0325:FOIL",
        "Weight": 1
      },
      {
        "ResultItemType": "ItemId",
        "ResultItem": "C0327:FOIL",
        "Weight": 1
      },
      {
        "ResultItemType": "ItemId",
        "ResultItem": "C0328:FOIL",
        "Weight": 1
      },
      {
        "ResultItemType": "ItemId",
        "ResultItem": "C0329:FOIL",
        "Weight": 1
      },
      {
        "ResultItemType": "ItemId",
        "ResultItem": "C0332:FOIL",
        "Weight": 1
      },
      {
        "ResultItemType": "ItemId",
        "ResultItem": "C0334:FOIL",
        "Weight": 1
      },
      {
        "ResultItemType": "ItemId",
        "ResultItem": "C0335:FOIL",
        "Weight": 1
      },
      {
        "ResultItemType": "ItemId",
        "ResultItem": "C0339:FOIL",
        "Weight": 1
      }
    ]
  },
  {
    "TableId": "TABLE_WOE_EPIC_CARD",
    "Nodes": [
      {
        "ResultItemType": "ItemId",
        "ResultItem": "C0013",
        "Weight": 1
      },
      {
        "ResultItemType": "ItemId",
        "ResultItem": "C0023",
        "Weight": 1
      },
      {
        "ResultItemType": "ItemId",
        "ResultItem": "C0024",
        "Weight": 1
      },
      {
        "ResultItemType": "ItemId",
        "ResultItem": "C0033",
        "Weight": 1
      },
      {
        "ResultItemType": "ItemId",
        "ResultItem": "C0037",
        "Weight": 1
      },
      {
        "ResultItemType": "ItemId",
        "ResultItem": "C0059",
        "Weight": 1
      },
      {
        "ResultItemType": "ItemId",
        "ResultItem": "C0066",
        "Weight": 1
      },
      {
        "ResultItemType": "ItemId",
        "ResultItem": "C0081",
        "Weight": 1
      },
      {
        "ResultItemType": "ItemId",
        "ResultItem": "C0083",
        "Weight": 1
      },
      {
        "ResultItemType": "ItemId",
        "ResultItem": "C0084",
        "Weight": 1
      },
      {
        "ResultItemType": "ItemId",
        "ResultItem": "C0085",
        "Weight": 1
      },
      {
        "ResultItemType": "ItemId",
        "ResultItem": "C0086",
        "Weight": 1
      },
      {
        "ResultItemType": "ItemId",
        "ResultItem": "C0103",
        "Weight": 1
      },
      {
        "ResultItemType": "ItemId",
        "ResultItem": "C0104",
        "Weight": 1
      },
      {
        "ResultItemType": "ItemId",
        "ResultItem": "C0163",
        "Weight": 1
      },
      {
        "ResultItemType": "ItemId",
        "ResultItem": "C0167",
        "Weight": 1
      },
      {
        "ResultItemType": "ItemId",
        "ResultItem": "C0170",
        "Weight": 1
      },
      {
        "ResultItemType": "ItemId",
        "ResultItem": "C0181",
        "Weight": 1
      },
      {
        "ResultItemType": "ItemId",
        "ResultItem": "C0184",
        "Weight": 1
      },
      {
        "ResultItemType": "ItemId",
        "ResultItem": "C0185",
        "Weight": 1
      },
      {
        "ResultItemType": "ItemId",
        "ResultItem": "C0200",
        "Weight": 1
      },
      {
        "ResultItemType": "ItemId",
        "ResultItem": "C0205",
        "Weight": 1
      },
      {
        "ResultItemType": "ItemId",
        "ResultItem": "C0215",
        "Weight": 1
      },
      {
        "ResultItemType": "ItemId",
        "ResultItem": "C0220",
        "Weight": 1
      },
      {
        "ResultItemType": "ItemId",
        "ResultItem": "C0247",
        "Weight": 1
      },
      {
        "ResultItemType": "ItemId",
        "ResultItem": "C0248",
        "Weight": 1
      },
      {
        "ResultItemType": "ItemId",
        "ResultItem": "C0270",
        "Weight": 1
      },
      {
        "ResultItemType": "ItemId",
        "ResultItem": "C0275",
        "Weight": 1
      },
      {
        "ResultItemType": "ItemId",
        "ResultItem": "C0278",
        "Weight": 1
      },
      {
        "ResultItemType": "ItemId",
        "ResultItem": "C0280",
        "Weight": 1
      },
      {
        "ResultItemType": "ItemId",
        "ResultItem": "C0300",
        "Weight": 1
      },
      {
        "ResultItemType": "ItemId",
        "ResultItem": "C0306",
        "Weight": 1
      },
      {
        "ResultItemType": "ItemId",
        "ResultItem": "C0319",
        "Weight": 1
      },
      {
        "ResultItemType": "ItemId",
        "ResultItem": "C0324",
        "Weight": 1
      },
      {
        "ResultItemType": "ItemId",
        "ResultItem": "C0340",
        "Weight": 1
      },
      {
        "ResultItemType": "ItemId",
        "ResultItem": "C0348",
        "Weight": 1
      },
      {
        "ResultItemType": "ItemId",
        "ResultItem": "C0481",
        "Weight": 1
      }
    ]
  },
  {
    "TableId": "TABLE_WOE_EPIC_CARD_FOIL",
    "Nodes": [
      {
        "ResultItemType": "ItemId",
        "ResultItem": "C0013:FOIL",
        "Weight": 1
      },
      {
        "ResultItemType": "ItemId",
        "ResultItem": "C0023:FOIL",
        "Weight": 1
      },
      {
        "ResultItemType": "ItemId",
        "ResultItem": "C0024:FOIL",
        "Weight": 1
      },
      {
        "ResultItemType": "ItemId",
        "ResultItem": "C0033:FOIL",
        "Weight": 1
      },
      {
        "ResultItemType": "ItemId",
        "ResultItem": "C0037:FOIL",
        "Weight": 1
      },
      {
        "ResultItemType": "ItemId",
        "ResultItem": "C0059:FOIL",
        "Weight": 1
      },
      {
        "ResultItemType": "ItemId",
        "ResultItem": "C0066:FOIL",
        "Weight": 1
      },
      {
        "ResultItemType": "ItemId",
        "ResultItem": "C0081:FOIL",
        "Weight": 1
      },
      {
        "ResultItemType": "ItemId",
        "ResultItem": "C0083:FOIL",
        "Weight": 1
      },
      {
        "ResultItemType": "ItemId",
        "ResultItem": "C0084:FOIL",
        "Weight": 1
      },
      {
        "ResultItemType": "ItemId",
        "ResultItem": "C0085:FOIL",
        "Weight": 1
      },
      {
        "ResultItemType": "ItemId",
        "ResultItem": "C0086:FOIL",
        "Weight": 1
      },
      {
        "ResultItemType": "ItemId",
        "ResultItem": "C0103:FOIL",
        "Weight": 1
      },
      {
        "ResultItemType": "ItemId",
        "ResultItem": "C0104:FOIL",
        "Weight": 1
      },
      {
        "ResultItemType": "ItemId",
        "ResultItem": "C0163:FOIL",
        "Weight": 1
      },
      {
        "ResultItemType": "ItemId",
        "ResultItem": "C0167:FOIL",
        "Weight": 1
      },
      {
        "ResultItemType": "ItemId",
        "ResultItem": "C0170:FOIL",
        "Weight": 1
      },
      {
        "ResultItemType": "ItemId",
        "ResultItem": "C0181:FOIL",
        "Weight": 1
      },
      {
        "ResultItemType": "ItemId",
        "ResultItem": "C0184:FOIL",
        "Weight": 1
      },
      {
        "ResultItemType": "ItemId",
        "ResultItem": "C0185:FOIL",
        "Weight": 1
      },
      {
        "ResultItemType": "ItemId",
        "ResultItem": "C0200:FOIL",
        "Weight": 1
      },
      {
        "ResultItemType": "ItemId",
        "ResultItem": "C0205:FOIL",
        "Weight": 1
      },
      {
        "ResultItemType": "ItemId",
        "ResultItem": "C0215:FOIL",
        "Weight": 1
      },
      {
        "ResultItemType": "ItemId",
        "ResultItem": "C0220:FOIL",
        "Weight": 1
      },
      {
        "ResultItemType": "ItemId",
        "ResultItem": "C0247:FOIL",
        "Weight": 1
      },
      {
        "ResultItemType": "ItemId",
        "ResultItem": "C0248:FOIL",
        "Weight": 1
      },
      {
        "ResultItemType": "ItemId",
        "ResultItem": "C0270:FOIL",
        "Weight": 1
      },
      {
        "ResultItemType": "ItemId",
        "ResultItem": "C0275:FOIL",
        "Weight": 1
      },
      {
        "ResultItemType": "ItemId",
        "ResultItem": "C0278:FOIL",
        "Weight": 1
      },
      {
        "ResultItemType": "ItemId",
        "ResultItem": "C0280:FOIL",
        "Weight": 1
      },
      {
        "ResultItemType": "ItemId",
        "ResultItem": "C0300:FOIL",
        "Weight": 1
      },
      {
        "ResultItemType": "ItemId",
        "ResultItem": "C0306:FOIL",
        "Weight": 1
      },
      {
        "ResultItemType": "ItemId",
        "ResultItem": "C0319:FOIL",
        "Weight": 1
      },
      {
        "ResultItemType": "ItemId",
        "ResultItem": "C0324:FOIL",
        "Weight": 1
      },
      {
        "ResultItemType": "ItemId",
        "ResultItem": "C0340:FOIL",
        "Weight": 1
      },
      {
        "ResultItemType": "ItemId",
        "ResultItem": "C0348:FOIL",
        "Weight": 1
      },
      {
        "ResultItemType": "ItemId",
        "ResultItem": "C0481:FOIL",
        "Weight": 1
      }
    ]
  },
  {
    "TableId": "TABLE_WOE_EPIC_HERO",
    "Nodes": [
      {
        "ResultItemType": "ItemId",
        "ResultItem": "C0300_HERO_H0007:FOIL",
        "Weight": 1
      },
      {
        "ResultItemType": "ItemId",
        "ResultItem": "C0481_HERO_H0008:FOIL",
        "Weight": 1
      }
    ]
  },
  {
    "TableId": "TABLE_WOE_LEGEND_CARD",
    "Nodes": [
      {
        "ResultItemType": "ItemId",
        "ResultItem": "C0049",
        "Weight": 1
      },
      {
        "ResultItemType": "ItemId",
        "ResultItem": "C0050",
        "Weight": 1
      },
      {
        "ResultItemType": "ItemId",
        "ResultItem": "C0051",
        "Weight": 1
      },
      {
        "ResultItemType": "ItemId",
        "ResultItem": "C0052",
        "Weight": 1
      },
      {
        "ResultItemType": "ItemId",
        "ResultItem": "C0053",
        "Weight": 1
      },
      {
        "ResultItemType": "ItemId",
        "ResultItem": "C0054",
        "Weight": 1
      },
      {
        "ResultItemType": "ItemId",
        "ResultItem": "C0068",
        "Weight": 1
      },
      {
        "ResultItemType": "ItemId",
        "ResultItem": "C0161",
        "Weight": 1
      },
      {
        "ResultItemType": "ItemId",
        "ResultItem": "C0164",
        "Weight": 1
      },
      {
        "ResultItemType": "ItemId",
        "ResultItem": "C0165",
        "Weight": 1
      },
      {
        "ResultItemType": "ItemId",
        "ResultItem": "C0180",
        "Weight": 1
      },
      {
        "ResultItemType": "ItemId",
        "ResultItem": "C0182",
        "Weight": 1
      },
      {
        "ResultItemType": "ItemId",
        "ResultItem": "C0212",
        "Weight": 1
      },
      {
        "ResultItemType": "ItemId",
        "ResultItem": "C0236",
        "Weight": 1
      },
      {
        "ResultItemType": "ItemId",
        "ResultItem": "C0237",
        "Weight": 1
      },
      {
        "ResultItemType": "ItemId",
        "ResultItem": "C0241",
        "Weight": 1
      },
      {
        "ResultItemType": "ItemId",
        "ResultItem": "C0242",
        "Weight": 1
      },
      {
        "ResultItemType": "ItemId",
        "ResultItem": "C0243",
        "Weight": 1
      },
      {
        "ResultItemType": "ItemId",
        "ResultItem": "C0245",
        "Weight": 1
      },
      {
        "ResultItemType": "ItemId",
        "ResultItem": "C0271",
        "Weight": 1
      },
      {
        "ResultItemType": "ItemId",
        "ResultItem": "C0272",
        "Weight": 1
      },
      {
        "ResultItemType": "ItemId",
        "ResultItem": "C0274",
        "Weight": 1
      },
      {
        "ResultItemType": "ItemId",
        "ResultItem": "C0303",
        "Weight": 1
      },
      {
        "ResultItemType": "ItemId",
        "ResultItem": "C0304",
        "Weight": 1
      },
      {
        "ResultItemType": "ItemId",
        "ResultItem": "C0318",
        "Weight": 1
      },
      {
        "ResultItemType": "ItemId",
        "ResultItem": "C0330",
        "Weight": 1
      },
      {
        "ResultItemType": "ItemId",
        "ResultItem": "C0337",
        "Weight": 1
      }
    ]
  },
  {
    "TableId": "TABLE_WOE_LEGEND_CARD_FOIL",
    "Nodes": [
      {
        "ResultItemType": "ItemId",
        "ResultItem": "C0049:FOIL",
        "Weight": 1
      },
      {
        "ResultItemType": "ItemId",
        "ResultItem": "C0050:FOIL",
        "Weight": 1
      },
      {
        "ResultItemType": "ItemId",
        "ResultItem": "C0051:FOIL",
        "Weight": 1
      },
      {
        "ResultItemType": "ItemId",
        "ResultItem": "C0052:FOIL",
        "Weight": 1
      },
      {
        "ResultItemType": "ItemId",
        "ResultItem": "C0053:FOIL",
        "Weight": 1
      },
      {
        "ResultItemType": "ItemId",
        "ResultItem": "C0054:FOIL",
        "Weight": 1
      },
      {
        "ResultItemType": "ItemId",
        "ResultItem": "C0068:FOIL",
        "Weight": 1
      },
      {
        "ResultItemType": "ItemId",
        "ResultItem": "C0161:FOIL",
        "Weight": 1
      },
      {
        "ResultItemType": "ItemId",
        "ResultItem": "C0164:FOIL",
        "Weight": 1
      },
      {
        "ResultItemType": "ItemId",
        "ResultItem": "C0165:FOIL",
        "Weight": 1
      },
      {
        "ResultItemType": "ItemId",
        "ResultItem": "C0180:FOIL",
        "Weight": 1
      },
      {
        "ResultItemType": "ItemId",
        "ResultItem": "C0182:FOIL",
        "Weight": 1
      },
      {
        "ResultItemType": "ItemId",
        "ResultItem": "C0212:FOIL",
        "Weight": 1
      },
      {
        "ResultItemType": "ItemId",
        "ResultItem": "C0236:FOIL",
        "Weight": 1
      },
      {
        "ResultItemType": "ItemId",
        "ResultItem": "C0237:FOIL",
        "Weight": 1
      },
      {
        "ResultItemType": "ItemId",
        "ResultItem": "C0241:FOIL",
        "Weight": 1
      },
      {
        "ResultItemType": "ItemId",
        "ResultItem": "C0242:FOIL",
        "Weight": 1
      },
      {
        "ResultItemType": "ItemId",
        "ResultItem": "C0243:FOIL",
        "Weight": 1
      },
      {
        "ResultItemType": "ItemId",
        "ResultItem": "C0245:FOIL",
        "Weight": 1
      },
      {
        "ResultItemType": "ItemId",
        "ResultItem": "C0271:FOIL",
        "Weight": 1
      },
      {
        "ResultItemType": "ItemId",
        "ResultItem": "C0272:FOIL",
        "Weight": 1
      },
      {
        "ResultItemType": "ItemId",
        "ResultItem": "C0274:FOIL",
        "Weight": 1
      },
      {
        "ResultItemType": "ItemId",
        "ResultItem": "C0303:FOIL",
        "Weight": 1
      },
      {
        "ResultItemType": "ItemId",
        "ResultItem": "C0304:FOIL",
        "Weight": 1
      },
      {
        "ResultItemType": "ItemId",
        "ResultItem": "C0318:FOIL",
        "Weight": 1
      },
      {
        "ResultItemType": "ItemId",
        "ResultItem": "C0330:FOIL",
        "Weight": 1
      },
      {
        "ResultItemType": "ItemId",
        "ResultItem": "C0337:FOIL",
        "Weight": 1
      }
    ]
  },
  {
    "TableId": "TABLE_WOE_RARE_CARD",
    "Nodes": [
      {
        "ResultItemType": "ItemId",
        "ResultItem": "C0014",
        "Weight": 1
      },
      {
        "ResultItemType": "ItemId",
        "ResultItem": "C0042",
        "Weight": 1
      },
      {
        "ResultItemType": "ItemId",
        "ResultItem": "C0047",
        "Weight": 1
      },
      {
        "ResultItemType": "ItemId",
        "ResultItem": "C0065",
        "Weight": 1
      },
      {
        "ResultItemType": "ItemId",
        "ResultItem": "C0067",
        "Weight": 1
      },
      {
        "ResultItemType": "ItemId",
        "ResultItem": "C0071",
        "Weight": 1
      },
      {
        "ResultItemType": "ItemId",
        "ResultItem": "C0080",
        "Weight": 1
      },
      {
        "ResultItemType": "ItemId",
        "ResultItem": "C0082",
        "Weight": 1
      },
      {
        "ResultItemType": "ItemId",
        "ResultItem": "C0095",
        "Weight": 1
      },
      {
        "ResultItemType": "ItemId",
        "ResultItem": "C0097",
        "Weight": 1
      },
      {
        "ResultItemType": "ItemId",
        "ResultItem": "C0100",
        "Weight": 1
      },
      {
        "ResultItemType": "ItemId",
        "ResultItem": "C0101",
        "Weight": 1
      },
      {
        "ResultItemType": "ItemId",
        "ResultItem": "C0152",
        "Weight": 1
      },
      {
        "ResultItemType": "ItemId",
        "ResultItem": "C0153",
        "Weight": 1
      },
      {
        "ResultItemType": "ItemId",
        "ResultItem": "C0162",
        "Weight": 1
      },
      {
        "ResultItemType": "ItemId",
        "ResultItem": "C0166",
        "Weight": 1
      },
      {
        "ResultItemType": "ItemId",
        "ResultItem": "C0168",
        "Weight": 1
      },
      {
        "ResultItemType": "ItemId",
        "ResultItem": "C0171",
        "Weight": 1
      },
      {
        "ResultItemType": "ItemId",
        "ResultItem": "C0177",
        "Weight": 1
      },
      {
        "ResultItemType": "ItemId",
        "ResultItem": "C0179",
        "Weight": 1
      },
      {
        "ResultItemType": "ItemId",
        "ResultItem": "C0183",
        "Weight": 1
      },
      {
        "ResultItemType": "ItemId",
        "ResultItem": "C0189",
        "Weight": 1
      },
      {
        "ResultItemType": "ItemId",
        "ResultItem": "C0190",
        "Weight": 1
      },
      {
        "ResultItemType": "ItemId",
        "ResultItem": "C0191",
        "Weight": 1
      },
      {
        "ResultItemType": "ItemId",
        "ResultItem": "C0192",
        "Weight": 1
      },
      {
        "ResultItemType": "ItemId",
        "ResultItem": "C0194",
        "Weight": 1
      },
      {
        "ResultItemType": "ItemId",
        "ResultItem": "C0195",
        "Weight": 1
      },
      {
        "ResultItemType": "ItemId",
        "ResultItem": "C0201",
        "Weight": 1
      },
      {
        "ResultItemType": "ItemId",
        "ResultItem": "C0207",
        "Weight": 1
      },
      {
        "ResultItemType": "ItemId",
        "ResultItem": "C0208",
        "Weight": 1
      },
      {
        "ResultItemType": "ItemId",
        "ResultItem": "C0210",
        "Weight": 1
      },
      {
        "ResultItemType": "ItemId",
        "ResultItem": "C0211",
        "Weight": 1
      },
      {
        "ResultItemType": "ItemId",
        "ResultItem": "C0213",
        "Weight": 1
      },
      {
        "ResultItemType": "ItemId",
        "ResultItem": "C0216",
        "Weight": 1
      },
      {
        "ResultItemType": "ItemId",
        "ResultItem": "C0219",
        "Weight": 1
      },
      {
        "ResultItemType": "ItemId",
        "ResultItem": "C0222",
        "Weight": 1
      },
      {
        "ResultItemType": "ItemId",
        "ResultItem": "C0225",
        "Weight": 1
      },
      {
        "ResultItemType": "ItemId",
        "ResultItem": "C0231",
        "Weight": 1
      },
      {
        "ResultItemType": "ItemId",
        "ResultItem": "C0234",
        "Weight": 1
      },
      {
        "ResultItemType": "ItemId",
        "ResultItem": "C0240",
        "Weight": 1
      },
      {
        "ResultItemType": "ItemId",
        "ResultItem": "C0244",
        "Weight": 1
      },
      {
        "ResultItemType": "ItemId",
        "ResultItem": "C0246",
        "Weight": 1
      },
      {
        "ResultItemType": "ItemId",
        "ResultItem": "C0249",
        "Weight": 1
      },
      {
        "ResultItemType": "ItemId",
        "ResultItem": "C0276",
        "Weight": 1
      },
      {
        "ResultItemType": "ItemId",
        "ResultItem": "C0277",
        "Weight": 1
      },
      {
        "ResultItemType": "ItemId",
        "ResultItem": "C0279",
        "Weight": 1
      },
      {
        "ResultItemType": "ItemId",
        "ResultItem": "C0281",
        "Weight": 1
      },
      {
        "ResultItemType": "ItemId",
        "ResultItem": "C0282",
        "Weight": 1
      },
      {
        "ResultItemType": "ItemId",
        "ResultItem": "C0284",
        "Weight": 1
      },
      {
        "ResultItemType": "ItemId",
        "ResultItem": "C0285",
        "Weight": 1
      },
      {
        "ResultItemType": "ItemId",
        "ResultItem": "C0299",
        "Weight": 1
      },
      {
        "ResultItemType": "ItemId",
        "ResultItem": "C0301",
        "Weight": 1
      },
      {
        "ResultItemType": "ItemId",
        "ResultItem": "C0302",
        "Weight": 1
      },
      {
        "ResultItemType": "ItemId",
        "ResultItem": "C0305",
        "Weight": 1
      },
      {
        "ResultItemType": "ItemId",
        "ResultItem": "C0310",
        "Weight": 1
      },
      {
        "ResultItemType": "ItemId",
        "ResultItem": "C0311",
        "Weight": 1
      },
      {
        "ResultItemType": "ItemId",
        "ResultItem": "C0317",
        "Weight": 1
      },
      {
        "ResultItemType": "ItemId",
        "ResultItem": "C0321",
        "Weight": 1
      },
      {
        "ResultItemType": "ItemId",
        "ResultItem": "C0333",
        "Weight": 1
      },
      {
        "ResultItemType": "ItemId",
        "ResultItem": "C0336",
        "Weight": 1
      },
      {
        "ResultItemType": "ItemId",
        "ResultItem": "C0338",
        "Weight": 1
      },
      {
        "ResultItemType": "ItemId",
        "ResultItem": "C0341",
        "Weight": 1
      },
      {
        "ResultItemType": "ItemId",
        "ResultItem": "C0346",
        "Weight": 1
      }
    ]
  },
  {
    "TableId": "TABLE_WOE_RARE_CARD_FOIL",
    "Nodes": [
      {
        "ResultItemType": "ItemId",
        "ResultItem": "C0014:FOIL",
        "Weight": 1
      },
      {
        "ResultItemType": "ItemId",
        "ResultItem": "C0042:FOIL",
        "Weight": 1
      },
      {
        "ResultItemType": "ItemId",
        "ResultItem": "C0047:FOIL",
        "Weight": 1
      },
      {
        "ResultItemType": "ItemId",
        "ResultItem": "C0065:FOIL",
        "Weight": 1
      },
      {
        "ResultItemType": "ItemId",
        "ResultItem": "C0067:FOIL",
        "Weight": 1
      },
      {
        "ResultItemType": "ItemId",
        "ResultItem": "C0071:FOIL",
        "Weight": 1
      },
      {
        "ResultItemType": "ItemId",
        "ResultItem": "C0080:FOIL",
        "Weight": 1
      },
      {
        "ResultItemType": "ItemId",
        "ResultItem": "C0082:FOIL",
        "Weight": 1
      },
      {
        "ResultItemType": "ItemId",
        "ResultItem": "C0095:FOIL",
        "Weight": 1
      },
      {
        "ResultItemType": "ItemId",
        "ResultItem": "C0097:FOIL",
        "Weight": 1
      },
      {
        "ResultItemType": "ItemId",
        "ResultItem": "C0100:FOIL",
        "Weight": 1
      },
      {
        "ResultItemType": "ItemId",
        "ResultItem": "C0101:FOIL",
        "Weight": 1
      },
      {
        "ResultItemType": "ItemId",
        "ResultItem": "C0152:FOIL",
        "Weight": 1
      },
      {
        "ResultItemType": "ItemId",
        "ResultItem": "C0153:FOIL",
        "Weight": 1
      },
      {
        "ResultItemType": "ItemId",
        "ResultItem": "C0162:FOIL",
        "Weight": 1
      },
      {
        "ResultItemType": "ItemId",
        "ResultItem": "C0166:FOIL",
        "Weight": 1
      },
      {
        "ResultItemType": "ItemId",
        "ResultItem": "C0168:FOIL",
        "Weight": 1
      },
      {
        "ResultItemType": "ItemId",
        "ResultItem": "C0171:FOIL",
        "Weight": 1
      },
      {
        "ResultItemType": "ItemId",
        "ResultItem": "C0177:FOIL",
        "Weight": 1
      },
      {
        "ResultItemType": "ItemId",
        "ResultItem": "C0179:FOIL",
        "Weight": 1
      },
      {
        "ResultItemType": "ItemId",
        "ResultItem": "C0183:FOIL",
        "Weight": 1
      },
      {
        "ResultItemType": "ItemId",
        "ResultItem": "C0189:FOIL",
        "Weight": 1
      },
      {
        "ResultItemType": "ItemId",
        "ResultItem": "C0190:FOIL",
        "Weight": 1
      },
      {
        "ResultItemType": "ItemId",
        "ResultItem": "C0191:FOIL",
        "Weight": 1
      },
      {
        "ResultItemType": "ItemId",
        "ResultItem": "C0192:FOIL",
        "Weight": 1
      },
      {
        "ResultItemType": "ItemId",
        "ResultItem": "C0194:FOIL",
        "Weight": 1
      },
      {
        "ResultItemType": "ItemId",
        "ResultItem": "C0195:FOIL",
        "Weight": 1
      },
      {
        "ResultItemType": "ItemId",
        "ResultItem": "C0201:FOIL",
        "Weight": 1
      },
      {
        "ResultItemType": "ItemId",
        "ResultItem": "C0207:FOIL",
        "Weight": 1
      },
      {
        "ResultItemType": "ItemId",
        "ResultItem": "C0208:FOIL",
        "Weight": 1
      },
      {
        "ResultItemType": "ItemId",
        "ResultItem": "C0210:FOIL",
        "Weight": 1
      },
      {
        "ResultItemType": "ItemId",
        "ResultItem": "C0211:FOIL",
        "Weight": 1
      },
      {
        "ResultItemType": "ItemId",
        "ResultItem": "C0213:FOIL",
        "Weight": 1
      },
      {
        "ResultItemType": "ItemId",
        "ResultItem": "C0216:FOIL",
        "Weight": 1
      },
      {
        "ResultItemType": "ItemId",
        "ResultItem": "C0219:FOIL",
        "Weight": 1
      },
      {
        "ResultItemType": "ItemId",
        "ResultItem": "C0222:FOIL",
        "Weight": 1
      },
      {
        "ResultItemType": "ItemId",
        "ResultItem": "C0225:FOIL",
        "Weight": 1
      },
      {
        "ResultItemType": "ItemId",
        "ResultItem": "C0231:FOIL",
        "Weight": 1
      },
      {
        "ResultItemType": "ItemId",
        "ResultItem": "C0234:FOIL",
        "Weight": 1
      },
      {
        "ResultItemType": "ItemId",
        "ResultItem": "C0240:FOIL",
        "Weight": 1
      },
      {
        "ResultItemType": "ItemId",
        "ResultItem": "C0244:FOIL",
        "Weight": 1
      },
      {
        "ResultItemType": "ItemId",
        "ResultItem": "C0246:FOIL",
        "Weight": 1
      },
      {
        "ResultItemType": "ItemId",
        "ResultItem": "C0249:FOIL",
        "Weight": 1
      },
      {
        "ResultItemType": "ItemId",
        "ResultItem": "C0276:FOIL",
        "Weight": 1
      },
      {
        "ResultItemType": "ItemId",
        "ResultItem": "C0277:FOIL",
        "Weight": 1
      },
      {
        "ResultItemType": "ItemId",
        "ResultItem": "C0279:FOIL",
        "Weight": 1
      },
      {
        "ResultItemType": "ItemId",
        "ResultItem": "C0281:FOIL",
        "Weight": 1
      },
      {
        "ResultItemType": "ItemId",
        "ResultItem": "C0282:FOIL",
        "Weight": 1
      },
      {
        "ResultItemType": "ItemId",
        "ResultItem": "C0284:FOIL",
        "Weight": 1
      },
      {
        "ResultItemType": "ItemId",
        "ResultItem": "C0285:FOIL",
        "Weight": 1
      },
      {
        "ResultItemType": "ItemId",
        "ResultItem": "C0299:FOIL",
        "Weight": 1
      },
      {
        "ResultItemType": "ItemId",
        "ResultItem": "C0301:FOIL",
        "Weight": 1
      },
      {
        "ResultItemType": "ItemId",
        "ResultItem": "C0302:FOIL",
        "Weight": 1
      },
      {
        "ResultItemType": "ItemId",
        "ResultItem": "C0305:FOIL",
        "Weight": 1
      },
      {
        "ResultItemType": "ItemId",
        "ResultItem": "C0310:FOIL",
        "Weight": 1
      },
      {
        "ResultItemType": "ItemId",
        "ResultItem": "C0311:FOIL",
        "Weight": 1
      },
      {
        "ResultItemType": "ItemId",
        "ResultItem": "C0317:FOIL",
        "Weight": 1
      },
      {
        "ResultItemType": "ItemId",
        "ResultItem": "C0321:FOIL",
        "Weight": 1
      },
      {
        "ResultItemType": "ItemId",
        "ResultItem": "C0333:FOIL",
        "Weight": 1
      },
      {
        "ResultItemType": "ItemId",
        "ResultItem": "C0336:FOIL",
        "Weight": 1
      },
      {
        "ResultItemType": "ItemId",
        "ResultItem": "C0338:FOIL",
        "Weight": 1
      },
      {
        "ResultItemType": "ItemId",
        "ResultItem": "C0341:FOIL",
        "Weight": 1
      },
      {
        "ResultItemType": "ItemId",
        "ResultItem": "C0346:FOIL",
        "Weight": 1
      }
    ]
  }
]