Key,English,Thai,Japanese
TEXT_ADVENTURE_UI_TITLE_AT,Prologue,บทนำ,プロローグ
TEXT_ADVENTURE_UI_CHAPTER1,Chapter 1,บทที่ 1 ,Chapter 1
TEXT_ADVENTURE_UI_COMING_SOON,Coming Soon!,เร็วๆนี้!,Coming Soon
TEXT_ADVENTURE_UI_DESCRIPTION_AT,"It has been two weeks since the ""War of Elements"" occurred. The rampage and chaos continue to spread without any means of slowing down. Noble heroes from each faction stepped forward to protect their kingdom and beloved home before being consumed by the chaos of war.","เป็นเวลา 2 สัปดาห์นับจากสงครามแห่งธาตุเกิดขึ้น
และรุนแรงขึ้นเรื่อยๆ ไม่มีท่าทีว่าจะสงบลง
ฮีโร่จากแต่ละฝั่ง แต่ละดินแดน จึงต้องออกมา
เพื่อปกป้องอาณาจักรของตัวเอง
ก่อนที่มันจะถูกทำลายจากไฟแห่งสงครามครั้งนี้",それは、「要素の戦争」が発生してから2週間となっています。大暴れし、混乱は減速の任意の手段なしに普及し続けています。各派閥からのノーブル英雄は戦争の混乱によって消費される前に、自分の王国と最愛の家を保護するために進み出。
TEXT_ADVENTURE_UI_TITLE_AT_001,Champion of Maruns,แชมเปี้ยนแห่งมารันส์,Marunsのチャンピオン
TEXT_ADVENTURE_UI_TITLE_AT_002,Prophet of Allard Ocean,นักพยากรณ์แห่งมหาสมุทรอัลลาร์ด,アラード海の預言者
TEXT_ADVENTURE_UI_TITLE_AT_003,Guardian of Jaca,ผู้คุ้มกันแห่งจาคา,ハカのガーディアン
TEXT_ADVENTURE_UI_TITLE_AT_004,Elite Scout of Giara,หน่วยสอดแนมระดับสูงเกียร่า,ジアラのエリートスカウト
TEXT_ADVENTURE_UI_TITLE_AT_005,Angel of Canaria,เทพธิดาแห่งคานาเรีย,カナリアの天使
TEXT_ADVENTURE_UI_TITLE_AT_006,Warlord of Angus,จอมทัพแห่งแองกัส,アンガスの将軍
TEXT_ADVENTURE_UI_DESCRIPTION_AT_001,"Learn how to use ""Berserk"" with Alex. Use it to take down the Tundra Warrior.","ทำความรู้จักความสามารถ ""บ้าพลัง"" ไปกับอเล็กซ์ เพื่อโค่นล้ม นักรบแดนเยือกแข็ง",アレックスと「ベルセルク」を使用する方法を学びます。ツンドラ戦士をテイクダウンするために使用します。
TEXT_ADVENTURE_UI_DESCRIPTION_AT_002,"Learn how to use ""Link"" with Tear. Use it to take down the Plain Walker.","ทำความรู้จักความสามารถ ""ลิงก์"" ไปกับเทียร์ เพื่อโค่นล้ม นักรบสัตว์อสูร",涙で「リンク」を使用する方法を学びます。平野ウォーカーをテイクダウンするために使用します。
TEXT_ADVENTURE_UI_DESCRIPTION_AT_003,"Learn how to use ""Lock"" with Brundo. Use it to take down the Guardian Golem.","ทำความรู้จักความสามารถ ""ล็อค"" ไปกับบรันโด้ เพื่อโค่นล้ม โกเลมผู้พิทักษ์",Brundoで「ロック」を使用する方法を学びます。ガーディアンゴーレムを倒すためにそれを使用してください。
TEXT_ADVENTURE_UI_DESCRIPTION_AT_004,"Learn how to use ""Move"" & ""Backstab"" with Ralana. Use them to take down the Lion Warrior.","ทำความรู้จักความสามารถ ""เคลื่อนย้าย"" และ ""โจมตีจุดอ่อน"" ไปกับราลาน่า เพื่อโค่นล้ม นักรบสิงโต",Ralanaで「移動」＆「バックスタブ」を使用する方法を学びます。ライオン戦士を倒すためにそれらを使用してください。
TEXT_ADVENTURE_UI_DESCRIPTION_AT_005,"Learn how to use ""Aura"" with Sadia. Use it to take down the Skeleton Warrior.","ทำความรู้จักความสามารถ ""ออร่า"" ไปกับซาเดีย เพื่อโค่นล้ม นักรบโครงกระดูก",Sadiaと「オーラ」を使用する方法を学びます。スケルトン戦士をテイクダウンするために使用します。
TEXT_ADVENTURE_UI_DESCRIPTION_AT_006,"Learn how to use ""Last Wish"" & ""Dark Matter"" with Tartarus. Use them to take down the Holy Knight.","ทำความรู้จักความสามารถ ""ปรารถนาสุดท้าย"" และ ""สสารมืด"" ไปกับซาเดีย เพื่อโค่นล้นอัศวินแห่งแสง",タルタロスで「最後の願い」＆「ダークマター」を使用する方法を学びます。聖騎士を倒すためにそれらを使用してください。
DIALOG_AT_001_001,Welcome to the arena!,ยินดีต้อนรับสู่อารีน่า!,アリーナへようこそ！
DIALOG_AT_001_002,Our warriors fight with aggression.,นักสู้ของเรา มีรูปแบบการเล่นที่ดุดัน ร้อนแรงดั่งเปลวไฟ,私たちの戦士たちは、侵略と戦います。
DIALOG_AT_001_003,"The harder we're hit, the stronger we become!",ยิ่งเราต่อสู้มากเท่าไหร่ เรายิ่งแข็งแกร่งขึ้นเท่านั้น!,難しい我々しているヒット、強いとなっております！
DIALOG_AT_001_004,Come and get me!,ฮาห์.....เข้ามาเลย,是非、私を得ます！
DIALOG_AT_001_005,This unit has the 'Berserk' ability! Time to put them to good use!,ดูนี่ ยูนิตนี้มีความสามารถ'บ้าพลัง' อยู่ ส่งลงไปในสนามเลย!,このユニットは、「ベルセルク」の能力を持っています！うまく利用してそれらを置くための時間！
DIALOG_AT_001_006,Come and get some!,มา...สู้...กัน!!!,是非、いくつかを取得します！
DIALOG_AT_001_007,Whoa! Someone's showing off their power!,เขาแสดงความสามารถแล้ว!,うわあ！誰かが自分の力を披露しています！
DIALOG_AT_001_008,The 'Berserk' ability triggers when a unit's HP isn't full.,"ความสามารถ 'บ้าพลัง' ของพวกเรา
จะทำงานเมื่อพลังชีวิตไม่เต็ม ",「ベルセルクの能力トリガーユニットのHPがいっぱいではありません。
DIALOG_AT_001_009,There are also other ways to trigger 'Berserk'.,นอกจากการโดนโจมตีแล้ว ยังมีอีกหลายทางที่ทำให้ความสามารถ 'บ้าพลัง' ทำงานนะ,トリガー「ベルセルク」に他の方法もあります。
DIALOG_AT_001_010, Place the Queen of Pain to see her whip our ally into 'Berserk' mode!,ลองใช้ 'บ้าพลัง' ทำคอมโบกับ  ผู้บงการความเจ็บปวด ดูสิ, 鞭私たちの味方「ベルセルク」モードに彼女を見て痛みの女王を置きます！
DIALOG_AT_001_011,Look at how Minotaur is powered up by 'Berserk'!,นั่นไงล่ะ ความสามารถ 'บ้าพลัง' ของพวกเรา สุดยอดเลยใช่ไหม!,ミノタウロスが「ベルセルク」でパワーアップされた方法を見て！
DIALOG_AT_001_012,"Now, let's use this ability to our advantage!","มาลองใช้พลังใหม่นี้
จัดการมันกันเถอะ!",今、私たちのアドバンテージにこの能力を使用してみましょう！
DIALOG_AT_001_013,The winter will freeze your fighting spirit!,"ฤดูหนาวจะกลืนกิน
จิตวิญญาณของแก
ไอ้หนู!",冬には、あなたの闘志を凍結します！
DIALOG_AT_001_014,Eh? What just happened?,ฮึม?.. ทำไมเป็นแบบนี้ล่ะ,え？今何があったの？
DIALOG_AT_001_015,"That's my ace card, Bovinae!","เอซการ์ดของฉัน!
เจ้าแห่งความโกลาหลโบวิเน",それは私のエースカード、ウシ亜科のです！
DIALOG_AT_001_016,Watch him burn every unit on the battlefield.,"มังกรที่จะเผาผลาญ
ทุกสรรพสิ่งในสนามรบ!",彼は戦場ですべてのユニットを燃やす見ます。
DIALOG_AT_001_017,Dude! You can still win it! Put some muscle into it!,ยังหรอกน่า ยังสู้ไหวอยู่!,おい！あなたはまだそれを獲得することができます！そこにいくつかの筋肉を入れて！
DIALOG_AT_001_018,I... can still... win this.,ข้า....ยัง....ไหวอยู่,私は...まだ...これを獲得することができます。
DIALOG_AT_001_019,HERE! EAT THIS!,"รับนี่ไป
หมัดของฉัน!",ここに！これを食べて！
DIALOG_AT_001_020,This is gonna be a good fight!,นี่จะเป็นการต่อสู้ที่ดี!,これは良い戦いになるつもりです！
DIALOG_AT_001_021,Don't get carried away!,อย่าเพิ่งได้ใจไป!,夢中にしないでください！
DIALOG_AT_001_022,I'm just getting warmed up!,การต่อสู้มันเพิ่งจะเริ่มเอง!,私はちょうど暖め取得しています！
DIALOG_AT_001_023,My blood's getting hot! Come get me!,เครื่องชักจะร้อนแล้ว เข้ามาเลย!,私の血が熱くなってきました！私を得る来て！
DIALOG_AT_001_024,You talk too much!,อย่าปากดีให้มาก ไอ้หนู,あなたはあまりにも多くを語ります！
DIALOG_AT_001_025,THIS FIGHT IS LIT!,ความร้อนแรงนี้! มันหยุดไม่ได้แล้ว!,この戦いは、点灯しています！
DIALOG_AT_002_001,Welcome. Are you here to learn more about our bonds?,"ยินดีต้อนรับ
เธออยากเรียนรู้เกี่ยวกับ
พลังของเราไหม?",ようこそ。あなたは私たちの絆についての詳細を学ぶためにここにいますか？
DIALOG_AT_002_002,Our main ability is 'Link'.,ความสามารถของเราเรียกว่า 'ลิงก์',私たちの主な機能は、「リンク」です。
DIALOG_AT_002_003,"When we're connected, we become stronger.",พวกเราสามารถใช้ความสามารถ 'ลิงก์' เพื่อเพิ่มความสามารถของพวกเราได้,私たちが接続しているとき、私たちは強くなります。
DIALOG_AT_002_004,"Get lost, fish!",ออกไปจากแผ่นดินของข้าซะ เจ้าพวกปลา!,迷子、魚！
DIALOG_AT_002_005,Nerida has a 'Link' ability. Try placing her next to an ally.,เนอริด้า มีความสามารถ 'ลิงก์' ให้ลูกศรของยูนิตชี้เข้าหากันดูสิ,Neridaは、「リンクの能力を持っています。味方の隣に彼女を置いてみてください。
DIALOG_AT_002_006,"By strengthening our bonds, we're giving each other power.","พวกเราจับมือ
และเสริมพลังให้แก่กัน!",私たちの絆を強化することで、私たちはお互いに力を与えています。
DIALOG_AT_002_007,That's it! Our units are becoming stronger!,นั่นไง! นักรบของพวกเราแข็งแกร่งขึ้นแล้ว! ,それでおしまい！私たちのユニットが強くなってきています！
DIALOG_AT_002_008,"When Naga is Linked, his power flows to other units","เมื่อ นากา 'ลิงก์' พลังของเค้าสามารถ
ส่งผ่านให้ยูนิตอื่นๆได้อีก",ナーガがリンクされている場合は、彼の力は、他のユニットに流れます
DIALOG_AT_002_009,as long as the arrows face each other.,ตราบใดที่ลูกศรของเรา ยังเชื่อมกันอยู่!,限り矢印は互いに対向するように。
DIALOG_AT_002_010,"The more units are linked together, the stronger we'll become as a whole.",ยิ่งมีตัว 'ลิงก์' อยู่หลายตัวเท่าไหร่ พวกเราจะยิ่งแข็งแกร่งขึ้นเท่านั้น,複数のユニットが一緒にリンクされている、強力な我々は全体のようになるでしょう。
DIALOG_AT_002_011,Take it easy. There's always next time.,"ใจเย็นๆ
เราเริ่มใหม่ได้เสมอนะ",落ち着いて。次回は、常にあります。
DIALOG_AT_002_012,That's Nodens!,นั่น โนเดนส์!,それはNodensです！
DIALOG_AT_002_013,"When she's linked, she'll summon 'Servants of Nodens.'","ถ้าเกิด 'ลิงก์' แล้ว เธอสามารถเรียก
ลูกสมุนออกมาได้ด้วยนะ",彼女がリンクされているときに、彼女は「Nodensの使用人を。」召喚ます
DIALOG_AT_002_014,This is quite concerning.,ท่าจะแย่แล้วนะเนี่ย...,これは非常に懸念されます。
DIALOG_AT_002_015,"You've got some nerve, fish.",พวกปลา! แก! กล้าดียังไง...,あなたは、魚をいくつかの神経を持っています。
DIALOG_AT_002_016,"It's not too late to be friends, Plain Walker.","จริงๆแล้ว..
พวกเราเป็นเพื่อนกันได้นะ",これは、平野ウォーカー友達になり手遅れではありません。
DIALOG_AT_002_017,I know what you're doing!,ข้ารู้ว่าเจ้าวางแผนอะไรอยู่!,私は何をやっている知っています！
DIALOG_AT_002_018,Oh... I see.,โอ้.. งั้นรึ,ああなるほど。
DIALOG_AT_002_019,You're not supposed to be this strong!,เจ้าไม่ควรจะแข็งแกร่งถึงขนาดนี้นี่!,あなたがこの強力なことになっていません！
DIALOG_AT_002_020,Why don't you just give up?!,ทำไมเจ้าไม่ยอมแพ้ไปซะ!,なぜあなただ​​けあきらめないでください！
DIALOG_AT_002_021,My friend here would disagree with that.,เพื่อนของข้าคงไม่เห็นด้วยแน่ๆ,ここでの私の友人はそれに反対するだろう。
DIALOG_AT_002_022,"A wise move, friend.",เป็นแผนที่ดีนี่,賢明、友人。
DIALOG_AT_003_001,"You, lad! Come help me protect our kin.",เฮ้ไอ้หนู! มาช่วยทางนี้หน่อย!,あなた、若者！私たちの親族を守る助けに来ます。
DIALOG_AT_003_002,We use 'Lock' as a tactic to create a solid wall of protection.,พวกเราใช้ 'ล็อค' เพื่อป้องกันพวกพ้อง การป้องกันของพวกเรานั้นแข็งแกร่ง!,私たちは、保護の固体壁を作成するための戦術として、「ロック」を使用します。
DIALOG_AT_003_003,"I'll show you how it works, lad. Follow me.",ข้าจะแสดงให้ดูเองไอ้หนู ตามข้ามาเลย,私は若者、それがどのように動作するかを紹介します。フォローしてください。
DIALOG_AT_003_004,*Golem screaming noise*,*เสียงโกเลมกำลังทักทาย*,*ゴーレムノイズを叫ん*
DIALOG_AT_003_005,The 'Lock' ability is indestructible from any enemy attack. ,"ความสามารถ 'ล็อค' นั้น
ไม่มีใครโจมตีทำลายมันได้",「ロック」機能は、すべての敵の攻撃から破壊されません。
DIALOG_AT_003_006,"However, it'll destroy itself once the timer falls to zero.",แต่มันไม่อยู่ถาวรหรอกนะ เมื่อหมดเวลามันจะสลายหายไปเอง,タイマーがゼロになるいったんしかし、それは自分自身を破壊します。
DIALOG_AT_003_007,*Golem screaming noise*,*เสียงโกเลมกำลังท้าทาย*,*ゴーレムノイズを叫ん*
DIALOG_AT_003_008,Our 'Locks' can be used for both defense and offense.,"ความสามารถ 'ล็อค' สามารถใช้ได้ทั้งการโจมตี
และตั้งรับ",私たちの「ロック」は攻守の両方に使用することができます。
DIALOG_AT_003_009,The way we fight is through tactical positioning.,"วิธีการต่อสู้ของเรา
ขึ้นอยู่กับแผนการวาง
ตำแหน่งบอร์ด",私たちが戦う方法は、戦術的な位置付けています。
DIALOG_AT_003_010,See that? Our units receive power from 'Locked' on the field.,ฮาฮา! นั่นไงหละ พวกเราจะได้รับพลังจาก 'ล็อค' ที่อยู่ในสนาม,それを参照してください？私たちのユニットは、フィールド上の「ロック」から電力を受け取ります。
DIALOG_AT_003_011,"You have to choose well, lad. Use the power of nature to your advantage!",ดังนั้น นายจะต้องเลือกให้ดี นี่ความสมดุลของพลังธรรมชาติ!,あなたは、よく若者を選択する必要があります。あなたの利点に自然のパワーを使用してください！
DIALOG_AT_003_012,"Oi, lad. You doing alright there?",โฮ่..ไอ้หนูยังไหวไหมเนี่ย?,大井、若者。あなたは大丈夫そこやって？
DIALOG_AT_003_013,"We barely saw you, Yda!",อีด้า! ดีจริงๆที่ได้เจอ,我々はかろうじてYDA、あなたを見ました！
DIALOG_AT_003_014, Keep her protected! She consumes 'Lock' to strengthen an ally.,ปกป้องเธอไว้! เธอสามารถใช้ 'ล็อค' เพื่อเพิ่มพลังให้พรรคพวกได้!, 彼女が保護してください！彼女は味方を強化するために「ロック」を消費しています。
DIALOG_AT_003_015,"Stay focused, lad! There are solutions to every problem.",ใจเย็นๆ ทุกปัญหามีทางออกเสมอ หามันให้เจอ,滞在は、若者に焦点を当て！すべての問題の解決策があります。
DIALOG_AT_003_016,*Sad golem screams*,*เสียงโกเลมกำลังเศร้า*,*悲しいゴーレムの悲鳴*
DIALOG_AT_003_017,"I cast you back to the forest, fiend!",จงกลับสู่ฝืนป่าไปเถอะ...,私は森、悪魔にあなたをキャストバック！
DIALOG_AT_003_018,*Golem happy noise*,*เสียงโกเลมกำลังดีใจ*,*ゴーレム幸せなノイズ*
DIALOG_AT_003_019,Hmph! Is this your best shot?,หึ! นี่สุดแรงแล้วรึไง?,フン！これはあなたの最高のショットですか？
DIALOG_AT_003_020,How about this?,อย่างนี้ล่ะว่าไง?,これはどう？
DIALOG_AT_003_021,"Let's wrap it up, shall we?",รีบปิดเกมกันหน่อยดีไหม?,、のは、それを包むうじゃありませんか？
DIALOG_AT_003_022,*Golem angry noise*,*เสียงโกเลมกำลังโกรธ*,*ゴーレム怒っノイズ*
DIALOG_AT_003_023,Look at all the Locks we've created!,"เรามี 'ล็อค' เพียบเลย
ใช้มันเพื่อพิชิตเจ้าโกเลมนั่น",私たちが作成したすべてのロックを見てください！
DIALOG_AT_003_024,*Golem suspecting noise*,*เสียงโกเลมกำลังสงสัย*,*ノイズを疑うゴーレム*
DIALOG_AT_004_001,"Shhh... Be quiet, new kid.",ชูวว...เงียบหน่อยเจ้าหน้าใหม่,Shhh ...静かに、新しい子供う。
DIALOG_AT_004_002,Let's move silently to ambush our enemy.,เคลื่อนไหวช้าๆ เราจะลอบโจมตีศัตรูกัน,レッツ・動きは静かに私たちの敵を待ち伏せします。
DIALOG_AT_004_003,"Hah! We've found you, little girl!","ข้าเจอเจ้าแล้ว!...
เข้ามาเลยสาวน้อย",ほら！私たちはあなたを見つけた、小さな女の子！
DIALOG_AT_004_004,We've been spotted! Prepare to engage!,แย่แล้ว! โดนเจอจนได้ ทุกคน เตรียมการปะทะ!,私たちは目撃されました！従事するための準備を！
DIALOG_AT_004_005,The enemy's looking directly at us.,ศัตรูกำลังมาทางนี้แล้ว,敵は私たちを直接見ています。
DIALOG_AT_004_006,Let's use the thief's 'Backstab' ability to strike the enemy.,ใช้ความสามารถ 'ตีจุดอ่อน' ของพวกเรา โจมตีจากมุมอับของศัตรู,のは、敵を攻撃するために泥棒の「バックスタブの能力を使ってみましょう。
DIALOG_AT_004_007,You seem to know what you're doing. Let's move on to the next lesson.,มีไหวพริบดีหนิ เอาหละ อย่าวอกแวก เตรียมตัวรับสถานการณ์ต่อไป,あなたは何をやっている知っているように見えます。次のレッスンへのの動きをしてみましょう。
DIALOG_AT_004_008,Hmph. Those goblins are positioned far away.,หืม...เจ้าก๊อบลินนั้น ตั้งรับอยู่ห่างออกไป,ふん。これらのゴブリンは遠くに配置されています。
DIALOG_AT_004_009,Use Guiding Fairy to change our unit's position.,ใช้ แฟรี่นำทาง เธอมีความสามารถ 'เคลื่อนย้าย' จัดทัพของเราใหม่!,私たちのユニットの位置を変更するために使用指導の妖精。
DIALOG_AT_004_010,Seems like everything's in position now. Attack!,การแปรขบวนทัพเรียบร้อย โจมตีได้!,すべてが今の位置にありますように思えます。攻撃！
DIALOG_AT_004_011,"The path to victory is about strategic placement. Never, ever forget that.",ฮ่า! จำไว้นะเจ้าหน้าใหม่ การต่อสู้หนะ การวางแผนที่ดีจะนำไปสู้ชัยชนะ,勝利への道は、戦略的な配置についてです。 、今までのことを決して忘れません。
DIALOG_AT_004_012,Now it's your turn. Go on.,ต่อไปตานายแล้ว ลองดู!,今ではあなたの番です。続ける。
DIALOG_AT_004_013,You're giving up already? Seriously?,จะยอมแพ้แค่นี้หรอ!?,あなたはすでにあきらめていますか？真剣に？
DIALOG_AT_004_014,"Look at the sky, it's Sagan!","ฮ่า! เราชนะแน่
ผู้พิชิตแห่งท้องนภา!",それはセーガンだ、空を見て！
DIALOG_AT_004_015,He can help us change the enemy's position!,เขาสามารถเคลื่อนย้ายศัตรูได้ตามต้องการ ลุยเลย!,彼は、私たちは敵の位置を変更することができます！
DIALOG_AT_004_016,This looks... dire.,"ท่าจะแย่นะ...
นี่มันผิดจากแผนไปสักหน่อย",このルックス...悲惨な。
DIALOG_AT_004_017,Hmmm... Not bad for a beginner.,สำหรับมือใหม่ ทำได้ไม่เลวหนิ,うーん...初心者のために悪くありません。
DIALOG_AT_004_018,Victory will be ours!,ขอรับชัยชนะไปหละนะ!,勝利は我々のものになります！
DIALOG_AT_004_019,Let's see how you deal with this!,ดูสิ..เธอจะรับมือกับสถานการณ์นี้ยังไง,あなたがこれに対処方法を見てみましょう！
DIALOG_AT_004_020,Tch! Wait for my turn!,ชิ รอตาฉันก่อนเถอะน่า!,TCH！私の番を待ちます！
DIALOG_AT_004_021,Is this your strongest unit?,"นั่นเป็นยูนิตที่เก่งที่สุด
ของนายแล้วหรอ?",これはあなたの最強ユニットですか？
DIALOG_AT_004_022,"Hey, little girl! Feeling exhausted yet?",เฮ้สาวน้อย!.....จะหมดแรงหรือยังหละ,ねえ、ちょっと女の子！気持ちはまだ尽くさ？
DIALOG_AT_004_023,I can do this all day!,เข้ามาเลย ฉันสู้ได้ทั้งวันแหละ,私は一日、これを行うことができます！
DIALOG_AT_004_024,"Heh, you've learned something.",ไม่เลว...เรียนรู้ไวดีหนิ ,ふむ、あなたは何かを学びました。
DIALOG_AT_004_025,Perfect strategy!,นั่นเป็นแผนการที่ไร้ที่ติ!,パーフェクト作戦！
DIALOG_AT_004_026,What?! How is it possible?!,อะไร!? เป็นไปได้ยังไง,何？！どのようにそれは可能です！
DIALOG_AT_005_001,Hi there. Please help me out!,"เธอตรงนั้นหนะ..
ช่วยฉันที!",こんにちは。私を助けてください！
DIALOG_AT_005_002,Our units were weakened by the dark force.,"กองทัพของเราอ่อนแอลง
จากการต่อสู่กับพลังของความมืด",私たちのユニットは、暗い力によって弱体化されました。
DIALOG_AT_005_003,Use our 'Aura' units to support our comrades quickly!,ใช้ 'ออร่า' เพื่อช่วยเหลือกองทัพของเรา เร็วเข้า!,すぐに私たちの同志をサポートするために、私たちの「オーラ」のユニットを使用してください！
DIALOG_AT_005_004,*Skeleton screams*,*เสียงกระดูกโหยหวน*,*スケルトンは悲鳴*
DIALOG_AT_005_005,Bless the stars! The Heavy Knight is here!,ขอบคุณเหล่าดวงดาว! อัศวินเกราะหนักมาแล้ว,星を祝福！ヘビーナイトはここにあります！
DIALOG_AT_005_006,He can bless 'Aura' to our surrounding allies.,เค้าสามารถใช้ 'ออร่า' สนับสนุนกองทัพของเราได้,彼は私たちの周囲の同盟国への「オーラ」を祝福することができます。
DIALOG_AT_005_007,Everyone! Stay close to our Heavy Knight!,ทหารทุกนาย ตั้งกระบวนทัพรอบ อัศวินเกราะหนักเร็ว!,全員！私たちのヘビーナイトに近い滞在！
DIALOG_AT_005_008,See that? Our units are blessed by the power of light.,"กองทัพของเรากำลังได้รับ
พลังจากแสงสว่าง",それを参照してください？私たちのユニットは、光のパワーに恵まれています。
DIALOG_AT_005_009,"Now that we're back on our feet, it's time to go on offense!",กระบวนทัพเรากำลังได้เปรียบ ถึงเวลาโจมตีสวนแล้วค่ะ!,今、私たちは戻って私たちの足にしていること、それの時間が犯罪に行きます！
DIALOG_AT_005_010,Group the Marksman with the Heavy Knight to perform a long range attack.,"กลุ่มของนักธนูจะสามารถโจมตี
ระยะไกลได้เมื่อได้รับพลังจาก 
'ออร่า' ค่ะ!",長距離攻撃を実行するための重騎士を持つグループの射手。
DIALOG_AT_005_011,"Keep in mind, the stronger you set up your forces, the better the outcome!","จำไว้นะว่ารากฐานที่ดี จะทำให้ทั้งกองทัพ
แข็งแกร่งขึ้น!",覚えておいて、あなたの力を設定し、より強い、より良い結果！
DIALOG_AT_005_012,"Okay, now it's your turn to defeat the Skeleton Warrior. You can do it!","ทีนี้ท่านลองจัดการเจ้านักรบ
โครงกระดูกนั่นกันเลย!",さて、今ではスケルトンの戦士を倒すためにあなたの番です。あなたはそれを行うことができます！
DIALOG_AT_005_013,Don't give up yet!,เอ๋.....พยายามอีกหน่อยน่า!,まだあきらめてはいけません！
DIALOG_AT_005_014,Yes! Brianna has come to save us!,เย้! บริอันนา ดาบศักดิ์สิทธิ์!,はい！ブリアナたちを救うために来ました！
DIALOG_AT_005_015,"When she's next to 'Aura', she'll get a huge power boost!",ถ้าเธอได้รับออร่า จะไม่มีใครต้านทานเธอได้!,彼女は「オーラ」の隣だとき、彼女は巨大なパワーブーストを得るでしょう！
DIALOG_AT_005_016,"Hey, take deep breaths now. You can do this!",ใจเย็นๆก่อน พวกเราทำได้อยู่แล้ว!,ねえ、今深呼吸。あなたはこれを行うことができます！
DIALOG_AT_005_017,The dead shall not die again!,คนตาย ไม่มีทางตาย!,死者は再び死ぬてはなりません！
DIALOG_AT_005_018,"Rest in peace, Skeleton Warrior.",นักรบโครงกระดูก ไปสู่สุคตินะ...,平和、スケルトン戦士で休みます。
DIALOG_AT_005_019,Die... DIEEEE!,ตาย..ตาย!,ダイ... DIEEEEを！
DIALOG_AT_005_020,Oh no! Our mighty soldier!,ไม่นะ ทหารของเรา...,大野！私達の強大な兵士！
DIALOG_AT_005_021,"Good job, soldier!",ทำได้ดีมากทหาร!,良い仕事、兵士！
DIALOG_AT_005_022,You can't stop us! Darkness will consume everything.,แกไม่มีทางหยุดพวกเราได้ ความมืดจะกลืนกินทุกสิ่ง,あなたは私たちを停止することはできません！闇はすべてを消費します。
DIALOG_AT_005_023,Soldier! Hold your position and get ready!,ทหารทุกนายประจำที่ พวกมันกำลังมาแล้ว,兵士！あなたの位置を保持し、準備ができました！
DIALOG_AT_005_024,Keep your positions and we're unbeatable!,กองทัพที่แข็งแกร่ง จะไม่มีวันแตกพ่าย,あなたのポジションをキープし、我々は無敵です！
DIALOG_AT_006_001,Did you come here to seek ultimate power?,"เจ้ามาที่นี่เพื่อหาพลัง
อันไร้ขีดจำกัดงั้นหรอ",あなたは究極のパワーを求めてここに来ましたの？
DIALOG_AT_006_002,"If you desire 'Dark Power', you need to consume 'Dark Matter.'","ถ้าอยากได้พลัง เจ้าต้องเป็นหนึ่งเดียว
กับความมืดก่อน",あなたは「ダークパワー」を希望する場合は、消費する必要がある「ダークマターを」。
DIALOG_AT_006_003,"Let's get started, shall we?",มาเริ่มกันเลย ดีไหม?,のは、私たちは、もの始めましょうか？
DIALOG_AT_006_004,I shall punish all underworld scum!,ข้าจะลงทัณฑ์แกเอง เจ้าปีศาจโสโครก!,私はすべての冥界のスカムを処罰しなければなりません！
DIALOG_AT_006_005,The Skeleton Warrior does not fear death.,นักรบโครงกระดูกมีความสามารถ 'ปราถนาสุดท้าย' อยู่,スケルトンの戦士は、死を恐れていません。
DIALOG_AT_006_006,He will rise again even after death.,"หลังจากตาย
มันจะลุกขึ้นมาใหม่!",彼は死の後に再び上昇します。
DIALOG_AT_006_007,Trading death for victory is extremely satisfying.,.....หึ ความตายแค่นี้ แลกกับชัยชนะนับว่าคุ้มค่ามาก,勝利のための取引死は非常に満足しています。
DIALOG_AT_006_008,It's time to devote to the dark side.,ถึงเวลาเข้าสู่ด้านมืดแล้ว!,これは、ダークサイドに専念する時間です。
DIALOG_AT_006_009,Summon a Nightmare Beast to create 'Dark Matter.',ใช้อสูรรัตติกาลเพื่อเรียก 'สสารมืด' ออกมาเตรียมไว้,作成するナイトメア獣を召喚「ダークマターを」。
DIALOG_AT_006_010,"By consuming 'Dark Matter', 'Dark Power' shall be given to you.","รับพลังของ 'สสารมืด' เพื่อปลดปล่อย
พลังอันไร้ขีดจำกัดนั่น! ",「ダークマター」を消費することで、「ダークパワー」をあなたに与えられなければなりません。
DIALOG_AT_006_011,FEEL THE POWER OF DARKNESS!,สัมผัสพลังแห่งความมืดสิ!,闇の力を感じます！
DIALOG_AT_006_012,ALL SHALL SUCCUMB TO OUR ULTIMATE POWER!,"ทุกสรรพสิ่งจะยอม
จำนนต่อพลังของเรา!",ALL SHALL屈する究極パワー！
DIALOG_AT_006_013,This is impossible...,เป็นไปไม่ได้...,不可能だよ...
DIALOG_AT_006_014,Tenebrig has risen!,เทเนบริค เจ้าแห่งความมืด,Tenebrigは上昇しています！
DIALOG_AT_006_015,He shall feast on our enemy's deaths!,"การ์ดนี้จะนำความพ่ายแพ้
มาให้แก่ศัตรูของเรา!",彼は私たちの敵の死亡にごちそうなければなりません！
DIALOG_AT_006_016,...Troublesome.,เหอะ! น่ารำคาญจริงๆ,...面倒。
DIALOG_AT_006_017,P-Please! Have mercy!,ม...เมตตาด้วย!,P-してください！どうかご慈悲を！
DIALOG_AT_006_018,Begone!,หายไปซะ!,仰せられました！
DIALOG_AT_006_019,Perish! Dark minion!,พินาศไปซะ พวกสมุนแห่งความมืด!,滅びる！ダーク手先！
DIALOG_AT_006_020,Let the power of darkness consume you!,ความมืดจะกลืนกินทุกสิ่ง ,闇の力があなたを消費してみよう！
DIALOG_AT_006_021,The light shall never lose to the darkness.,"แสงสว่างจะไม่ยอม
ถูกสยบโดยความมืด!",光は闇に負けたことがないものとします。
DIALOG_AT_006_022,Just shut up and surrender.,ทำไมแกไม่หุบปาก แล้วยอมแพ้ไปซะ,ただ、シャットアップと降伏。
DIALOG_AT_006_023,I CAN FEEL THE POWER OF DARKNESS FLOWING THROUGH ME!,อาาาห์...พลังแห่งความมืด ข้ารู้สึกได้,私はMEを流れる闇の力を感じることができます！
TEXT_ADVENTURE_TITLE_REWARD,Stage Rewards,รางวัลการผจญภัย,ステージ報酬
TEXT_ADVENTURE_BODY_REWARD,You've got the following reward:,คุณได้รางวัลดังนี้,あなたは、以下の報酬を持っています：
TEXT_ADVENTURE_UI_STAGE,Stage,ด่าน,ステージ