%YAML 1.1
%TAG !u! tag:unity3d.com,2011:
--- !u!1045 &1
EditorBuildSettings:
  m_ObjectHideFlags: 0
  serializedVersion: 2
  m_Scenes:
  - enabled: 1
    path: Assets/Scenes/0_LoginScene.unity
    guid: 59e891b0b7bd9ca49b0254cb9384fe38
  - enabled: 1
    path: Assets/Scenes/1_Navigator.unity
    guid: 4ee127328fd99aa4bb7f28b4b5e15878
  - enabled: 1
    path: Assets/Scenes/2_Home.unity
    guid: 62dc93503fb3ab545b210d9cdb64a2a5
  - enabled: 1
    path: Assets/Scenes/2_Guild.unity
    guid: efb8f1863bdee72489223bf34ba62fc0
  - enabled: 1
    path: Assets/Scenes/2_Shop.unity
    guid: 4e5880eda3bd3e343ba1dba75af47b44
  - enabled: 1
    path: Assets/Scenes/2_Collection.unity
    guid: a2932ae41b6ab11489b7f547e678e53a
  - enabled: 1
    path: Assets/Scenes/2_StarExchangeScene.unity
    guid: 2d2b30110dd501a49acd6aa48fdd907e
  - enabled: 1
    path: Assets/Scenes/2A_PackOpening.unity
    guid: 21b2f9294221f164691f7ca954b84cb0
  - enabled: 1
    path: Assets/Scenes/2A_MainEventScene.unity
    guid: 6dd6312642a595546abba8b788ed747b
  - enabled: 1
    path: Assets/Scenes/2A_EventBattleScene.unity
    guid: fb3b8edfbd2511748839779790f37cd4
  - enabled: 1
    path: Assets/Scenes/2A_LobbyScene.unity
    guid: 7daa4750232a8e44b97a08c837e283bc
  - enabled: 1
    path: Assets/Scenes/3_BattleScene.unity
    guid: 9d94b85130fb1c34faf0684fcc0f6d28
  - enabled: 1
    path: Assets/Scenes/3A_BattleUIScene.unity
    guid: 30c6cc536c011134ab539d91163f5067
  - enabled: 1
    path: Assets/Scenes/EventTemplateScenes/1A_EventQuest.unity
    guid: f444b651d2128884e9c1abae57671b99
  - enabled: 1
    path: Assets/Scenes/EventTemplateScenes/1A_EventVisitStall.unity
    guid: b8fc205dd05dee24384d3cb50ed62545
  - enabled: 1
    path: Assets/Scenes/EventTemplateScenes/1A_EventRPS_2.unity
    guid: f621ca021f7b9d54885fe6ae155c6edb
  - enabled: 1
    path: Assets/Scenes/EventTemplateScenes/1A_EventPrepareGift2.unity
    guid: f612738d559e61245b586548c0d5dde2
  - enabled: 1
    path: Assets/Scenes/EventTemplateScenes/EventDailyReward.unity
    guid: 91a3d09954a8870448d12cf69d55c5dd
  - enabled: 1
    path: Assets/Scenes/Test/CardListScene.unity
    guid: f1be7935029d47e4ca7007bbcdb1629f
  - enabled: 1
    path: Assets/Scenes/EventTemplateScenes/1A_EventRaidBoss_2.unity
    guid: 45d8c2198a387a240a1410dfcdd01e44
  - enabled: 1
    path: Assets/Scenes/EventTemplateScenes/EventDailyReward_2.unity
    guid: 82001f0a3421fcb4491d41421a6735c0
  - enabled: 1
    path: Assets/Scenes/EventTemplateScenes/1A_EventBingo4x4_2.unity
    guid: dfc5cf0fc209296459d8f619f3887096
  - enabled: 1
    path: Assets/Scenes/EventTemplateScenes/1A_EventGiftSending.unity
    guid: c245fddd35168d4478bd590ca351e152
  - enabled: 1
    path: Assets/Scenes/Test/_DebugSoulAttack.unity
    guid: 491a7475e5632644abaf936dded75728
  - enabled: 1
    path: Assets/Scenes/Test/_DebugSpawnUnit.unity
    guid: 2682b04562ad2f44998187e541ab2487
  m_configObjects: {}
