%YAML 1.1
%TAG !u! tag:unity3d.com,2011:
--- !u!114 &11400000
MonoBehaviour:
  m_ObjectHideFlags: 0
  m_CorrespondingSourceObject: {fileID: 0}
  m_PrefabInstance: {fileID: 0}
  m_PrefabAsset: {fileID: 0}
  m_GameObject: {fileID: 0}
  m_Enabled: 1
  m_EditorHideFlags: 0
  m_Script: {fileID: 11500000, guid: ffdb59321f5aa47a48670265007a796b, type: 3}
  m_Name: ChartboostSettings
  m_EditorClassIdentifier: 
  iOSAppId: 5d529b737e17c90e1b1c8519
  iOSAppSecret: 674caa04f2814db75e46790d673785102ab73be4
  androidAppId: 5c652aefbc40b219e6ae0129
  androidAppSecret: 9ebbafb3d8d2f8ce08790a9c6f95e0b2cf917d5e
  amazonAppId: CB_AMAZON_APP_ID
  amazonAppSecret: CB_AMAZON_APP_SIGNATURE
  isLoggingEnabled: 1
  androidPlatformLabels:
  - Google Play
  - Amazon
  selectedAndroidPlatformIndex: 0
