Hero ID,Hero Name,"Hero
Image Key",Element ID,IsListing,"Active Power
Effect Key",Skill Card,Skill Quantity,Skill Description
HT0001,Orc Warrior,IHT0001,FIRE,FALSE,DEFAULT,-,0,-
HT0002,Death Knight,IHT0002,DARK,FALSE,DEFAULT,-,0,-
HT0003,Guardian Golem,IHT0003,EARTH,FALSE,DEFAULT,-,0,-
HA0001,Tundra Warrior,IHA0001,NEUTRAL,FALSE,DEFAULT,-,0,-
HA0002,Plain Walker,IHA0002,NEUTRAL,FALSE,DEFAULT,-,0,-
HA0003,Guardian Golem,IHA0003,NEUTRAL,FALSE,DEFAULT,-,0,-
HA0004,Lion Warrior,IHA0004,NEUTRAL,FALSE,DEFAULT,-,0,-
HA0005,Skeleton Warrior,IHA0005,NEUTRAL,FALSE,DEFAULT,-,0,-
HA0006,Holy Knight,IHA0006,NEUTRAL,FALSE,DEFAULT,-,0,-
HT0001_NEW,Grant ,IHT0001_NEW,NEUTRAL,FALSE,DEFAULT,-,0,-
HT0002_NEW,Kaare ,IHT0002_NEW,EARTH,FALSE,DEFAULT,-,0,-
HT0003_NEW,Sheila ,IHT0003_NEW,EARTH,FALSE,DEFAULT,-,0,-
HT0004_NEW,Mephisto ,IHT0004_NEW,DARK,FALSE,DEFAULT,-,0,-
HE0001,Aloha Gragros,IHE0001,EARTH,FALSE,DEFAULT,-,0,-
HE0002,Kenshin,IHE0002,AIR,FALSE,DEFAULT,-,0,-
HE0003,Minotuar,IHE0003,FIRE,FALSE,DEFAULT,-,0,-
HE0004,Grave Pumkin Demon,IHE0004,DARK,FALSE,DEFAULT,-,0,-
HE0005,Forgotten Army,IHE0005,NEUTRAL,FALSE,DEFAULT,-,0,-
HE0006,Grizzly Bear,IHE0006,NEUTRAL,FALSE,DEFAULT,-,0,-
HE0007,หมาถุง ?,IHE0007,NEUTRAL,FALSE,DEFAULT,-,0,-
HE0008,Sun-loong,IHE0008,NEUTRAL,FALSE,DEFAULT,-,0,-
HE0009,Dragonia Blader,IHE0009,FIRE,FALSE,DEFAULT,-,0,-
HE0010,Druid,IHE0010,EARTH,FALSE,DEFAULT,-,0,-
H0001,อเล็กซ์,IH0001,FIRE,TRUE,DEFAULT,-,0,-
H0001_SUMMER_2019,อเล็กซ์ ชุดว่ายน้ำ 2019,IH0001_SUMMER_2019,FIRE,TRUE,ALEX_SUMMER19,-,0,-
H0002,เทียร์,IH0002,WATER,TRUE,DEFAULT,-,0,-
H0002_SUMMER_2019,เทียร์ ชุดว่ายน้ำ 2019,IH0002_SUMMER_2019,WATER,TRUE,TEAR_SUMMER19,-,0,-
H0002_VALENTINE_2020,เทียร์ เทพีแห่งความรัก 2020,IH0002_VALENTINE_2020,WATER,TRUE,TEAR_VALENTINE20,-,0,
H0003,บรันโด้,IH0003,EARTH,TRUE,DEFAULT,-,0,-
H0003_FESTIVAL_2019,บรันโด้ เทศกาลหน้าร้อน 2019,IH0003_FESTIVAL_2019,EARTH,TRUE,BRUNDO_FESTIVAL19,-,0,-
H0004,ราลาน่า,IH0004,AIR,TRUE,DEFAULT,-,0,-
H0004_FESTIVAL_2019,ราลาน่า เทศกาลหน้าร้อน 2019,IH0004_FESTIVAL_2019,AIR,TRUE,RALANA_FESTIVAL19,-,0,-
H0004_HALLOWEEN_2019,ราลาน่า ฮาโลวีน 2019,IH0004_HALLOWEEN_2019,AIR,TRUE,RALANA_HALLOWEEN19,-,0,-
H0004_SPRING_2020,ราลาน่า สวนดอกไม้ 2020,IH0004_SPRING_2020,AIR,TRUE,RALANA_SPRING20,-,0,-
H0005,ซาเดีย,IH0005,HOLY,TRUE,DEFAULT,-,0,-
H0005_VALENTINE_2019,ซาเดีย วาเลนไทน์ 2019,IH0005_VALENTINE_2019,HOLY,TRUE,SADIA_VALENTINE19,-,0,-
H0005_SCHOOL_2019,ซาเดีย โรงเรียน 2019,IH0005_SCHOOL_2019,HOLY,TRUE,SADIA_SCHOOL19,-,0,-
H0005_LUNAR_2020,ซาเดีย ชุดกี่เพ้า 2020,IH0005_LUNAR_2020,HOLY,TRUE,SADIA_LUNAR20,-,0,-
H0006,ทาร์ทารัส,IH0006,DARK,TRUE,DEFAULT,-,0,-
H0006_VALENTINE_2019,ทาร์ทารัส วาเลนไทน์ 2019,IH0006_VALENTINE_2019,DARK,TRUE,TATARUS_VALENTINE19,-,0,-
H0007,แมรี่,IH0007,HOLY,TRUE,MARY,-,0,-
H0007_XMAS_2019,แมรี่ คริสต์มาส 2019,IH0007_XMAS_2019,HOLY,TRUE,MARY_XMAS19,-,0,-
H0007_EASTER_2020,แมรี่ อีสเตอร์ 2020,IH0007_EASTER_2020,HOLY,FALSE,DEFAULT,-,0,-
H0008,นิกซ์,IH0008,DARK,TRUE,NYX,-,0,-
H0008_SCHOOL_2019,นิกซ์ โรงเรียน 2019,IH0008_SCHOOL_2019,DARK,TRUE,NYX_SCHOOL19,-,0,-
H0008_SNOW_2019,นิกซ์ สโนว์ 2019,IH0008_SNOW_2019,DARK,TRUE,NYX_SNOW19,-,0,-
H0008_SONGKRAN_2020,นิกซ์ สงกรานต์ 2020,IH0008_SONGKRAN_2020,DARK,FALSE,DEFAULT,-,0,-
H0009,ซาบอน,IH0009,HOLY,FALSE,DEFAULT,-,0,-
H0010,มาร์สแมน ฮาโลวีน 2019,IH0010,EARTH,TRUE,MASKMAN_HALLOWEEN19,-,0,-
H0011,Sherah ชีราห์,IH0011,FIRE,FALSE,DEFAULT,-,0,-
H0012,Valon วาลอน,IH0012,WATER,FALSE,DEFAULT,-,0,-
H0013,Floryn ฟลอริน,IH0013,EARTH,FALSE,DEFAULT,-,0,-
H0014,Caim ไคม์,IH0014,AIR,FALSE,DEFAULT,-,0,-
H0015,Varastar วาราสตาร์,IH0015,DARK,FALSE,DEFAULT,-,0,-
H0016,Jala Dragon Summoner,IH0016,FIRE,TRUE,JALA,-,0,-
HE0011,"Rex, King of Iron Flame",IHE0010,FIRE,FALSE,DEFAULT,-,0,-
HE0012,"Rook , Blokade the Fortress",IHE0011,EARTH,FALSE,DEFAULT,-,0,-
HE0013,"Tara, Khun of North sea",IHE0012,WATER,FALSE,DEFAULT,-,0,-
HE0014,"Rey, King of West Wind",IHE0013,AIR,FALSE,DEFAULT,-,0,-
HE0015,"Karalis, King of Shadow",IHE0014,DARK,FALSE,DEFAULT,-,0,-
HE0016,"King , Keres the Kuningas",IHE0015,HOLY,FALSE,DEFAULT,-,0,-
H0001_FORM_2,Alex 2,IH0001,FIRE,TRUE,AWAKEN1,-,0,-
H0002_FORM_2,Tear 2,IH0002,WATER,TRUE,AWAKEN1,-,0,-
H0003_FORM_2,Brundo 2,IH0003,EARTH,TRUE,AWAKEN1,-,0,-
H0004_FORM_2,Ralana 2,IH0004,AIR,TRUE,AWAKEN1,-,0,-
H0005_FORM_2,Sadia 2,IH0005,HOLY,TRUE,AWAKEN1,-,0,-
H0006_FORM_2,Tatarus 2,IH0006,DARK,TRUE,AWAKEN1,-,0,-
HE0017,Ivah,IHE0017,DARK,FALSE,DEFAULT,-,0,-
HE0018,HERO water 373,IHE0018,WATER,FALSE,DEFAULT,-,0,-