,English,Thai,Japanese
CARD_NAME_C0001OLD,Bladewanderer,นักดาบพเนจร,ソードマン
CARD_NAME_C0002OLD,"Meji, the Magician Girl",เมจิ สาวน้อยนักเวทย์,メジリトルメイジ
CARD_NAME_C0003OLD,Backstreet Thief,โจรแห่งตรอกลับ,泥棒
CARD_NAME_C0004OLD,"Irin, the Healer",ไอริน ผู้รักษา,イリン慈善家の少女
CARD_NAME_C0005OLD,Berserk Warrior,นักรบคลั่ง,勇敢な戦士
CARD_NAME_C0006OLD,Lunar Demon,อสุราแห่งจันทรา,チャンドラのアルコール
CARD_NAME_C0007OLD,Key Master,เซียนกุญแจ,キーマスター
CARD_NAME_C0008OLD,Blade Tail Fox,จิ้งจอกหางดาบ,フォックステール
CARD_NAME_C0009OLD,Soul Tree,ต้นไม้วิญญาณ,木の喫煙の生活
CARD_NAME_C0010OLD,Gragros The  Immortal,กรากรอส เต่าพันปี,クロウの雄鶏、千年
CARD_NAME_C0011OLD,Ninja of the Red Moon,นินจาจันทราเลือด,血まみれの忍者
CARD_NAME_C0012OLD,"Vladimir, the Bloodthirst",วลาดิเมียร์ จอมกระหายเลือด,ウラジミール
CARD_NAME_C0013OLD,Eboros The Frozen Deep,อีโบลอส อสูรน้ำแข็ง,エボリ、レイヴの海
CARD_NAME_C0014OLD,"Bamoss, Dragon of the Deep",บามอส มังกรแห่งถ้ำลึก,深い洞窟のドラゴンボール
CARD_NAME_C0015OLD,Thunder Unicorn,ยูนิคอนสายฟ้า,ユニコーンボルト
CARD_NAME_C0016OLD,Guardian Golem,โกเลมผู้พิทักษ์,ゴールキーパー
CARD_NAME_C0017OLD,Shield Knight,อัศวินโล่ห์,騎士盾巨人
CARD_NAME_C0018OLD,Support Marksman,พลธนูสนับสนุน,アーチャー精密
CARD_NAME_C0019OLD,Heavy Knight,อัศวินเกราะหนัก,重装甲騎士
CARD_NAME_C0020OLD,Artillery Cannon,พลปืนใหญ่องครักษ์,砲兵
CARD_NAME_C0021OLD,Obsidian Knight,อัศวินเกราะทมิฬ,戦士野蛮人
CARD_NAME_C0022OLD,"Nile, Elf of the Light",ไนล์ เอลฟ์แห่งแสง,光のナイル
CARD_NAME_C0023OLD,Sheila the Broodmother,ชีล่าห์ นางพญาแมลง,昆虫の女王シイラ
CARD_NAME_C0024OLD,Death Knight,อัศวินแห่งความตาย,死の騎士
CARD_NAME_C0025OLD,Cerberus,เซอร์เบอรัส,ケルベロス
CARD_NAME_C0026OLD,"Nore, the Elven Ranger",โนเร่ เอลฟ์นักธนู,Nore エルフ少女アーチャー
CARD_NAME_C0027OLD,"Garren, the Fighter",กาเรน นักสู้มือเปล่า,キャリー・ファイター
CARD_NAME_C0028OLD,Yellow Slime,สไลม์เหลือง,イエロースライダー
CARD_NAME_C0029OLD,Nerida Tidal Keeper,เนอริด้า ผู้พิทักษ์แห่งเกลียวคลื่น,海の人魚
CARD_NAME_C0030OLD,Death Wolf,หมาป่ามรณะ,デス・オルフ
CARD_NAME_C0031OLD,Wild Boar,หมูป่าบ้าเลือด,イノシシ
CARD_NAME_C0032OLD,Shocktrooper,พลทะลวงฟัน,歯を白くする
CARD_NAME_C0033OLD,Arim The Pilgrim,อาริม ผู้แสวงบุญ,アリムピルグリム
CARD_NAME_C0034OLD,"Grant, the Destroyer",กรันท์ จอมทำลายล้าง,ガンダー
CARD_NAME_C0035OLD,Mysterious Man,บุรุษลึกลับ,神秘的な男
CARD_NAME_C0036OLD,Nightmare Beast,อสูรรัตติกาล,アンブローズクロー
CARD_NAME_C0037OLD,"Taria, Whirlwind Demon",ทาร์เรีย อสูรลมกรด,おうし座マージン
CARD_NAME_C0038OLD,Golden Armor Falcon,พญาเหยี่ยวเกราะทอง,ゴールデンホークアーマー
CARD_NAME_C0039OLD,Grand Knight,หัวหน้าอัศวิน,グランドナイト
CARD_NAME_C0040OLD,Royal Quartermaster,เสนาธิการกองทัพ,スタッフチーフ
CARD_NAME_C0041OLD,Suicide Zombie,ซอมบี้อาฆาต,ライブ壁紙
CARD_NAME_C0042OLD,Gara the Bloodseeker,การะ ผู้บูชาเลือด,献血者
CARD_NAME_C0043OLD,Holy Knight,อัศวินแห่งแสง,白い騎士
CARD_NAME_C0044OLD,Holy Priest,บาทหลวงแห่งแสง,ルーファスの会計担当者
CARD_NAME_C0045OLD,Senior Officer,นายทหารอาวุโส,幹部役員
CARD_NAME_C0046OLD,Trident Warrior,นักรบตรีศูล,トライデントの戦士
CARD_NAME_C0047OLD,Scarlet Wings Seraft,เซรัฟ ปีกสีชาด,スカーレットウイングス
CARD_NAME_C0048OLD,Gilliem The Advisor,กิลเลี่ยม จอมวางแผน,ギルモアプランナー
CARD_NAME_C0049OLD,"Fiona, Phoenix Warrior",ฟีโอน่า นักรบฟีนิกซ์,フィオナフェニックスの戦士
CARD_NAME_C0050OLD,"Sophia, Soul Navigator",โซเฟีย ผู้ขับลำนำวิญญาณ,純粋な光のソフィア
CARD_NAME_C0051OLD,Sod the Quake,ซ็อดด์ ผู้สะเทือนปฐพี,すみません。
CARD_NAME_C0052OLD,"Mephisto, King of Hell",เมฟิสโต ราชานรก,地獄のメフィストキング
CARD_NAME_C0053OLD,"Icarus, Son of the Wind",อิคารัส บุตรแห่งสายลม,イカルス、風の息子
CARD_NAME_C0054OLD,Grace the Frost Guardian,เกรซ ผู้พิทักษ์น้ำแข็ง,グレースウォリアー
CARD_NAME_C0055OLD,Insect Guardian,แมลงองครักษ์,昆虫の骨
CARD_NAME_C0056OLD,Red Slime,สไลม์แดง,赤いスライム
CARD_NAME_C0057OLD,Nightmare Minion,สมุนรัตติกาล,アンブローズトッカー
CARD_NAME_C0058OLD,Minion Wolf,สมุนหมาป่า,アルファウルフ
CARD_NAME_C0059OLD,"Alicia, Snow Queen",อลิเซีย ราชินีหิมะ,アリシア・スノー・クイーン
CARD_NAME_C0060OLD,Ivy Forest Enchanter,ไอวี่ ผู้วิเศษแห่งพงไพร,アイビー・ブドウの葉
CARD_NAME_C0061OLD,Fireball,ไฟร์บอล,火球
CARD_NAME_C0062OLD,Hellfire,เฮลไฟร์,ヘルファイア
CARD_NAME_C0063OLD,Meteor,เมเทโอ,流星
CARD_NAME_C0064OLD,Explosive power,ระเบิดพลัง,爆発力
CARD_NAME_C0065OLD,Arcane Alchemist,นักแปรธาตุ,錬金術師
CARD_NAME_C0066OLD,World Class Magician,เวิลด์คลาสเมจิกเชี่ยน,世界クラスの魔術師
CARD_NAME_C0067OLD,Glacier Dragon,มังกรเยือกแข็ง,グラシアスドラゴン
CARD_NAME_C0068OLD,"Incedius, Flame Warrior",นักรบเพลิง อินเซดิส,消防士、インディー
CARD_NAME_C0069OLD,Morden the Fiend Warrior,มอร์เดน นักรบอสูร,モーデン戦闘機
CARD_NAME_C0070OLD,"Philipa, the Black Mirror",ฟิลิปป้า กระจกสีนิล,フィリップ・ザ・ブラック・ミラー
CARD_NAME_C0071OLD,Medusa,เมดูซ่า,メデューサ
CARD_NAME_C0072OLD,Zharock The Quad Slasher,ชาร์ร๊อค อสูรสี่สะบั้น,シャーロッツヴィル
CARD_NAME_C0073OLD,Skeleton Warrior,นักรบโครงกระดูก,スケルトンウォリアーズ
CARD_NAME_C0073AOLD,Skeleton Minion,สมุนโครงกระดูก,スケルトンウォリアーズ
CARD_NAME_C0073BOLD,Skeleton Minion,สมุนโครงกระดูก,スケルトンウォリアーズ
CARD_NAME_C0074OLD,Centaur Golem,เซนทอร์โกเลม,センタービル
CARD_NAME_C0075OLD,Spectre Hydrozoa,แมงกะพรุนแช่แข็ง,クラゲ
CARD_NAME_C0076OLD,Stone Worm,หนอนศิลา,ストーンウォーム
CARD_NAME_C0077OLD,The Beholder,บีโฮลเดอร์,B.ホルダー
CARD_NAME_C0078OLD,Merman Champion,ยอดนักรบเมอร์แมน,モルモン
CARD_NAME_C0079OLD,Dark Elven Hunter,ดาร์คเอลฟ์นักล่า,タミルの森の弓師
CARD_NAME_C0080OLD,Zandora,ซานโดร่า,サンダル
CARD_NAME_C0081OLD,"Regear, Angel of Fortune",เรเกีย เทวดาหยั่งรู้,京都の神秘的な天使
CARD_NAME_C0082OLD,Spellbinder,สเปลไบเดอร์,スペードバンダ
CARD_NAME_C0083OLD,Cyclone Spirit,จิตวิญญาณแห่งวายุ,風の精神
CARD_NAME_C0084OLD,Tidal Spirit,จิตวิญญาณแห่งสายน้ำ,水の精神
CARD_NAME_C0085OLD,Flame Spirit,จิตวิญญาณแห่งเปลวไฟ,火の精神
CARD_NAME_C0086OLD,Earth Spirit,จิตวิญญาณแห่งผืนดิน,地球の精神
CARD_NAME_C0087OLD,War Elephant,ช้างศึก,戦争象
CARD_NAME_C0088OLD,Orc Rider,ออร์ค ไรเดอร์,オークライダー
CARD_NAME_C0089OLD,Minotaur Fighter,นักสู้มิโนทอร์,ミノタウルス
CARD_NAME_C0090OLD,Naga Gate Keeper,นากา ผู้เฝ้าประตู,中堅のキーパー
CARD_NAME_C0091OLD,"Femris, the Pathfinder",เฟมริส ผู้บุกเบิก,パイオニア
CARD_NAME_C0092OLD,Great Horn Rabbit,กระต่ายเขายักษ์,彼の巨大なウサギ
CARD_NAME_C0093OLD,Little Fairy,ภูตจิ๋ว,神の呪い
CARD_NAME_C0094OLD,Giant Earth Worm,ไส้เดือนปฐพี,ジャイアントミミズ
CARD_NAME_C0095OLD,Heart of the Ocean,ดวงใจแห่งมหาสมุทร,私はあなたを愛しています。
CARD_NAME_C0096OLD,Spirit of feud,วิญญาณอาฆาต,霊魂
CARD_NAME_C0097OLD,Guardian Mage,จอมเวทย์ผู้พิทักษ์,保護壁
CARD_NAME_C0098OLD,Kee-Kee Doll,ตุ๊กตาจอมกวน,ペストリー
CARD_NAME_C0099OLD,Screamer,ผู้กรีดร้อง,ディプフィア
CARD_NAME_C0100OLD,Cursed Soul Gem,อัญมณีวิญญาณต้องสาป,魔女の宝石
CARD_NAME_C0101OLD,Chaka of the Mountain,ชาก้าแห่งขุนเขา,山のチャガ
CARD_NAME_C0102OLD,Neos Flaming Knee,เนออสแข้งอัคคี,ネオスの打撃シャンク
CARD_NAME_C0103OLD,Blademaster Alma,อัลม่า จอมดาบ,北風のアルマ
CARD_NAME_C0104OLD,"Jhona, Dark Shaman",โจน่า ดาร์คชาแมน,ジョナサンダーリン
CARD_NAME_C0105OLD,Baby Imp,เบบี้ อิมพ์,ベイビーフェイス
CARD_NAME_C0106OLD,Guiding Fairy,แฟรี่นำทาง,ガーディアンフェアリー
CARD_NAME_C0107OLD,War Wolf,หมาป่าสงคราม,戦争狼
CARD_NAME_C0108OLD,Elle Stormfan,เอลี่ พัดวายุ,エルファンの戦闘機
CARD_NAME_C0109OLD,Chacha Wild Hunter,ชาช่า นักล่าแดนเถื่อน,チャチャワイルドハンター
CARD_NAME_C0110OLD,Rookie Warrior,นักรบฝึกหัด,初心者の戦士
CARD_NAME_C0111OLD,Yona Divine Acolyte,โยน่า นักบวชเทวะ,仲間役
CARD_NAME_C0112OLD,Plain Walker,นักรบสัตว์อสูร,アリーナミノタウルス
CARD_NAME_C0113OLD,Minotaur,มิโนทอร์,ハイランド・ミノタウルス
CARD_NAME_C0114OLD,Goblin Warrior,ก็อบลินนักรบ,ゴブリンの戦士
CARD_NAME_C0115OLD,Goblin Archer,ก็อบลินนักธนู,ゴブリンアーチャー
CARD_NAME_C0116OLD,King Slime,ราชาสไลม์,キングスライム
CARD_NAME_C0117OLD,Rookie Knight,อัศวินฝึกหัด,初心者の騎士
CARD_NAME_C0118OLD,Apprentice Magician,นักเวทย์ฝึกหัด,見習い
CARD_NAME_C0119OLD,Lizardman Champion,ลิซาร์ด เจ้าหนองน้ำ,マーシュ・リザード
CARD_NAME_C0120OLD,Giant Slime,สไลม์ยักษ์,ジャイアントスライム
CARD_NAME_C0121OLD,Queen Slime,ราชินีสไลม์,スライム戦士
CARD_NAME_C0122OLD,Arena Fighter,นักสู้สังเวียน,アリーナファイター
CARD_NAME_C0123OLD,Dryad of Sacred Wood,นางไม้แห่งป่าศักดิ์สิทธิ์,ドライアド
CARD_NAME_C0124OLD,Savage Fighter,นักสู้อำมหิต,野蛮人の肉屋
CARD_NAME_C0125OLD,Ren The Sword Master,เรน จอมดาบ,サベージランサー
CARD_NAME_C0126OLD,Ice Ball,บอลน้ำแข็ง,青い頭蓋骨
CARD_NAME_C0127OLD,Beetle Fighter,ด้วงนักสู้,ビートル戦闘機
CARD_NAME_C0128OLD,Wind Harpy,ฮาร์ปี้แห่งสายลม,ウィンド・ハーピー
CARD_NAME_C0129OLD,Lion Warrior,นักรบสิงโต,ライオンの戦士
CARD_NAME_C0130OLD,Skull Screamer,กระโหลกโหยหวน,頭蓋骨の叫び声
CARD_NAME_C0131OLD,Vengeful Skull,กระโหลกอาฆาต,緑の頭蓋骨
CARD_NAME_C0132OLD,Robber Squirrel,กระรอกหัวขโมย,強盗ウサギ
CARD_NAME_C0133OLD,Stone Totem,เสาหิน,ストーントーテム
CARD_NAME_C0134OLD,Griffin,กริฟฟิน,グリフィン
CARD_NAME_C0135OLD,Tundra Warrior,นักรบแดนเยือกแข็ง,冬の戦士
CARD_NAME_C0136OLD,Bandura Man Eater,บันดูล่า ต้นไม้กินคน,バンドラ
CARD_NAME_C0137OLD,Robber Lizard,ลิซาร์ดหัวขโมย,強盗トカゲ
CARD_NAME_C0138OLD,Wild Blade Assassin,นักฆ่าไวลด์เบลด,野生の刃アサシン
CARD_NAME_C0139OLD,Wild Blade Shaman,ไวลด์เบลดหมอผี,ワイルドブレードシャーマン
CARD_NAME_C0140OLD,Elf Blader,เอลฟ์นักดาบ,エルフの剣
CARD_NAME_C0141OLD,Deer Horn Rabbit,กระต่ายเขากวาง,鹿の角のウサギ
CARD_NAME_C0142OLD,Goat Horn Rabbit,กระต่ายเขาแกะ,ヤギホーンウサギ
CARD_NAME_C0143OLD,Rushing Rabbit,กระต่ายบุกทะลวง,ホーンウサギリーダー
CARD_NAME_C0144OLD,Singer Frog,กบนักร้อง,カエル歌手
CARD_NAME_C0145OLD,Giant Swordfish,ปลาดาบยักษ์,メカジキ
CARD_NAME_C0146OLD,Bison Fighter,นักสู้ไบซัน,バイソンの戦闘機
CARD_NAME_C0147OLD,Queen of Pain,ผู้บงการความเจ็บปวด,炎シャルロック
CARD_NAME_C0148OLD,Leo The Flame Riser,ลีโอ อัคคีโหมกระหน่ำ,タイガー兵士
CARD_NAME_C0149OLD,Cheetah Hunter,ชีต้าร์นายพราน,チーターハンター
CARD_NAME_C0150OLD,Jellyfish Girl,สาวน้อยกะพรุน,アクエリアンクラゲ
CARD_NAME_C0151OLD,Cecaelia,อสูรซีเซเลีย,アクエリアンタコ
CARD_NAME_C0152OLD,Lana the Fan Caster,ลาน่า แฟนแคสเตอร์,ラナファンキャスター
CARD_NAME_C0153OLD,Messenger Knight,อัศวินผู้ส่งสาร,メッセンジャーの騎士
CARD_NAME_C0154OLD,Church Knight,อัศวินแห่งวิหาร,教会の騎士
CARD_NAME_C0155OLD,Vanguard Knight,อัศวินทัพหน้า,ヴァンガードナイト
CARD_NAME_C0156OLD,Medic Knight,อัศวินแพทย์สนาม,メディックの騎士
CARD_NAME_C0157OLD,Holy Lancer,พลหอกแห่งแสง,ホーリーランサー
CARD_NAME_C0158OLD,Sacred Swordsman,พลดาบศักดิ์สิทธิ์,聖なる剣士
CARD_NAME_C0159OLD,Sacred Maskman,พลปืนศักดิ์สิทธิ์,セイクリッドMaskman
CARD_NAME_C0160OLD,Sacred Magician,พลเวทย์ศักดิ์สิทธิ์,聖なる魔術師
CARD_NAME_C0161OLD,"Brianna, Sacred Sword",บริอันนา ดาบศักดิ์สิทธิ์,ブリアナ、聖なる剣
CARD_NAME_C0162OLD,Magic Knight,อัศวินจอมเวทย์,魔法騎士
CARD_NAME_C0163OLD,Adriel Knight Commander,เอเดรล ผู้บัญชาการอัศวิน,エイドリエル騎士司令官
CARD_NAME_C0164OLD,Eternity Dragon,มังกรนิรันดร์,永遠のドラゴン
CARD_NAME_C0165OLD,"Fena, Knight of Pure Shade ",เฟน่า อัศวินแสงบริสุทธิ์,FENA、ピュアシェードの騎士
CARD_NAME_C0166OLD,Celestial Warrior,เซเลสเชียลนักรบ,天体戦士
CARD_NAME_C0167OLD,"Miguel, Celestial Marshal",มิเกล จอมพลเซเลสเชียล,ミゲル、天の元帥
CARD_NAME_C0168OLD,Celestial Dragon Rider,เซเลสเชียลนักรบมังกร,天体ドラゴンライダー
CARD_NAME_C0169OLD,Celestial Artifact,รูปสลักแห่งเซเลสเชี่ยล,天のアーティファクト
CARD_NAME_C0170OLD,"Laius, Star Ruler",ไลอัส ผู้ควบคุมดวงดารา,ラーイオス、スタールーラー
CARD_NAME_C0171OLD,Sword Spirit,วิญญาณแห่งคมดาบ,剣スピリット
CARD_NAME_C0172OLD,Lightning Summoner,ผู้อัญเชิญสายฟ้า,ライトニングサモナー
CARD_NAME_C0173OLD,Army Flagman,พลธงสัญญาณ,陸軍Flagman
CARD_NAME_C0174OLD,Sagit the Chimera,คิเมร่า ซาจิต,キメラをSagit
CARD_NAME_C0175OLD,Spell Blader,เซียนดาบเวทย์มนต์,ブレイダースペル
CARD_NAME_C0176OLD,White Mage,จอมเวทย์ขาว,白魔道士
CARD_NAME_C0177OLD,Nuns of Light,แม่ชีแห่งแสง,ライトの修道女
CARD_NAME_C0178OLD,Death Collector,ผู้สะสมความตาย,死コレクター
CARD_NAME_C0179OLD,Bevin the Ambusher,เบวิน พลซุ่มโจมตี,Ambusher Bevinの
CARD_NAME_C0180OLD,"Fuka, Furious Gale",ฟูกะ พายุคลั่ง,風香、激怒ゲイル
CARD_NAME_C0181OLD,Mika the Flame Lord,ไมก้า จักรพรรดินีอัคคี,ミカ炎の主
CARD_NAME_C0182OLD,"Bovinae, Lord of Chaos",โบวิเน เจ้าแห่งความโกลาหล,ウシ亜科、カオスの主
CARD_NAME_C0183OLD,"Pomola, Flame Summoner",โพโมลา ผู้อัญเชิญเพลิง,Pomola、炎サモナー
CARD_NAME_C0184OLD,"Huska, Volcanic Dragon",ฮัสก้า มังกรภูเขาเพลิง,Huska、火山ドラゴン
CARD_NAME_C0185OLD,"Binah, Rock Piercer",บีนาห์ หมัดทะลวงภูผา,Binah、ロックピアサー
CARD_NAME_C0186OLD,Earth Dragon,มังกรปฐพี,地球ドラゴン
CARD_NAME_C0187OLD,Flame Caster,นักเวทย์แห่งไฟ,炎キャスター
CARD_NAME_C0188OLD,War Horn Singer,นักบรรเลงแตรสงคราม,戦争ホーンシンガー
CARD_NAME_C0189OLD,Dragonia Fighter,นักสู้มังกร,Dragoniaファイター
CARD_NAME_C0190OLD,Dragonia Blader,นักดาบมังกร,Dragoniaブレイダー
CARD_NAME_C0191OLD,Skull Crusher,ผู้ป่นกระโหลก,スカルクラッシャー
CARD_NAME_C0192OLD,Crimson Javelin,หอกสีชาด,クリムゾンジャベリン
CARD_NAME_C0193OLD,Axe Runner,ขุนขวานจอมตะลุย,アックスランナー
CARD_NAME_C0194OLD,Orc Warlord,จอมทัพออร์ค,オーク将軍
CARD_NAME_C0195OLD,Ifrit,อิฟริท,イフリート
CARD_NAME_C0196OLD,Inferno Lion,สิงโตเพลิง,インフェルノライオン
CARD_NAME_C0197OLD,Dragon Girl,น้องมังกร,ドラゴンガール
CARD_NAME_C0198OLD,Chimera Leonis,คิเมร่า เลโอนิส,キメラレオニス
CARD_NAME_C0199OLD,Orc Warrior,นักรบออร์ค,オークウォリアー
CARD_NAME_C0200OLD,Goblin Bomber,ก็อบลินมือระเบิด,ゴブリンボンバー
CARD_NAME_C0201OLD,Goblin Mage,นักเวทย์ก็อบลิน,ゴブリンメイジ
CARD_NAME_C0202OLD,Spear Girl,พลหอก,スピアガール
CARD_NAME_C0203OLD,Heat Wave,ผู้กล้าจิ๋ว,熱波
CARD_NAME_C0204OLD,Fire Minion,สมุนแห่งเปลวไฟ,火ミニオン
CARD_NAME_C0205OLD,"Linus, Mighty Flame",ไลนัสแห่งเพลิงกัลป์,ライナス、マイティ炎
CARD_NAME_C0206OLD,Vengeful Flame,ไฟอาฆาต,復讐の炎
CARD_NAME_C0207OLD,Baphomet,บาโฟเมท,バフォメット
CARD_NAME_C0208OLD,Winter Soul,วิญญาณเหมันต์,冬ソウル
CARD_NAME_C0209OLD,Cyclone Sprinter,นักวิ่งแห่งวายุ,サイクロンスプリンター
CARD_NAME_C0210OLD,Almighty Spirit,วิญญาณของผู้กล้า,全能のスピリット
CARD_NAME_C0211OLD,Terra Golem,โกเลมปฐพี,テラゴーレム
CARD_NAME_C0212OLD,"Sagan, Sky Conqueror",ซากัน ผู้พิชิตแห่งท้องนภา,サガン、スカイ征服
CARD_NAME_C0213OLD,"Kenshin, Demon Slasher",เคนชิน ดาบผ่าอสูร,謙信、悪魔スラッシャー
CARD_NAME_C0214OLD,Resurrected Armor,เกราะคืนชีพ,復活アーマー
CARD_NAME_C0215OLD,"""DD"" Magear War Dragon","""ดีดี"" มังกรจักรกลมาเกีย",「DD」Magear戦争ドラゴン
CARD_NAME_C0216OLD,Magear Titan,มาเกียไททัน,Magearタイタン
CARD_NAME_C0217OLD,Magear War Archer,พลธนูรบมาเกีย,Magear戦争アーチャー
CARD_NAME_C0218OLD,Twister,อสูรวายุ,ツイスター
CARD_NAME_C0219OLD,Cosmic Fairy,แฟรี่แห่งดวงดาว,宇宙の妖精
CARD_NAME_C0220OLD,Sky Rider,นักสู้แห่งท้องนภา,スカイライダー
CARD_NAME_C0221OLD,Owlerian Mechanician,นกฮูกช่างกล,Owlerian Mechanician
CARD_NAME_C0222OLD,"Banshee, Soul Eater",แบนชี ผู้กลืนกินวิญญาณ,バンシー、ソウルイーター
CARD_NAME_C0223OLD,Forest Ranger,เรนเจอร์พงไพร,森林警備隊員
CARD_NAME_C0224OLD,Killer Bee,ผึ้งนักฆ่า,キラービー
CARD_NAME_C0225OLD,Blood Templar,นักรบสีเลือด,ブラッドテンプラー
CARD_NAME_C0226OLD,Magear Soldier,ทหารศึกมาเกีย,Magearソルジャー
CARD_NAME_C0227OLD,Falcon Tamer,ผู้ฝึกเหยี่ยว,ファルコンテイマー
CARD_NAME_C0228OLD,Sky Squirrel,กระรอกเวหา,スカイリス
CARD_NAME_C0229OLD,Tempest Monkey,ลิงวายุ,テンペストモンキー
CARD_NAME_C0230OLD,Chimera Cygnus,คิเมร่า ซิกนัส,キメラシグナス
CARD_NAME_C0231OLD,Merbeast Assassin,เมอร์บีสท์นักฆ่า,Merbeastアサシン
CARD_NAME_C0232OLD,Wing Swordsman,ดาบปักษา,ウイング剣士
CARD_NAME_C0233OLD,Elf Warrior,เอล์ฟนักรบ,エルフの戦士
CARD_NAME_C0234OLD,Storm Shadow,สตอร์มชาโดว์,ストームシャドー
CARD_NAME_C0235OLD,Forest Hunter,นักล่าพงไพร,森のハンター
CARD_NAME_C0236OLD,"Jala, Dragon Summoner",จาลา ผู้อัญเชิญมังกร,ジャラ、ドラゴン召喚士
CARD_NAME_C0237OLD,"Deora, Dark Enchantress",ดีโอร่า แม่มดศาสตร์มืด,Deora、ダークエンチャントレス
CARD_NAME_C0238OLD,Demon Spider,แมงมุมอสูร,悪魔スパイダー
CARD_NAME_C0239OLD,Savage Fangs,อสูรเขี้ยวคลั่ง,サベージ牙
CARD_NAME_C0240OLD,Dark Acolyte,นักบวชแห่งศาสตร์มืด,ダークアコライト
CARD_NAME_C0241OLD,"Tenebrig, Abyss Lord",เทเนบริค เจ้าแห่งความมืด,Tenebrig、アビス主
CARD_NAME_C0242OLD,"Kaare, Crimson Claw",คาเระ กรงเล็บสีชาด,Kaare、クリムゾンクロー
CARD_NAME_C0243OLD,"Goldra, Aquarian Queen",โกลด้า ราชินีอควาเลี่ยน,Goldra、アクエリアン女王
CARD_NAME_C0244OLD,"Lir, Sky Blue Wizard",เลียร์ จอมเวทย์สีคราม,LIR、スカイブルーウィザード
CARD_NAME_C0245OLD,"Nodens, Aqua Rider",โนเดนส์ ผู้ควบคุมสายน้ำ,Nodens、アクアライダー
CARD_NAME_C0246OLD,"Gamila, Ice Destroyer",กาไมล่า ผู้ทลายน้ำแข็ง,Gamila、アイスデストロイヤー
CARD_NAME_C0247OLD,Hunter of the Deep Sea,นักล่าแห่งทะเลลึก,深海のハンター
CARD_NAME_C0248OLD,"Neptune, Sea watcher",เนปจูน ผู้สอดส่องน่านน้ำ,ネプチューン、海ウォッチャー
CARD_NAME_C0249OLD,Shield Mermaid,นางเงือกแห่งโล่,シールドマーメイド
CARD_NAME_C0250OLD,Merbeast Lancer,เมอร์บีสท์พลหอก,Merbeastランサー
CARD_NAME_C0251OLD,Sapphire Swordsman,นักดาบไพลิน,サファイア剣士
CARD_NAME_C0252OLD,Blade Dancer,นักระบำดาบ,ブレードダンサー
CARD_NAME_C0253OLD,Merbeast Fighter,เมอร์บีสท์นักสู้,Merbeastファイター
CARD_NAME_C0254OLD,Underworld Demon,อสูรใต้พิภพ,アンダーワールド悪魔
CARD_NAME_C0255OLD,Rainbow Butterfly,ผีเสื้อสีรุ้ง,レインボーバタフライ
CARD_NAME_C0256OLD,Buster Lobster,บัสเตอร์ลอบสเตอร์,バスターロブスター
CARD_NAME_C0257OLD,Carp Lancer,พลหอกปลาคาร์ป,カープランサー
CARD_NAME_C0258OLD,Silver Pincers,อสูรก้ามเงิน,シルバーペンチ
CARD_NAME_C0259OLD,Chimera  Aries,คิเมร่า แอรีส,キメラ牡羊座
CARD_NAME_C0260OLD,Turtle Guardian,เต่าผู้พิทักษ์,タートルガーディアン
CARD_NAME_C0261OLD,Merman Trooper,กองทหารเมอร์แมน,マーマントルーパー
CARD_NAME_C0262OLD,Blue Back Slug,ทากหลังน้ำเงิน,ブルーバックスラッグ
CARD_NAME_C0263OLD,Ice Cobra,งูเห่าน้ำแข็ง,アイスコブラ
CARD_NAME_C0264OLD,Aquarian Spirit,ภูติแห่งสายน้ำ,アクエリアンスピリット
CARD_NAME_C0265OLD,Blue Slime,สไลม์ฟ้า,ブルースライム
CARD_NAME_C0266OLD,Blood Wings,ปีกโลหิต,ブラッドウイングス
CARD_NAME_C0267OLD,Kangaroo Boxer,จิงโจ้นักมวย,カンガルーボクサー
CARD_NAME_C0268OLD,Smoker,มนุษย์ควัน,スモーカー
CARD_NAME_C0269OLD,Thunderous Scorpion,แมงป่องสายฟ้า,雷スコーピオン
CARD_NAME_C0270OLD,"Tarragon, Wyvern Protector",ทาร์รากอน ผู้ปกครองเหล่าไวเวิร์น,タラゴン、ワイバーンプロテクター
CARD_NAME_C0271OLD,"Buu, Tree of Life",บู ต้นไม้แห่งชีวิต,ブウ、生命の木
CARD_NAME_C0272OLD,"Clifford, Hawk Eye Archer",คลิฟฟอร์ดตาเหยี่ยว,クリフォード、ホークアイアーチャー
CARD_NAME_C0273OLD,Deno the Giant Paw,ดีโน่อุ้งเท้ายักษ์,ジャイアントポウ電王
CARD_NAME_C0274OLD,"Yda, Forest Wizard",อีด้า จอมเวทย์แห่งป่าลึก,YDA、森のウィザード
CARD_NAME_C0275OLD,Tacita the Forerunner,ตสิตา ผู้เบิกทางแห่งพงไพร,Tacitaフォアランナー
CARD_NAME_C0276OLD,Rabbit Hunter,กระต่ายนายพราน,ラビットハンター
CARD_NAME_C0277OLD,Beast Tamer,ผู้ฝึกสัตว์อสูร,ビーストテイマー
CARD_NAME_C0278OLD,Armored Chameleon,คาเมเลี่ยนเกราะเหล็ก,アーマードカメレオン
CARD_NAME_C0279OLD,Sky Wyvern,ไวเวิร์นแห่งท้องนภา,スカイワイバーン
CARD_NAME_C0280OLD,Terra Drake,เดรกแห่งพื้นดิน,テラドレイク
CARD_NAME_C0281OLD,Stone Tyrant,อสูรศิลา,ストーン暴君
CARD_NAME_C0282OLD,Druid,ดรูอิด นักเวทย์แห่งพงไพร,ドルイド
CARD_NAME_C0283OLD,Minotaur Shaman,มิโนทอร์ชาแมน,ミノタウロスシャーマン
CARD_NAME_C0284OLD,"Chika, Crystal Hunter",ชิก้า นักล่าอัญมณี,千佳、クリスタルハンター
CARD_NAME_C0285OLD,Forest Knight,อัศวินพงไพร,森の騎士
CARD_NAME_C0286OLD,Crazy Bear,หมีคลั่ง,クレイジーベア
CARD_NAME_C0287OLD,Nyffyn the Messenger,นิฟฟิน นักส่งสาร,Nyffynメッセンジャー
CARD_NAME_C0288OLD,Rooster Knight,ไก่อัศวิน,ルースターナイト
CARD_NAME_C0289OLD,Ent of Spring,เอนท์แห่งใบไม้ผลิ,春の耳鼻咽喉科
CARD_NAME_C0290OLD,Red Flora,พฤกษาแดง,レッドフローラ
CARD_NAME_C0291OLD,Stone Fist Fighter,นักสู้กำปั้นศิลา,石拳ファイター
CARD_NAME_C0292OLD,Chimera Tauri,คิเมร่า ทอริ,キメラタウリ
CARD_NAME_C0293OLD,Razor Beast,สัตว์อสูรใบมีด,カミソリビースト
CARD_NAME_C0294OLD,Spear Beast,สัตว์อสูรหอก,スピアビースト
CARD_NAME_C0295OLD,Street Bandit,กลุ่มโจรข้างถนน,ストリートバンディット
CARD_NAME_C0296OLD,Forest Guardian,อารักษ์แห่งพงไพร,森の守護者
CARD_NAME_C0297OLD,Flower Fairy,แฟรี่ดอกไม้,花の妖精
CARD_NAME_C0298OLD,Emerald Soldier,ทหารมรกต,エメラルドソルジャー
CARD_NAME_C0299OLD,Blood Cavalry,ทหารม้าสีเลือด,ブラッド騎兵
CARD_NAME_C0300OLD,Mary Royal Instructor,แมรี่ ผู้ฝึกสอนแห่งวังหลวง,メアリーロイヤルインストラクター
CARD_NAME_C0300_HERO_H0007OLD,Mary Royal Instructor,แมรี่ ผู้ฝึกสอนแห่งวังหลวง,メアリーロイヤルインストラクター
CARD_NAME_C0301OLD,Mercenary Coin,เหรียญตราทหารรับจ้าง,傭兵コイン
CARD_NAME_C0302OLD,"Pierre, Arcane Alchemist",ปิแอร์ จอมเวทย์นักปรุงยา,ピエール、秘儀の錬金術師
CARD_NAME_C0303OLD,Doppelganger Noel,ดอปเปอร์แกงเกอร์ โนเอล,ドッペルゲンガーノエル
CARD_NAME_C0304OLD,Outlaw King,ราชาแดนเถื่อน,アウトローキング
CARD_NAME_C0305OLD,Storyteller,ผู้เล่าตำนาน,ストーリーテラー
CARD_NAME_C0306OLD,Time Sorcerer,จอมเวทย์กาลเวลา,時間ソーサラー
CARD_NAME_C0307OLD,Enticing Demon,มารผู้ล่อลวง,魅力的な悪魔
CARD_NAME_C0308OLD,Wandering Bard,นักดนตรีพเนจร,さすらいの吟遊詩人
CARD_NAME_C0309OLD,Merchant,พ่อค้า,商人
CARD_NAME_C0310OLD,Dragon Egg,ไข่มังกร,ドラゴンの卵
CARD_NAME_C0311OLD,Gangster Squad,แก๊งค์นักเลง,ギャングスター・スクワッド
CARD_NAME_C0312OLD,Chimera Lyncis,คิเมร่า ลินซิส,キメラLyncis
CARD_NAME_C0313OLD,Dragon Hatchlings,มังกรทารก,ドラゴン孵化
CARD_NAME_C0314OLD,Dwarf Miner,คนแคระนักขุดเหมือง,ドワーフマイナー
CARD_NAME_C0315OLD,Iron Fist Fighter,นักสู้ กำปั้นเหล็ก,鉄の拳ファイター
CARD_NAME_C0316OLD,Mystic Lancer,พลหอกเวทย์,ミスティックランサー
CARD_NAME_C0317OLD,"Agatha, Adventurer's Aid",อากาธ่า ผู้ช่วยนักผจญภัย,アガサ、冒険者援助
CARD_NAME_C0318OLD,"Zil, Dark Emperor",ซิล จักรพรรดิแห่งความมืด,ZIL、ダーク皇帝
CARD_NAME_C0319OLD,"Millar, Mother of Souls",มิลล่า มารดาวิญญาณ,Millarの、魂の母
CARD_NAME_C0320OLD,"Silva, Shadow Assassin",ซิลวา นักฆ่าเงา,シルバ、シャドウアサシン
CARD_NAME_C0321OLD,"Todes, Undying Zombie ",โทเดส ซอมบี้อมตะ,Todes、不死のゾンビ
CARD_NAME_C0322OLD,Grave Demon,อสูรเฝ้าสุสาน,墓悪魔
CARD_NAME_C0323OLD,Soul Hunter,นักล่าวิญญาณ,魂のハンター
CARD_NAME_C0324OLD,Abyss Titan,ยักษาอเวจี,アビスタイタン
CARD_NAME_C0325OLD,Soul Catcher,ผู้เรียกวิญญาณ,ソウルキャッチャー
CARD_NAME_C0326OLD,Lost Soul,วิญญาณหลงทาง,失われた魂
CARD_NAME_C0327OLD,Demon Tamer,ผู้ฝึกปีศาจ,悪魔テイマー
CARD_NAME_C0328OLD,Necro Dragon,มังกรเนโคร,ネクロドラゴン
CARD_NAME_C0329OLD,Chimera Dragonis,คิเมร่า ดราโกนิส,キメラDragonis
CARD_NAME_C0330OLD,Rabid Grim,กริมม์ นักฆ่าวิกลจริต,グリム熱狂
CARD_NAME_C0331OLD,Olia Blood Maiden,โอเลีย หญิงสาวสีเลือด,Oliaブラッドメイデン
CARD_NAME_C0332OLD,Bounty Crow,อีกานักล่าค่าหัว,バウンティ・クロウ
CARD_NAME_C0333OLD,Grave Zombie,ซอมบี้,墓ゾンビ
CARD_NAME_C0333AOLD,Zombie Minion,สมุนซอมบี้,ゾンビミニオン
CARD_NAME_C0334OLD,Vampire Maid,แวมไพร์ผู้รับใช้,ヴァンパイアメイド
CARD_NAME_C0335OLD,Arch Demon,ปีศาจชั้นสูง,アーチ悪魔
CARD_NAME_C0336OLD,Witch of the Dusk,แม่มดรัตติกาล,夕暮れの魔女
CARD_NAME_C0337OLD,Olfie the Story Collector,ออลเฟีย ผู้รวบรวมเรื่องราว,ストーリーコレクターをOlfie
CARD_NAME_C0338OLD,"Helmwik, Blood Knight",เฮล์มวิค อัศวินโลหิต,Helmwik、ブラッドナイト
CARD_NAME_C0339OLD,Merbeast Thief,เมอร์บีสท์หัวขโมย,Merbeast泥棒
CARD_NAME_C0340OLD,"Ivah, Imperial Vampire",อิวาห์ ราชนิกุลปีศาจ,Ivah、インペリアルヴァンパイア
CARD_NAME_C0341OLD,Void of Dark Matter,ช่องว่างแห่งสสารมืด,ダークマターのボイド
CARD_NAME_C0342OLD,Demon Underling,ปีศาจบริวาร,悪魔の下っ端
CARD_NAME_C0343OLD,Army Flag,ธงสัญญาณ,軍の旗
CARD_NAME_C0344OLD,Rainbow Crystal,อัญมณีสีรุ้ง,レインボークリスタル
CARD_NAME_C0345OLD,Colossal Tree,ต้นไม้ใหญ่,巨大ツリー
CARD_NAME_C0346OLD,Marionette Master,มาริโอเน็ต,マリオネットマスター
CARD_NAME_C0347OLD,Spirit of the Dragon,ดวงวิญญาณของมังกร,ドラゴンのスピリット
CARD_NAME_C0348OLD,"Vulcanus, Ancient Titan",วัลคานัส ไททันปกรณัม,ヴルカヌス、古代タイタン
CARD_NAME_C0349OLD,Doppelganger Leon,ดอปเปอร์แกงเกอร์ ลีออน,ドッペルゲンガーレオン
CARD_NAME_C0460OLD,Twindra Freezing Flame Dragon,ทวินดรา มังกรเพลิงน้ำแข็ง,炎竜を凍結Twindra
CARD_NAME_C0461OLD,Flame Archer Nasim,นาซิม นักธนูไฟ,フレイムアーチャーNasim
CARD_NAME_C0462OLD,Scorching Flower Nymph Fiily,ฟีลี่ ภูติบุปผาเพลิง,灼熱の花のニンフFiily
CARD_NAME_C0463OLD,Flying Giant Bumble,บัมเบิล วิหคกุญชร,フライングジャイアントバンブル
CARD_NAME_C0464OLD,"Gael, the Claydoll Binder",กาเอล ผู้ปลุกเสกดิน,ガエル、Claydollバインダー
CARD_NAME_C0465OLD,Lotus Pixie Loetta,โลเอ็ตตา ภูติสระบัว,ロータスピクシーLoetta
CARD_NAME_C0466OLD,Sacred Flame Paladin Ilda,อิลด้า นักรบเพลิงศักดิ์สิทธิ์,聖なる炎パラディンILDA
CARD_NAME_C0467OLD,Demon Priest Javier,ฌาเวียร์ บาทหลวงปิศาจ,悪魔プリーストハビエル
CARD_NAME_C0468OLD,"Natrolite, Divine Beast",นาโทรไลท์ อสูรศักดิ์สิทธิ์,ソーダ沸石、神獣
CARD_NAME_C0469OLD,"Reon, Harpy Remnent",วิญญาณฮาร์ปี้ รีออน,リオン、ハーピーRemnent
CARD_NAME_C0470OLD,Valence Nocturn Wyvern,มังกรค้างคาว วาเลนซ์,ヴァランスノクターンワイバーン
CARD_NAME_C0471OLD,"Folse, the Tainted angel",โฟลซ์ เทพธิดาผู้แปดเปื้อน,Folse、汚染された（Tainted）天使
CARD_NAME_C0472OLD,Mogul Executioner of the sea,โมกูล เพชฌฆาตแห่งห้วงสมุทร,海のモーグル死刑執行
CARD_NAME_C0473OLD,Divine Melody Simone,บทเพลงสวรรค์ ซิโมน,神のメロディシモーネ
CARD_NAME_C0474OLD,Deep Sea Monster Amalga,อมาลก้า สัตว์ร้ายแห่งทะเลลึก,ディープシーモンスターアマルガ
CARD_NAME_C0475OLD,Kieran Monsoon Caller,คีราน ผู้เรียกมรสุม,キーラン・モンスーン発信者
CARD_NAME_C0476OLD,Gulp The Hungry Frog,กั๊ลป์ กบจอมตะกละ,空腹カエルをゴクゴク
CARD_NAME_C0477OLD,"Lita, Pegasus Knight",ลิตา นักรบเพกาซัสพเนจร,リタ、ペガサスナイト
CARD_NAME_C0478OLD,Cult of Pureblood,ลัทธิเลือดบริสุทธิ์,Purebloodのカルト
CARD_NAME_C0479OLD,Kalii The Cult's Banisher ,คาลี ผู้เนรเทศแห่งลัทธิ,Kaliiザ・カルトのBanisher
CARD_NAME_C0480OLD,Gael's Claydoll,ตุ๊กตาของกาเอล,ガエルのClaydoll
CARD_NAME_C0481OLD,"Nyx, Child of Nightfall",นิกซ์ ธิดาแห่งไนท์ฟอลล์,ニュクス、日暮れの子供
CARD_NAME_C0481_HERO_H0008OLD,"Nyx, Child of Nightfall",นิกซ์ ธิดาแห่งไนท์ฟอลล์,ニュクス、日暮れの子供
CARD_NAME_C0482OLD,Savage Warrior,นักรบอำมหิต,サベージ戦士
CARD_NAME_C0483OLD,Savage Lancer,พลหอกอำมหิต,サベージランサー
CARD_NAME_C0484OLD,Top Minotaur Warrior,ยอดนักรบมิโนทอรัส,トップミノタウルス戦士
CARD_NAME_C0487OLD,Summer Smash!,ซัมเมอร์แสมช!,サマースマッシュ！
CARD_NAME_C0488OLD,Gigantic Wave,คลื่นยักษ์,巨大な波
CARD_NAME_C0489OLD,Aloha Gragros,อโลฮ่ากรากรอส,アロハGragros
CARD_NAME_C0489AOLD,Turtle Horde,ฝูงเต่า,タートル大群
CARD_NAME_C0491OLD,Servants of Nodens,ผู้รับใช้ของโนเดนส์,Nodensのしもべ
CARD_NAME_C0492OLD,Hellfire Inferna,เพลิงนรก อินเฟอร์น่า,ヘルファイアInferna
CARD_NAME_C0493OLD,Heaven’s Flame Caelum,เพลิงสวรรค์ เคลัม,天の炎Caelumの
CARD_NAME_C0494OLD,Crystal Golem Selenite,โกเลมคริสตัล เซเลไนท์,クリスタルゴーレム亜セレン
CARD_NAME_C0495OLD,Coal Monster Carbolga,อสูรสีถ่าน คาโบลก้า,石炭モンスターCarbolga
CARD_NAME_C0496OLD,Goddess’s Tear,น้ำตาเทพธิดา,女神の涙
CARD_NAME_C0497OLD,Gratia the Bird of Paradise,ปักษาสวรรค์ กราเทีย,グレーシア楽園の鳥
CARD_NAME_C0498OLD,Blood Beast Gula,อสูรโลหิต กูลา,ブラッド獣GULA
CARD_NAME_C0499OLD,Death Reaper Cierra,เซียร์ร่า ผู้เก็บเกี่ยวความตาย,死死神Cierra
CARD_NAME_C0500OLD,Swamp Kelpie,เคลพีแห่งบึงโคลน,沼ケルピー
CARD_NAME_C0501OLD,Rivalin the Mist Bearer,ริวาลิน ผู้ถือตะเกียงหมอก,ミストベアラRivalin
CARD_NAME_C0502OLD,The Plague Doctor,แพทย์มรณะ,ペスト医師
CARD_NAME_C0503OLD,Smoke Tail Fumu,ฟูมูหางควัน,スモークテールFumu
CARD_NAME_C0504OLD,Cult’s Executioner,เพชฌฆาตแห่งลัทธิ,カルトの死刑執行
CARD_NAME_C0505OLD,Galvin the Geneticist Assistance,ผู้ช่วยนักพันธุศาสตร์ กัลวิน,遺伝学者の支援をガルビン
CARD_NAME_C0506OLD,Geneticist Professor Karryghan,อาจารย์นักพันธุศาสตร์ คาริกาห์น,遺伝学者教授Karryghan
CARD_NAME_C0507OLD,Brundo's Mask,หน้ากากบรันโด้,Brundoのマスク
CARD_NAME_C0508OLD,Ralana's Mask,หน้ากากราลาน่า,Ralanaのマスク
CARD_NAME_C0509OLD,Kenshin's Mask,หน้ากากเคนชิน,謙信のマスク
CARD_NAME_C0510OLD,Bowen the Dragon Slayer,นักปราบมังกรโบเว่น,ドラゴンスレイヤーをボーエン
CARD_NAME_C0511OLD,Emile the Squire,นักรบฝึกหัดเอมิล,スクワイアエミール
CARD_NAME_C0512OLD,Flame protector Zyanya,เซียนย่าผู้อารักษ์เพลิง,炎プロテクターZyanya
CARD_NAME_C0513OLD,Eremia Deep Forest Guardian,เอเรเมีย ผู้พิทักษ์แห่งป่าลึก,Eremiaディープフォレストガーディアン
CARD_NAME_C0514OLD,Arie the Tree Keeper,เอรี่ ผู้ดูแลแมกไม้,ツリーキーパーをARIE
CARD_NAME_C0515OLD,Engel the Celestial Descendant,เอนเกล บุตรแห่งเซเลสเชียล,エンゲル天の末裔
CARD_NAME_C0516OLD,Royal Retainer Lennard,เลนนาร์ด องครักษ์แห่งวังหลวง,ロイヤルリテーナーレナード
CARD_NAME_C0517OLD,Royal nursemaid Marian,มาเรียน นางกำนัลแห่งวังหลวง,ロイヤルマリアンを守しました
CARD_NAME_C0518OLD,Pirate Captain Brighteye,กัปตันโจรสลัด ไบรท์อาย,海賊キャプテンBrighteye
CARD_NAME_C0519OLD,Captain’s First Mate Whiplock ,วิปลอค ต้นหนโจรสลัด,キャプテン初メイトWhiplock
CARD_NAME_C0520OLD,Pirate warrior Sharkjaw,ชาร์คจอว์ สลัดนักสู้,海賊戦士Sharkjaw
CARD_NAME_C0521OLD,Victor the Mortician,วิคเตอร์ นักจัดงานศพ,ビクター葬儀屋
CARD_NAME_C0522OLD,Mortuary makeup artist Ella,เอลล่า ช่างแต่งหน้าศพ,埋葬メイクアップアーティストエラ
CARD_NAME_C0523OLD,Coffin maker Edmund ,เอ็ดมันด์ ช่างต่อโลงศพ,棺メーカーエドモンド
CARD_NAME_C0524OLD,Zhen the Gale Flutist,เซน นักขลุ่ยวายุ,ゲイルフルート奏者のジェン
CARD_NAME_C0525OLD,Lighting Lyrist Lyn,หลิน เพลงพิณสายฟ้า,照明詩人Lyn（リン）
CARD_NAME_C0526OLD,Thunderous Drummer Shu,ชู มือกลองฟ้าลั่น,雷のドラマーシュウ
CARD_NAME_C0527OLD,Backpack of Nyx,กระเป๋านักเรียนของนิกซ์,ニュクスのバックパック
CARD_NAME_C0528OLD,Book of Sadia,ตำราของซาเดีย,Sadiaの書籍
CARD_NAME_C0529OLD,Legendary Chalk,ชอล์กในตำนาน,伝説のチョーク
CARD_NAME_C0530OLD,Wraith Wind,ลมอาฆาต,Wraith Wind
CARD_NAME_CAPOLD,Soul Booster,โซลบูสเตอร์,AP Gem
CARD_NAME_CH0001OLD,Fighter spirit,วิญญาณนักสู้,ファイターの精神
CARD_NAME_CH0002OLD,Foresight,ความสุขุม,先見の明
CARD_NAME_CH0003OLD,Terra armor,เกราะเทอร่า,テラ鎧
CARD_NAME_CH0004OLD,Aero blade,ใบมีดลม,エアロブレード
CARD_NAME_CH0005OLD,Healing hands,มือแห่งการรักษา,癒しの手
CARD_NAME_CH0006OLD,Soul crush,บดขยี้วิญญาณ,ソウルクラッシュ
CARD_NAME_CT0001OLD,Bladewanderer,นักดาบพเนจร,ソードマン
CARD_NAME_CT0002OLD,"Meji, the Magician Girl",เมจิ สาวน้อยนักเวทย์,メジリトルメイジ
CARD_NAME_CT0003OLD,Back alley Thief,โจรแห่งตรอกลับ,泥棒
CARD_NAME_CT0004OLD,"Irin, the Healer",ไอริน ผู้รักษา,イリン慈善家の少女
CARD_NAME_CT0011OLD,Ninja of the Red Moon,นินจาจันทราเลือด,血まみれの忍者
CARD_NAME_CT0015OLD,Thunder Unicorn,ยูนิคอนสายฟ้า,ユニコーンボルト
CARD_NAME_CT0016OLD,Guardian Golem,โกเลมผู้พิทักษ์,ゴールキーパー
CARD_NAME_CT0018OLD,Support Marksman,พลธนูสนับสนุน,アーチャー精密
CARD_NAME_CT0021OLD,Obsidian Knight,อัศวินเกราะทมิฬ,戦士野蛮人
CARD_NAME_CT0026OLD,"Nore, the Elven Ranger",โนเร่ เอลฟ์นักธนู,Nore エルフ少女アーチャー
CARD_NAME_CT0027OLD,"Garren, the Fighter",กาเรน นักสู้มือเปล่า,キャリー・ファイター
CARD_NAME_CT0028OLD,Yellow Slime,สไลม์เหลือง,イエロースライダー
CARD_NAME_CT0030OLD,Death Wolf,หมาป่ามรณะ,デス・オルフ
CARD_NAME_CT0032OLD,Shocktrooper,พลทะลวงฟัน,歯を白くする
CARD_NAME_CT0034OLD,"Grant, the Destroyer",กรันท์ จอมทำลายล้าง,ガンダー
CARD_NAME_CT0035OLD,Mysterious Man,บุรุษลึกลับ,神秘的な男
CARD_NAME_CT0038OLD,Golden Armor Falcon,พญาเหยี่ยวเกราะทอง,ゴールデンホークアーマー
CARD_NAME_CT0039OLD,Grand Knight,หัวหน้าอัศวิน,グランドナイト
CARD_NAME_CT0040OLD,Royal Quartermaster,เสนาธิการกองทัพ,スタッフチーフ
CARD_NAME_CT0041OLD,Suicide Zombie,ซอมบี้อาฆาต,ライブ壁紙
CARD_NAME_CT0044OLD,Holy Priest,บาทหลวงแห่งแสง,ルーファスの会計担当者
CARD_NAME_CT0046OLD,Trident Warrior,นักรบตรีศูล,トライデントの戦士
CARD_NAME_CT0053OLD,"Icarus, Son of the Wind",อิคารัส บุตรแห่งสายลม,イカルス、風の息子
CARD_NAME_CT0056OLD,Red Slime,สไลม์แดง,赤いスライム
CARD_NAME_CT0058OLD,Minion Wolf,สมุนหมาป่า,アルファウルフ
CARD_NAME_CT0073OLD,Skeleton Warrior,นักรบโครงกระดูก,スケルトンウォリアーズ
CARD_NAME_CT0073AOLD,Skeleton Warrior,นักรบโครงกระดูก,スケルトンウォリアーズ
CARD_NAME_CT0079OLD,Dark Elven Hunter,ดาร์คเอลฟ์นักล่า,タミルの森の弓師
CARD_NAME_CT0083OLD,Cyclone Spirit,จิตวิญญาณแห่งวายุ,風の精神
CARD_NAME_CT0087OLD,War Elephant,ช้างศึก,戦争象
CARD_NAME_CT0088OLD,Orc Rider,ออร์ค ไรเดอร์,オークライダー
CARD_NAME_CT0092OLD,Great Horn Rabbit,กระต่ายเขายักษ์,彼の巨大なウサギ
CARD_NAME_CT0093OLD,Little Fairy,ภูตจิ๋ว,神の呪い
CARD_NAME_CT0106OLD,Guiding Fairy,แฟรี่นำทาง,ガーディアンフェアリー
CARD_NAME_CT0108OLD,Elle Stormfan,เอลี่ พัดวายุ,エルファンの戦闘機
CARD_NAME_CT0112OLD,Plain Walker,นักรบสัตว์อสูร,アリーナミノタウルス
CARD_NAME_CT0114OLD,Goblin Warrior,ก็อบลินนักรบ,ゴブリンの戦士
CARD_NAME_CT0117OLD,Rookie Knight,อัศวินฝึกหัด,初心者の騎士
CARD_NAME_CT0120OLD,Giant Slime,สไลม์ยักษ์,ジャイアントスライム
CARD_NAME_CT0127OLD,Beetle Fighter,ด้วงนักสู้,ビートル戦闘機
CARD_NAME_CT0128OLD,Wind Harpy,ฮาร์ปี้แห่งสายลม,ウィンド・ハーピー
CARD_NAME_CT0129OLD,Lion Warrior,นักรบสิงโต,ライオンの戦士
CARD_NAME_CT0131OLD,Vengeful Skull,กระโหลกอาฆาต,緑の頭蓋骨
CARD_NAME_CT0134OLD,Griffin,กริฟฟิน,グリフィン
CARD_NAME_CT0136OLD,Bandura Man Eater,บันดูล่า ต้นไม้กินคน,バンドラ
CARD_NAME_CT0137OLD,Robber Lizard,ลิซาร์ดหัวขโมย,強盗トカゲ
CARD_NAME_CT0140OLD,Elf Blader,เอลฟ์นักดาบ,エルフの剣
CARD_NAME_CT0142OLD,Training Goat Horn Rabbit,กระต่ายเขาแกะ,ヤギホーンウサギ
CARD_NAME_CT0149OLD,Cheetah Hunter,ชีต้าร์นายพราน,チーターハンター
CARD_NAME_CT0173OLD,Army Flagman,พลธงสัญญาณ,陸軍Flagman
CARD_NAME_CT0179OLD,Bevin the Ambusher,เบวิน พลซุ่มโจมตี,BevinのAmbusher
CARD_NAME_CT0180OLD,"Fuka, Furious Gale",ฟูกะ พายุคลั่ง,風香、激怒ゲイル
CARD_NAME_CT0212OLD,"Sagan, Sky Conqueror",ซากัน ผู้พิชิตแห่งท้องนภา,サガン、スカイ征服
CARD_NAME_CT0215OLD,"""DD"" Magear War Dragon","""ดีดี"" มังกรจักรกลมาเกีย",「DD」Magear戦争ドラゴン
CARD_NAME_CT0220OLD,Sky Rider,นักสู้แห่งท้องนภา,スカイライダー
CARD_NAME_CT0221OLD,Owlerian Mechanician,นกฮูกช่างกล,Owlerian Mechanician
CARD_NAME_CT0227OLD,Falcon Tamer,ผู้ฝึกเหยี่ยว,ファルコンテイマー
CARD_NAME_CT0229OLD,Tempest Monkey,ลิงวายุ,テンペストモンキー
CARD_NAME_CT0270OLD,"Tarragon, Wyvern Protector",ทาร์รากอน ผู้ปกครองเหล่าไวเวิร์น,タラゴン、ワイバーンプロテクター
CARD_NAME_CT0308OLD,Wandering Bard,นักดนตรีพเนจร,さすらいの吟遊詩人
CARD_NAME_CT0330OLD,Rabid Grim,กริมม์ นักฆ่าวิกลจริต,グリム熱狂
CARD_NAME_CT0339OLD,Merbeast Thief,เมอร์บีสท์หัวขโมย,Merbeast泥棒
CARD_NAME_C0531OLD,Meili the Storm Conductor,เมยลี ผู้กำกับมรสุม,マイリストーム指揮
CARD_NAME_C0532OLD,Flame Eater,แมงกินไฟ,フレイムイーター
CARD_NAME_C0533OLD,Armadillo Fighter,อมาดิลโล่นักสู้,アルマジロファイター
CARD_NAME_C0534OLD,Miasma of death,ไมแอสม่าแห่งความตาย,死の瘴気
CARD_NAME_C0535OLD,Ice Blowfish,ปักเป้าน้ำแข็ง,アイスフグ
CARD_NAME_C0536OLD,Shy Mermaid,นางเงือกขี้อาย,シャイマーメイド
CARD_NAME_C0537OLD,Coral Knight Anthoz,อัศวินปะการัง แอนโทซ,コーラルナイトAnthoz
CARD_NAME_C0555OLD,Gratia the Knight,อัศวิน กราเทีย,グレーシアの騎士
CARD_NAME_C0556OLD,Mud Monster,มนุษย์โคลน,マッドモンスター
CARD_NAME_C0430OLD,"Keskas, The Loyal King","เกสคัส, เอกภักดิ์ราชัน",Keskas、忠実な王
CARD_NAME_C0431OLD,"Ema, The Loyal Queen","เอม่า, เอกภักดิ์ราชินี",エマ、忠実な女王
CARD_NAME_C0449OLD,Colorless Knight,นักดาบไร้สังกัด,無色の騎士
CARD_NAME_C0485OLD,The Forgotten Army,กองทัพที่ถูกลืม,忘れられた軍隊
CARD_NAME_C0563OLD,Pumpkin Bomb!,ระเบิดฟักทอง,パンプキン爆弾！
CARD_NAME_C0538OLD,Tidal Athenia,อาธีเนียแห่งวารี,潮汐Athenia
CARD_NAME_C0539OLD,Planet Library’s Familiar,ภูติพิทักษ์ห้องสมุดปฐพี,プラネット図書館の身近
CARD_NAME_C0540OLD,Planet Librarian,บรรณารักษ์แห่งปฐพี,プラネット司書
CARD_NAME_C0541OLD,Planet Grimoire,คัมภีร์แห่งปฐพี,プラネットグリモア
CARD_NAME_C0542OLD,Planet Athenia,อาธีเนียแห่งปฐพี,プラネットAthenia
CARD_NAME_C0543OLD,Cyclone Library’s Familiar,ภูติพิทักษ์ห้องสมุดวายุ,サイクロン図書館の身近
CARD_NAME_C0544OLD,Cyclone Athenia,อาธีเนียแห่งวายุ,サイクロンAthenia
CARD_NAME_C0545OLD,Cyclone Grimoire,คัมภีร์แห่งวายุ,サイクロングリモア
CARD_NAME_C0546OLD,Cyclone Librarian,บรรณารักษ์แห่งวายุ,サイクロン司書
CARD_NAME_C0547OLD,Divine Library’s Familiar,ภูติพิทักษ์ห้องสมุดศักดิ์สิทธิ์,神の図書館の身近
CARD_NAME_C0548OLD,Divine Librarian,บรรณารักษ์แห่งแสง,神の司書
CARD_NAME_C0549OLD,Divine Grimoire,คัมภีร์แห่งแสง,神のグリモア
CARD_NAME_C0550OLD,Divine Athenia,อาธีเนียแห่งแสง,神Athenia
CARD_NAME_C0551OLD,Shadow Library’s Familiar,ภูติพิทักษ์ห้องสมุดเงา,影図書館の身近
CARD_NAME_C0552OLD,Shadow Librarian,บรรณารักษ์แห่งเงา,シャドウ司書
CARD_NAME_C0553OLD,Shadow Grimoire,คัมภีร์แห่งเงา,シャドウグリモア
CARD_NAME_C0554OLD,Shadow Athenia,อาธีเนียแห่งเงา,シャドウAthenia
CARD_NAME_C0564OLD,Tidal Library Servant,ผู้รับใช้ห้องสมุดวารี,潮ライブラリサーヴァント
CARD_NAME_C0565OLD,Planet Library Servant,ผู้รับใช้ห้องสมุดปฐพี,プラネットライブラリサーヴァント
CARD_NAME_C0566OLD,Cyclone Library Servant,ผู้รับใช้ห้องสมุดวายุ,サイクロンライブラリサーヴァント
CARD_NAME_C0567OLD,Divine Library Servant,ผู้รับใช้ห้องสมุดศักดิ์สิทธิ์,神の図書館のサーヴァント
CARD_NAME_C0568OLD,Shadow Library Servant,ผู้รับใช้ห้องสมุดเงา,シャドウライブラリサーヴァント
CARD_NAME_C0569OLD,Flame Library’s Familiar,ภูติพิทักษ์ห้องสมุดเพลิง,炎図書館の身近
CARD_NAME_C0570OLD,Flame Librarian,บรรณารักษ์แห่งเปลวเพลิง,炎の司書
CARD_NAME_C0571OLD,Grimoire of Flame,คัมภีร์แห่งเปลวเพลิง,炎のグリモア
CARD_NAME_C0572OLD,Flame Athenia,อาธีเนียแห่งเปลวเพลิง,炎Athenia
CARD_NAME_C0573OLD,Tidal Library’s Familiar,ภูติพิทักษ์ห้องสมุดวารี,潮汐図書館の身近
CARD_NAME_C0574OLD,Tidal Librarian,บรรณารักษ์แห่งวารี,潮汐司書
CARD_NAME_C0575OLD,Grimoire of Tidal,คัมภีร์แห่งวารี,潮汐のグリモア
CARD_NAME_C0576OLD,Flame Library Servant,ผู้รับใช้ห้องสมุดเพลิง,炎ライブラリサーヴァント
CARD_NAME_C0577OLD,Shadow Athenia,อสูรกายห้องสมุดเงา,シャドウAthenia
CARD_NAME_C0350OLD,Rex King of Flame,เร๊ก ราชันย์แห่งเปลวไฟ,炎のレックス王
CARD_NAME_C0351OLD,Regina Queen of Flame,เรกิน่า ราชินีแห่งเปลวไฟ,炎のレジーナ女王
CARD_NAME_C0352OLD,"Rook, Warrunner",รูค อสูรสงคราม,ルーク、Warrunner
CARD_NAME_C0353OLD,"Rook, Flame Launcher",รูค รถศึกอัคคี,ルーク、フレイムランチャー
CARD_NAME_C0354OLD,"Bishop, Flame Cursor",บิชอป ผู้ส่งสารแห่งเปลวไฟ,ビショップ、炎カーソル
CARD_NAME_C0355OLD,"Bishop, Jester Knight",บิชอป อัศวินตัวตลก,ビショップ、ジェスターの騎士
CARD_NAME_C0356OLD,"Knight, Lionel",ไนท์ ไลโอเนล,騎士、ライオネル
CARD_NAME_C0357OLD,"Knight, Dragon Roar",ไนท์ อสูรมังกรคลั่ง,騎士、ドラゴン咆哮
CARD_NAME_C0358OLD,"Pawn, Gladios",พลเบี้ย กลาดิออซ,ポーン、Gladios
CARD_NAME_C0359OLD,"Pawn, Draco",พลเบี้ย ดราโค่,ポーン、ドラコ
CARD_NAME_C0360OLD,"Pawn, Luscus",พลเบี้ย ลัซคัซ,ポーン、Luscus
CARD_NAME_C0361OLD,"Pawn, Malleus",พลเบี้ย มัลเลียส,ポーン、つち骨
CARD_NAME_C0362OLD,"Pawn, Fax Burner",พลเบี้ย แฟกซ์ จอมเผา,ポーン、ファックスバーナー
CARD_NAME_C0363OLD,"Pawn, Onis",พลเบี้ย โอนิส,ポーン、オニス
CARD_NAME_C0364OLD,"Pawn, Fortem",พลเบี้ย ฟอร์เท็ม,ポーン、Fortem
CARD_NAME_C0365OLD,"Pawn, Buckler",พลเบี้ย บัคเลอร์,ポーン、バックラー
CARD_NAME_C0366OLD,Tara Khun of North sea,ธารา ขุนหลวงแห่งทะเลเหนือ,北海のタラクン
CARD_NAME_C0367OLD,Yada Met of North sea,ยาดา ที่ปรึกษาแห่งทะเลเหนือ,北の海の矢田メット
CARD_NAME_C0368OLD,"Rook, Matcha the Anchor",รูค มัจฉา ผู้ถือสมอเรือ,ルーク、抹茶アンカー
CARD_NAME_C0369OLD,"Rook, Nawa the Battleship",รูค เรือรบนาวา,ルーク、名和戦艦
CARD_NAME_C0370OLD,"Bishop, Aiyara the War Elephant",บิชอป ไอยรายอดช้างศึก,ビショップ、アイヤラ戦争象
CARD_NAME_C0371OLD,"Bishop, Kirinee the Carrier",บิชอป กิริณีผู้แบกรับ,ビショップ、Kirineeキャリア
CARD_NAME_C0372OLD,"Knight, Atsawanuk War Rider",ไนท์ อัศวินสงคราม,騎士、Atsawanuk戦争ライダー
CARD_NAME_C0373OLD,"Knight, Sal Spear Knight",ไนท์ ศัลย อัศวินหอก,騎士、サル槍騎士
CARD_NAME_C0374OLD,"Pawn, Kata",พลเบี้ย คทา,ポーン、カタ
CARD_NAME_C0375OLD,"Pawn, Chuti",พลเบี้ย ชุติ,ポーン、Chuti
CARD_NAME_C0376OLD,"Pawn, Kwin",พลเบี้ย กวิน,ポーン、のKWin
CARD_NAME_C0377OLD,"Pawn, Krabee",พลเบี้ย กระบี่,ポーン、Krabee
CARD_NAME_C0378OLD,"Pawn, Satya",พลเบี้ย สัตย์,ポーン、サティヤ
CARD_NAME_C0379OLD,"Pawn, Atsawa",พลเบี้ย อัศว,ポーン、Atsawa
CARD_NAME_C0380OLD,"Pawn, Puenyai",พลเบี้ย ปืนใหญ่,ポーン、Puenyai
CARD_NAME_C0381OLD,"Pawn, Shawhale",พลเบี้ย ชาวาฬ,ポーン、Shawhale
CARD_NAME_C0382OLD,Rey King of West Wind,เรย์ ราชาแห่งสายลมตะวันตก,西の風のレイ・キング
CARD_NAME_C0383OLD,Reina Queen of West Wind,เรนะ ราชินีแห่งสายลมตะวันตก,西の風のレイナ女王
CARD_NAME_C0384OLD,"Rook, Limestone Golem",รูค ไลม์สโตนโกเลม,ルーク、石灰岩ゴーレム
CARD_NAME_C0385OLD,"Rook, Warstone Golem",รูก วอร์สโตนโกเลม,ルーク、Warstoneゴーレム
CARD_NAME_C0386OLD,"Bishop, Cazador",บิชอป คาซาดอร์,ビショップ、Cazador
CARD_NAME_C0387OLD,"Bishop, Cazadora",บิชอป คาซาดอร่า,ビショップ、Cazadora
CARD_NAME_C0388OLD,"Knight, Caballera",ไนท์ คาบาเยร่า,騎士、Caballera
CARD_NAME_C0389OLD,"Knight, Caballero",ไนท์ คาบาเยโร่,騎士、キャバレロ
CARD_NAME_C0390OLD,"Pawn, Espada",พลเบี้ย เอสปาด้า,ポーン、エスパーダ
CARD_NAME_C0391OLD,"Pawn, Jinete",พลเบี้ย ชิเนเต้,ポーン、Jinete
CARD_NAME_C0392OLD,"Pawn, Bumerang",พลเบี้ย บูมเมอแรง,ポーン、BUMERANG
CARD_NAME_C0393OLD,"Pawn, Lucio",พลเบี้ย ลูซิโอ้,ポーン、ルシオ
CARD_NAME_C0394OLD,"Pawn, Espiar",พลเบี้ย เอสเปียร์,ポーン、Espiar
CARD_NAME_C0395OLD,"Pawn, Arco",พลเบี้ย อาร์โค,ポーン、アルコ
CARD_NAME_C0396OLD,"Pawn, Catapulta",พลเบี้ย คาตาพุลต้า,ポーン、Catapulta
CARD_NAME_C0397OLD,"Pawn, Herrera",พลเบี้ย เอเรร่า,ポーン、エレーラ
CARD_NAME_C0398OLD,Ayah Raja of Earth,ไอยา ราชาแห่งผืนดิน,地球のアヤラジャ
CARD_NAME_C0399OLD,Aturan Mentri of Earth,"อธูรัน
นายกรัฐมนตรีแห่งผืนดิน",地球のAturan Mentri
CARD_NAME_C0400OLD,"Rook, Karas the Fortress",รูค ป้อมปราการคารัส,ルーク、カラスの要塞
CARD_NAME_C0401OLD,"Rook, Blokade the Fortress",รูค ป้อมปราการโบลคัด,ルーク、Blokade要塞
CARD_NAME_C0402OLD,"Bishop, Kanan",บิชอป ขุนนางคานัน,ビショップ、河南
CARD_NAME_C0403OLD,"Bishop, Kiri",บิชอป ขุนนางคิริ,ビショップ、キリ
CARD_NAME_C0404OLD,"Knight, Lari the Scout",ไนท์ ลารี ทหารม้าสอดแนม,騎士、ラリスカウト
CARD_NAME_C0405OLD,"Knight, Batu the Veteran",ไนท์ บาตู ทหารม้าผ่านศึก,騎士、バトゥベテラン
CARD_NAME_C0406OLD,"Pawn, Big Bison",เบี้ย บิ้กไบสัน,ポーン、ビッグバイソン
CARD_NAME_C0407OLD,"Pawn, Digger Mole",เบี้ย ตุ่นนักขุด,ポーン、ディガーモグラ
CARD_NAME_C0408OLD,"Pawn, Shovie Monkey",พลเบี้ย โชวี่ มังกี้,ポーン、Shovieモンキー
CARD_NAME_C0409OLD,"Pawn, Dynamole",พลเบี้ย ตุ่นหนูมือระเบิด,ポーン、Dynamole
CARD_NAME_C0410OLD,"Pawn, Rabbiton",พลเบี้ย ราบิตัน,ポーン、Rabbiton
CARD_NAME_C0411OLD,"Pawn, Thievish Hyena",พลเบี้ย ไฮยีน่ามือไว,ポーン、Thievishハイエナ
CARD_NAME_C0412OLD,"Pawn, Tican",พลเบี้ย ทิคัน,ポーン、Tican
CARD_NAME_C0413OLD,"Pawn, Big Bull",พลเบี้ย บิ้กบูล,ポーン、ビッグ・ブル
CARD_NAME_C0414OLD,Karalis King of Shadow,คาราลิส ราชันย์แห่งเงา,影のKaralisキング
CARD_NAME_C0415OLD,Damana Queen of Shadow,ดามาน่า รานีแห่งเงา,影のDamana女王
CARD_NAME_C0416OLD,Rook Black Axe Tower,รูก หอคอยขวานทมิฬ,ルーク・ブラック・アクス・ザ・タワー
CARD_NAME_C0417OLD,Rook Black Sword Tower,รูก หอคอยดาบทมิฬ,ルークブラックソードタワー
CARD_NAME_C0418OLD,Bishop Black Attacker,บิชอป ผู้สังหารสีนิล,ビショップブラックアタッカー
CARD_NAME_C0419OLD,Bishop Black Defender,บิชอป ผู้ป้องกันสีนิล,ビショップブラックディフェンダー
CARD_NAME_C0420OLD,Knight Black Spear,ไนท์ ทวนสีนิล,ナイトブラックスピア
CARD_NAME_C0421OLD,Knight Black Scythe,ไนท์ เคียวสีนิล,ナイトブラック鎌
CARD_NAME_C0422OLD,Pawn Black Long Swordman,เบี้ย ดาบยาวสีนิล,ポーン黒ロング剣士
CARD_NAME_C0423OLD,Pawn Black Swordman,เบี้ย นักดาบสีนิล,ポーンブラック剣士
CARD_NAME_C0424OLD,Pawn Black Pole Arm,เบี้ย พลหอกสีนิล,ポーンブラックポールアーム
CARD_NAME_C0425OLD,Pawn Black Thief,เบี้ย จอมโจรสีนิล,ポーンブラック泥棒
CARD_NAME_C0426OLD,Pawn Black Greatsword,เบี้ย ดาบใหญ่สีนิล,ポーンブラックグレートソード
CARD_NAME_C0427OLD,Pawn Black Mage,เบี้ย นักเวทสีนิล,ポーン黒魔道士
CARD_NAME_C0428OLD,Pawn Black Long Batonman,เบี้ย คทาสีนิล,ポーン黒ロングBatonman
CARD_NAME_C0429OLD,Pawn Black Trickster,เบี้ย จอมลวงสีนิล,ポーンブラックトリックスター
CARD_NAME_C0430OLD,"King, Keres the Kuningas",ราชา เคเรสจอมราชันย์,キング、Keres Kuningas
CARD_NAME_C0431OLD,Queen Lipp,ราชินี ลิปป์,女王LIPP
CARD_NAME_C0432OLD,Rook White Machine,รูก จักรกลสีขาว,ルークホワイトマシン
CARD_NAME_C0433OLD,Rook Black Machine,รูก จักรกลทมิฬ,ルークブラックマシン
CARD_NAME_C0434OLD,Bishop Spearman,บิชอป พลหอกชาย,ビショップスピアマン
CARD_NAME_C0435OLD,Bishop Spearwoman,บิชอป พลหอกหญิง,ビショップSpearwoman
CARD_NAME_C0436OLD,Knight White Horse,ไนท์ อาชาสีขาว,ナイトホワイトホース
CARD_NAME_C0437OLD,Knight Black Horse,ไนท์ อาชาทมิฬ,ナイトブラックホース
CARD_NAME_C0438OLD,Pawn Energy Machine,เบี้ย จักรกลเปี่ยมพลัง,ポーンエネルギーマシン
CARD_NAME_C0439OLD,Pawn High Sorcerer Bunny,เบี้ย กระต่ายจอมเวทชั้นสูง,ポーンハイソーサラーバニー
CARD_NAME_C0440OLD,Pawn Swordman Bunny,เบี้ย กระต่ายนักดาบ,ポーン剣士バニー
CARD_NAME_C0441OLD,Pawn Spearman Bunny,เบี้ย กระต่ายพลหอก,ポーンスピアマンバニー
CARD_NAME_C0442OLD,Pawn Sorceress Bunny,เบี้ย กระต่ายนักเวท,ポーンソーサレスバニー
CARD_NAME_C0443OLD,Pawn Warrior Bunny,เบี้ย กระต่ายนักรบ,ポーン戦士バニー
CARD_NAME_C0444OLD,Pawn Alchemist Bunny,เบี้ย กระต่ายแปรธาตุ,ポーン錬金術師バニー
CARD_NAME_C0445OLD,Pawn Energy Giant,เบี้ย หุ่นยักษ์เปี่ยมพลัง,ポーンエネルギー巨人
CARD_NAME_C0446OLD,The Forgotten King,ราชันที่ถูกลืม,忘れられた王
CARD_NAME_C0447OLD,Merciless Fencing Man,นักดาบไร้ใจ,無慈悲フェンシングマン
CARD_NAME_C0448OLD,Chess the Ruler,เชส ผู้คุมกฏ,チェスルーラー
CARD_NAME_C0449OLD,Colorless Knight,นักดาบไร้สังกัด,無色の騎士
CARD_NAME_C0450OLD,Lost Fortress Watcher,ปราการที่สาบสูญ,失われた要塞ウォッチャー
CARD_NAME_C0451OLD,Abandoned Ship,เรือที่ถูกละทิ้ง,放棄された船
CARD_NAME_C0452OLD,Colorless Dragon,มังกรไร้สี,無色ドラゴン
CARD_NAME_C0453OLD,Corner Thief,โจรมุมตึก,コーナー泥棒
CARD_NAME_C0454OLD,Shady Bar Owner,เจ้าของบาร์ลึกลับ,シェイディBarオーナー
CARD_NAME_C0455OLD,Blind Warrior,นักรบตาบอด,ブラインド戦士
CARD_NAME_C0456OLD,Suspicious Beggar,ขอทานน่าสงสัย,不審な乞食
CARD_NAME_C0457OLD,Rusted Fencer,นักดาบ สนิมเขรอะ,錆びたフェンサー
CARD_NAME_C0458OLD,Mysterious Merchant,พ่อค้าปริศนา,謎の商人
CARD_NAME_C0459OLD,Villager,ชาวบ้านธรรมดา,村人
CARD_NAME_C0486OLD,Wishful Soul,วิญญาณผู้ปรารถนา,希望的観測ソウル
CARD_NAME_C0595OLD,Black Sword's Right Hand Pawn,เบี้ยขวาแห่งอัศวินดาบทมิฬ,ブラックソードの右手のポーン
CARD_NAME_C0596OLD,Black Sword's Left Hand Pawn,เบี้ยซ้ายแห่งอัศวินดาบทมิฬ,ブラックソードの左手のポーン
CARD_NAME_C0597OLD,Lipp's Last Light,แสงสุดท้ายของลิปป์,LIPPの最後のライト