Key,English,Thai,Japanese
ITEM_NAME_HUD0000,Default Console,คอนโซล พื้นฐาน,コンソールのデフォルト
ITEM_NAME_HUD0001,Prime Console,คอนโซล ไพร์ม,プライムコンソール
ITEM_NAME_HUD0002,Stargazer Console,คอนโซล นักดูดาว,スターゲイザーコンソール
ITEM_NAME_HUD0003,Shooting Star Console,คอนโซล ดาวตก,スターコンソールシューティング
ITEM_NAME_HUD0004,Beach Console,คอนโซล ชายหาด,ビーチコンソール
ITEM_NAME_HUD0005,Summer Festival Console,คอนโซล เทศกาลหน้าร้อน,夏祭りコンソール
ITEM_NAME_HUD0006,Back To School Console,คอนโซล ต้อนรับกลับสู่โรงเรียน,背面に学校コンソール
ITEM_NAME_HUD0007,Halloween Party Console,คอนโซล ปาร์ตี้ฮาโรวีน,ハロウィンパーティーコンソール
ITEM_NAME_HUD0008,-,-, - 
ITEM_NAME_HUD0009,Snow Town Console,คอนโซล เมืองหิมะ,スノータウンコンソール
ITEM_NAME_HUD0010,Slime Family Console,คอนโซล ครอบครัวสไลม์,スライムファミリーコンソール
ITEM_NAME_HUD0011,China Town Console,คอนโซล ไชน่าทาวน์,チャイナタウンコンソール
ITEM_NAME_HUD0012,Cupid Town Console,คอนโซล คิวปิตทาวน์,キューピッドタウンコンソール
ITEM_NAME_HUD0013,Star Console,คอนโซลแห่งดวงดาว,スターコンソール
ITEM_NAME_HUD0014,Grand Master Console,คอนโซลแกรนมาสเตอร์,グランドマスター・コンソール
ITEM_NAME_HUD0015,Flower Garden Console,คอนโซลสวนดอกไม้,フラワーガーデンコンソール
ITEM_DESCRIPTION_HUD0000,Receive immediately,ได้รับทันที,すぐに受信
ITEM_DESCRIPTION_HUD0001,Can be purchased from the Shop,ซื้อได้ในร้านค้า,ショップから購入することができます
ITEM_DESCRIPTION_HUD0002,Obtain from loot box in Star Chamber,ได้รับจาก รูทบ็อกซ์ ใน สตาร์ แชมเบอร์,星室庁に戦利品ボックスから入手します
ITEM_DESCRIPTION_HUD0003,Obtain from loot box in Star Chamber,ได้รับจาก รูทบ็อกซ์ ใน สตาร์ แชมเบอร์,星室庁に戦利品ボックスから入手します
ITEM_DESCRIPTION_HUD0004,Event item Beach Party 2019 ,ของตกแต่งเทศกาล ปาร์ตี้ชายหาด 2019,イベントアイテムビーチパーティー2019
ITEM_DESCRIPTION_HUD0005,Event item Summer Festival 2019 ,ของตกแต่งเทศกาล เทศกาลหน้าร้อน 2019,イベントアイテムサマーフェスティバル2019
ITEM_DESCRIPTION_HUD0006,Event item Back To School 2019,ของตกแต่งเทศกาล ต้อนรับกลับสู่โรงเรียน 2019,イベントアイテム背面に学校2019
ITEM_DESCRIPTION_HUD0007,Event item Halloween Party 2019,ของตกแต่งเทศกาล ปาร์ตี้ฮาโรวีน 2019,イベントアイテムハロウィンパーティー2019
ITEM_DESCRIPTION_HUD0008,-,-, - 
ITEM_DESCRIPTION_HUD0009,Battle Pass Season 1 reward.,ของรางวัลจาก แบทเทิลพาส ฤดูกาลที่ 1,バトルパスシーズン1の報酬。
ITEM_DESCRIPTION_HUD0010,Card Set Bonus reward.,ของรางวัลจาก การ์ดเซ็ตโบนัส,カードセットボーナス報酬。
ITEM_DESCRIPTION_HUD0011,Battle Pass Season 2 reward.,ของรางวัลจาก แบทเทิลพาส ฤดูกาลที่ 2,バトル峠シーズン2の報酬。
ITEM_DESCRIPTION_HUD0012,Can be purchased from the Shop,ซื้อได้ในร้านค้า,ショップから購入することができます
ITEM_DESCRIPTION_HUD0013,Card Set Bonus reward.,ของรางวัลจาก การ์ดเซ็ตโบนัส,カードセットボーナス報酬。
ITEM_DESCRIPTION_HUD0014,Card Set Bonus reward.,ของรางวัลจาก การ์ดเซ็ตโบนัส,カードセットボーナス報酬。
ITEM_DESCRIPTION_HUD0015,Battle Pass Season 3 reward.,ของรางวัลจาก แบทเทิลพาส ฤดูกาลที่ 3,バトル峠シーズン3の報酬。
ITEM_NAME_HUD0019,Water Festival Console,คอนโซล เทศกาลแห่งสายน้ำ,水祭りコンソール
ITEM_DESCRIPTION_HUD0019,Can be purchased from the Shop,ซื้อได้ในร้านค้า,ショップから購入することができます