{
  "enrichments": {
    "CR000109BA": {
      "name": "10 Radio",
      "radiodnsId": ""
    },
    "CR101282BA": {
      "name": "1BTN"
    },
    "CR000141BA": {
      "name": "3TFM Community Radio for Health"
    },
    "CR100059BA": {
      "name": "ABC FM"
    },
    "CR000243BA": {
      "name": "AIR",
      "radiodnsId": "fm:ce1.c588.10720"
    },
    "CR000023BA": {
      "name": "ALL FM",
      "radiodnsId": "fm:ce1.c691.09690"
    },
    "CR000235BA": {
      "name": "Abbey 104",
      "radiodnsId": "fm:ce1.c986.10470"
    },
    "CR000203BA": {
      "name": "Academy FM 105.9"
    },
    "CR000202BA": {
      "name": "Academy FM 107.8"
    },
    "CR100143BA": {
      "name": "Akash Radio Leeds"
    },
    "CR000129BA": {
      "name": "Aldergrove and Antrim FM"
    },
    "CR102893BA": {
      "name": "Alfred"
    },
    "CR000126BA": {
      "name": "Alive Radio"
    },
    "CR000170BA": {
      "name": "Amber Sound FM",
      "radiodnsId": "fm:ce1.cc93.09840"
    },
    "CR000175BA": {
      "name": "Ambur Radio",
      "radiodnsId": "fm:ce1.c089.09940"
    },
    "CR101268BA": {
      "name": "Andover Radio",
      "radiodnsId": "fm:ce1.c0a8.09590"
    },
    "CR101255BA": {
      "name": "Angel Radio",
      "radiodnsId": "dab:ce1.c1a3.cdc2.0"
    },
    "CR000007BA": {
      "name": "Angel Radio Isle of Wight"
    },
    "CR000241BA": {
      "name": "Apple FM"
    },
    "CR000067BA": {
      "name": "Asian Star 101.6 FM",
      "radiodnsId": "dab:ce1.c1c6.c080.0"
    },
    "CR101276BA": {
      "name": "Awaaz FM"
    },
    "CR000019BA": {
      "name": "Awaz FM"
    },
    "CR102194BA": {
      "name": "B Radio",
      "radiodnsId": "fm:ce1.c07f.09560",
      "_notes": "Lookup of ofcom license lists Glow Radio, not B Radio"
    },
    "CR102292BA": {
      "name": "B Radio",
      "radiodnsId":"dab:ce1.c1cd.c08d.0"
    },
    "CR000021BA": {
      "name": "BCB 106.6 FM",
      "radiodnsId":"fm:ce1.c491.10660"
    },
    "CR000079BA": {
      "name": "BFBS",
      "radiodnsId":null
    },
    "CR000234BA": {
      "name": "BFBS",
      "radiodnsId":null
    },
    "CR000096BA": {
      "name": "BFBS",
      "radiodnsId":null
    },
    "CR000147BA": {
      "name": "BFBS",
      "radiodnsId":null
    },
    "CR000058BA": {
      "name": "BFBS",
      "radiodnsId":null
    },
    "CR000092BA": {
      "name": "BFBS",
      "radiodnsId":null
    },
    "CR101287BA": {
      "name": "BFBS Brize Norton",
      "radiodnsId":null
    },
    "CR000045BA": {
      "name": "BFBS Lisburn FM",
      "radiodnsId":null
    },
    "CR101289BA": {
      "name": "BFBS Shorncliffe",
      "radiodnsId":null
    },
    "CR000110BA": {
      "name": "BGFM",
      "radiodnsId":null
    },
    "CR000107BA": {
      "name": "BRFM 95.6 FM",
      "radiodnsId":null
    },
    "CR000122BA": {
      "name": "BRO Radio",
      "radiodnsId":"fm:ce1.cb90.09810"
    },
    "CR000127BA": {
      "name": "Bangor FM",
      "radiodnsId":null
    },
    "CR000158BA": {
      "name": "Beat Radio",
      "radiodnsId":null
    },
    "CR100062BA": {
      "name": "Belfast FM",
      "radiodnsId":null
    },
    "CR100138BA": {
      "name": "Beverley FM",
      "radiodnsId":null
    },
    "CR100156BA": {
      "name": "Beyond Radio",
      "radiodnsId":null
    },
    "CR000038BA": {
      "name": "Big City Radio",
      "radiodnsId":null
    },
    "CR000196BA": {
      "name": "Biggles FM",
      "radiodnsId":null
    },
    "CR000146BA": {
      "name": "Bishop FM 105.9",
      "radiodnsId":null
    },
    "CR100794BA": {
      "name": "Black Cat Radio",
      "radiodnsId":null
    },
    "CR000041BA": {
      "name": "Black Country Radio",
      "radiodnsId":"dab:ce1.c1c9.cad5.0"
    },
    "CR000081BA": {
      "name": "Black Diamond FM",
      "radiodnsId":null
    },
    "CR102146BA": {
      "name": "Blackburn's 102.2FM",
      "radiodnsId":null
    },
    "CR000140BA": {
      "name": "Blast 106",
      "radiodnsId":null
    },
    "CR000163BA": {
      "name": "Bolton FM",
      "radiodnsId":"fm:ce1.c09f.09650"
    },
    "CR102136BA": {
      "name": "Bounce FM",
      "radiodnsId":null
    },
    "CR100145BA": {
      "name": "Bradford Asian Radio",
      "radiodnsId":null
    },
    "CR000232BA": {
      "name": "Bradley Stoke Radio",
      "radiodnsId":"dab:ce1.c1c8.c987.0"
    },
    "CR000085BA": {
      "name": "Branch FM",
      "radiodnsId":"fm:ce1.c580.10180"
    },
    "CR000078BA": {
      "name": "Bristol Community FM",
      "radiodnsId":null
    },
    "CR102307BA": {
      "name": "Buchan Radio",
      "radiodnsId":null
    },
    "CR102129BA": {
      "name": "Burgess Hill Radio",
      "radiodnsId":"fm:ce1.c0b3.10380"
    },
    "CR000124BA": {
      "name": "Bute Island Radio",
      "radiodnsId":null
    },
    "CR000248BA": {
      "name": "CHBN",
      "radiodnsId":null
    },
    "CR101264BA": {
      "name": "Cabin FM",
      "radiodnsId":null
    },
    "CR102144BA": {
      "name": "Caithness FM",
      "radiodnsId":null
    },
    "CR000091BA": {
      "name": "Calon FM",
      "radiodnsId":null
    },
    "CR000193BA": {
      "name": "Cam FM",
      "radiodnsId":null
    },
    "CR000256BA": {
      "name": "CamGlen Radio",
      "radiodnsId":null
    },
    "CR000095BA": {
      "name": "Cambridge 105 FM",
      "radiodnsId":"dab:ce1.c1c4.c791.0"
    },
    "CR000160BA": {
      "name": "Canalside Radio 102.8 FM",
      "radiodnsId":null
    },
    "CR101253BA": {
      "name": "Cando FM",
      "radiodnsId":null
    },
    "CR102031BA": {
      "name": "Cannock Chase Radio",
      "radiodnsId":null
    },
    "CR101731BA": {
      "name": "Carillon Wellbeing Radio",
      "radiodnsId":null
    },
    "CR102143BA": {
      "name": "Caroline Community Radio",
      "radiodnsId":null
    },
    "CR000093BA": {
      "name": "Castledown Radio",
      "radiodnsId":null
    },
    "CR000257BA": {
      "name": "Celtic Music Radio",
      "radiodnsId":null
    },
    "CR100793BA": {
      "name": "Chelmsford Community Radio",
      "radiodnsId":null
    },
    "CR102875BA": {
      "name": "Chiltern Voice",
      "radiodnsId":null
    },
    "CR000249BA": {
      "name": "Coast FM",
      "radiodnsId":null
    },
    "CR102167BA": {
      "name": "Coast FM",
      "radiodnsId":null
    },
    "CR102859BA": {
      "name": "Coast and County Radio",
      "radiodnsId":null
    },
    "CR100776BA": {
      "name": "Colne Radio",
      "radiodnsId":null
    },
    "CR000144BA": {
      "name": "Community Voice FM",
      "radiodnsId":null
    },
    "CR000185BA": {
      "name": "Corby Radio",
      "radiodnsId":null
    },
    "CR000026BA": {
      "name": "Crescent Radio",
      "radiodnsId":null
    },
    "CR102863BA": {
      "name": "Cross Counties Radio",
      "radiodnsId":null
    },
    "CR000003BA": {
      "name": "Cross Rhythms City Radio",
      "radiodnsId":null
    },
    "CR000059BA": {
      "name": "Cross Rhythms Plymouth",
      "radiodnsId":null
    },
    "CR102853BA": {
      "name": "Croydon FM",
      "radiodnsId":null
    },
    "CR000258BA": {
      "name": "Crystal FM",
      "radiodnsId":null
    },
    "CR102242BA": {
      "name": "Cumbernauld FM",
      "radiodnsId":null
    },
    "CR100180BA": {
      "name": "Dales Radio",
      "radiodnsId":null
    },
    "CR102148BA": {
      "name": "Dean Radio",
      "radiodnsId":null
    },
    "CR000061BA": {
      "name": "Desi Radio",
      "radiodnsId":null
    },
    "CR000265BA": {
      "name": "Deveron FM",
      "radiodnsId":null
    },
    "CR102854BA": {
      "name": "Digital Hits One",
      "radiodnsId":null
    },
    "CR000089BA": {
      "name": "Diverse FM",
      "radiodnsId":null
    },
    "CR000047BA": {
      "name": "Down FM",
      "radiodnsId":null
    },
    "CR000132BA": {
      "name": "Drive 105 FM",
      "radiodnsId":null
    },
    "CR000148BA": {
      "name": "Drystone Radio",
      "radiodnsId":null
    },
    "CR000136BA": {
      "name": "Dunoon Community Radio",
      "radiodnsId":null
    },
    "CR000178BA": {
      "name": "EAVA FM",
      "radiodnsId":null
    },
    "CR000259BA": {
      "name": "East Coast FM",
      "radiodnsId":null
    },
    "CR000236BA": {
      "name": "East Devon Radio",
      "radiodnsId":"fm:ce1.cc87.09460"
    },
    "CR100181BA": {
      "name": "Eden FM",
      "radiodnsId":null
    },
    "CR100530BA": {
      "name": "Endeavour FM",
      "radiodnsId":null
    },
    "CR000171BA": {
      "name": "Erewash Sound",
      "radiodnsId":null
    },
    "CR000006BA": {
      "name": "Express FM",
      "radiodnsId":null
    },
    "CR000231BA": {
      "name": "Fantasy Radio",
      "radiodnsId":null
    },
    "CR000190BA": {
      "name": "Felixstowe Radio",
      "radiodnsId":null
    },
    "CR000031BA": {
      "name": "Fever FM",
      "radiodnsId":null
    },
    "CR101278BA": {
      "name": "Fiesta FM",
      "radiodnsId":null
    },
    "CR000215BA": {
      "name": "First FM",
      "radiodnsId":null
    },
    "CR000155BA": {
      "name": "Flame CCR",
      "radiodnsId":null
    },
    "CR101737BA": {
      "name": "Flex FM",
      "radiodnsId":null
    },
    "CR000063BA": {
      "name": "Forest FM",
      "radiodnsId":null
    },
    "CR000230BA": {
      "name": "Frome FM",
      "radiodnsId":null
    },
    "CR101405BA": {
      "name": "Funky SX",
      "radiodnsId":null
    },
    "CR000192BA": {
      "name": "Future Radio",
      "radiodnsId":"dab:ce1.c1cb.cbd6.0"
    },
    "CR000004BA": {
      "name": "GTFM",
      "radiodnsId":null
    },
    "CR000218BA": {
      "name": "Gateway 97.8",
      "radiodnsId":null
    },
    "CR000186BA": {
      "name": "Gaydio",
      "radiodnsId":"dab:ce1.c199.c9c9.0"
    },
    "CR101283BA": {
      "name": "Gaydio (Brighton)",
      "radiodnsId":"fm:ce1.c057.09870"
    },
    "CR000117BA": {
      "name": "Glastonbury FM",
      "radiodnsId":null
    },
    "CR000054BA": {
      "name": "Gloucester FM",
      "radiodnsId":null
    },
    "CR000168BA": {
      "name": "Gravity FM",
      "radiodnsId":null
    },
    "CR102158BA": {
      "name": "Great Driffield Radio",
      "radiodnsId":"fm:ce1.c04f.10720"
    },
    "CR102272BA": {
      "name": "Groove City Radio",
      "radiodnsId":null
    },
    "CR100527BA": {
      "name": "Gulshan Radio",
      "radiodnsId":null
    },
    "CR000199BA": {
      "name": "HCR FM",
      "radiodnsId":null,
      "SID":"CA8A"
    },
    "CR101277BA": {
      "name": "Hailsham FM",
      "radiodnsId":null
    },
    "CR000102BA": {
      "name": "Halton Community Radio",
      "radiodnsId":null
    },
    "CR000013BA": {
      "name": "Harborough FM (Hfm)",
      "radiodnsId":null
    },
    "CR100787BA": {
      "name": "Harbour Radio",
      "radiodnsId":null
    },
    "CR000073BA": {
      "name": "Hayes FM",
      "radiodnsId":null
    },
    "CR102298BA": {
      "name": "Heritage CR",
      "radiodnsId":null
    },
    "CR000181BA": {
      "name": "Hermitage FM",
      "radiodnsId":null
    },
    "CR000183BA": {
      "name": "Hillz FM",
      "radiodnsId":null
    },
    "CR100399BA": {
      "name": "Hitmix Radio",
      "radiodnsId":null
    },
    "CR000131BA": {
      "name": "Holywood FM",
      "radiodnsId":null
    },
    "CR000086BA": {
      "name": "Hope FM",
      "radiodnsId":null
    },
    "CR000120BA": {
      "name": "Hot Radio 102.8",
      "radiodnsId":null
    },
    "CR100147BA": {
      "name": "Hull Kingston Radio",
      "radiodnsId":null
    },
    "CR000046BA": {
      "name": "IUR FM",
      "radiodnsId":null
    },
    "CR000200BA": {
      "name": "In2beats FM",
      "radiodnsId":null
    },
    "CR000217BA": {
      "name": "Insanity Radio",
      "radiodnsId":null
    },
    "CR103400BA": {
      "name": "Inspiration FM",
      "radiodnsId":null
    },
    "CR000198BA": {
      "name": "Inspire FM",
      "radiodnsId":null
    },
    "CR000087BA": {
      "name": "Ipswich Community Radio",
      "radiodnsId":null
    },
    "CR000263BA": {
      "name": "Irvine Beat FM",
      "radiodnsId":null
    },
    "CR000030BA": {
      "name": "Islands FM",
      "radiodnsId":null
    },
    "CR102149BA": {
      "name": "Jorvik Radio",
      "radiodnsId":null
    },
    "CR102273BA": {
      "name": "Juice FM Belfast",
      "radiodnsId":null
    },
    "CR000261BA": {
      "name": "K107 FM",
      "radiodnsId":null
    },
    "CR000162BA": {
      "name": "KCC Live",
      "radiodnsId":null
    },
    "CR000264BA": {
      "name": "KCR",
      "radiodnsId":null
    },
    "CR102150BA": {
      "name": "KTCRfm",
      "radiodnsId":null
    },
    "CR000220BA": {
      "name": "Kane FM",
      "radiodnsId":null
    },
    "CR102138BA": {
      "name": "KeeP 106",
      "radiodnsId":null
    },
    "CR000016BA": {
      "name": "Kemet Radio",
      "radiodnsId":null
    },
    "CR101274BA": {
      "name": "Kennet Radio",
      "radiodnsId":null
    },
    "CR100214BA": {
      "name": "Koast Radio",
      "radiodnsId":null
    },
    "CR000180BA": {
      "name": "Kohinoor FM",
      "radiodnsId":null
    },
    "CR102239BA": {
      "name": "Leeds Dance Community Radio",
      "radiodnsId":null
    },
    "CR000164BA": {
      "name": "Legacy 90.1",
      "radiodnsId":null
    },
    "CR000195BA": {
      "name": "Leisure FM",
      "radiodnsId":null
    },
    "CR000166BA": {
      "name": "Lincoln City Radio",
      "radiodnsId":null
    },
    "CR100157BA": {
      "name": "Link FM",
      "radiodnsId":null
    },
    "CR000049BA": {
      "name": "Lionheart Radio",
      "radiodnsId":null
    },
    "CR000139BA": {
      "name": "Lisburn's 98FM",
      "radiodnsId":null
    },
    "CR102133BA": {
      "name": "Liverpool Community Radio",
      "radiodnsId":null
    },
    "CR100797BA": {
      "name": "MKFM",
      "radiodnsId":null
    },
    "CR101734BA": {
      "name": "Maritime Radio",
      "radiodnsId":null
    },
    "CR000209BA": {
      "name": "Marlow FM",
      "radiodnsId":null
    },
    "CR000134BA": {
      "name": "Mearns FM",
      "radiodnsId":null
    },
    "CR000206BA": {
      "name": "Meridian FM",
      "radiodnsId":null
    },
    "CR102153BA": {
      "name": "Mighty Radio",
      "radiodnsId":null
    },
    "CR000161BA": {
      "name": "Moorlands Radio",
      "radiodnsId":null
    },
    "CR100783BA": {
      "name": "NLive",
      "radiodnsId":null
    },
    "CR000262BA": {
      "name": "Nevis Radio",
      "radiodnsId":null
    },
    "CR000037BA": {
      "name": "New Style Radio 98.7 FM",
      "radiodnsId":null
    },
    "CR102137BA": {
      "name": "Ninesprings FM",
      "radiodnsId":null
    },
    "CR101743BA": {
      "name": "Nomad Radio",
      "radiodnsId":null
    },
    "CR000165BA": {
      "name": "North Manchester FM",
      "radiodnsId":null
    },
    "CR100520BA": {
      "name": "Nova FM",
      "radiodnsId":null
    },
    "CR000050BA": {
      "name": "Nova Radio North East 102.5 FM",
      "radiodnsId":null
    },
    "CR000069BA": {
      "name": "Nu Sound Radio",
      "radiodnsId":null
    },
    "CR000032BA": {
      "name": "Oldham Community Radio",
      "radiodnsId":null
    },
    "CR102170BA": {
      "name": "Paisley FM",
      "radiodnsId":null
    },
    "CR100789BA": {
      "name": "Park Radio",
      "radiodnsId":null
    },
    "CR000099BA": {
      "name": "Pendle Community Radio",
      "radiodnsId":null
    },
    "CR000153BA": {
      "name": "Penistone FM",
      "radiodnsId":null
    },
    "CR100790BA": {
      "name": "Peterborough Community Radio",
      "radiodnsId":null
    },
    "CR000075BA": {
      "name": "Phoenix FM",
      "radiodnsId":null
    },
    "CR000022BA": {
      "name": "Phoenix FM",
      "radiodnsId":null
    },
    "CR000118BA": {
      "name": "Phonic FM",
      "radiodnsId":null
    },
    "CR101275BA": {
      "name": "Platform B",
      "radiodnsId":null
    },
    "CR102268BA": {
      "name": "Pride FM",
      "radiodnsId":null
    },
    "CR000138BA": {
      "name": "Pulse Community Radio",
      "radiodnsId":null
    },
    "CR102132BA": {
      "name": "Purbeck Coast FM",
      "radiodnsId":null
    },
    "CR100346BA": {
      "name": "Quay FM",
      "radiodnsId":null
    },
    "CR000017BA": {
      "name": "RNIB Connect Radio",
      "radiodnsId":null
    },
    "CR000189BA": {
      "name": "RWS FM 103.3",
      "radiodnsId":null
    },
    "CR000177BA": {
      "name": "Raaj FM",
      "radiodnsId":null
    },
    "CR000201BA": {
      "name": "Radio Ashford",
      "radiodnsId":null
    },
    "CR000094BA": {
      "name": "Radio Cardiff",
      "radiodnsId":null
    },
    "CR101725BA": {
      "name": "Radio Caroline",
      "radiodnsId":null
    },
    "CR000015BA": {
      "name": "Radio Dawn",
      "radiodnsId":null
    },
    "CR000014BA": {
      "name": "Radio Faza 97.1 FM",
      "radiodnsId":null
    },
    "CR000145BA": {
      "name": "Radio Hartlepool",
      "radiodnsId":null
    },
    "CR000011BA": {
      "name": "Radio Ikhlas",
      "radiodnsId":null
    },
    "CR000197BA": {
      "name": "Radio LaB",
      "radiodnsId":null
    },
    "CR102151BA": {
      "name": "Radio Leyland",
      "radiodnsId":null
    },
    "CR102243BA": {
      "name": "Radio MAC",
      "radiodnsId":null
    },
    "CR100523BA": {
      "name": "Radio Newark",
      "radiodnsId":null
    },
    "CR102160BA": {
      "name": "Radio Newquay",
      "radiodnsId":null
    },
    "CR100535BA": {
      "name": "Radio Panj",
      "radiodnsId":null
    },
    "CR000182BA": {
      "name": "Radio Plus",
      "radiodnsId":null
    },
    "CR101766BA": {
      "name": "Radio Ramadan 365",
      "radiodnsId":null
    },
    "CR000057BA": {
      "name": "Radio Reverb",
      "radiodnsId":null
    },
    "CR102281BA": {
      "name": "Radio Saltire",
      "radiodnsId":null
    },
    "CR100136BA": {
      "name": "Radio Sangam",
      "radiodnsId":null
    },
    "CR102898BA": {
      "name": "Radio Scarborough",
      "radiodnsId":null
    },
    "CR101765BA": {
      "name": "Radio Seerah",
      "radiodnsId":null
    },
    "CR000115BA": {
      "name": "Radio St Austell Bay",
      "radiodnsId":null
    },
    "CR000173BA": {
      "name": "Radio Tamworth",
      "radiodnsId":null
    },
    "CR000111BA": {
      "name": "Radio Tircoed",
      "radiodnsId":null
    },
    "CR102238BA": {
      "name": "Radio Tyneside",
      "radiodnsId":null
    },
    "CR000090BA": {
      "name": "Radio Verulam",
      "radiodnsId":null
    },
    "CR100137BA": {
      "name": "Radio Warrington",
      "radiodnsId":null
    },
    "CR102864BA": {
      "name": "Radio Wimborne",
      "radiodnsId":null
    },
    "CR000233BA": {
      "name": "Radio Winchcombe",
      "radiodnsId":null
    },
    "CR102241BA": {
      "name": "Radio2Funky",
      "radiodnsId":null
    },
    "CR101260BA": {
      "name": "Red Kite Radio",
      "radiodnsId":null
    },
    "CR000151BA": {
      "name": "Redroad FM",
      "radiodnsId":null
    },
    "CR000224BA": {
      "name": "Reprezent 107.3 FM",
      "radiodnsId":null
    },
    "CR000060BA": {
      "name": "Resonance FM",
      "radiodnsId":null
    },
    "CR102295BA": {
      "name": "Revival FM",
      "radiodnsId":null
    },
    "CR000020BA": {
      "name": "Revival FM",
      "radiodnsId":null
    },
    "CR101746BA": {
      "name": "Revive FM",
      "radiodnsId":null
    },
    "CR103405BA": {
      "name": "Revolution Radio",
      "radiodnsId":null
    },
    "CR102155BA": {
      "name": "Rhondda Radio",
      "radiodnsId":null
    },
    "CR101582BA": {
      "name": "Ribble FM",
      "radiodnsId":null
    },
    "CR000225BA": {
      "name": "Rinse FM",
      "radiodnsId":null
    },
    "CR102117BA": {
      "name": "Riviera FM",
      "radiodnsId":null
    },
    "CR102156BA": {
      "name": "Rossendale Radio",
      "radiodnsId":null
    },
    "CR000219BA": {
      "name": "SFM 106.9",
      "radiodnsId":null
    },
    "CR102274BA": {
      "name": "SWUFM",
      "radiodnsId":null
    },
    "CR100168BA": {
      "name": "Salaam BCR",
      "radiodnsId":null
    },
    "CR100792BA": {
      "name": "Salaam Radio",
      "radiodnsId":null
    },
    "CR000035BA": {
      "name": "Salford City Radio",
      "radiodnsId":null
    },
    "CR000211BA": {
      "name": "Seahaven FM",
      "radiodnsId":null
    },
    "CR000052BA": {
      "name": "Seaside FM 105.3",
      "radiodnsId":null
    },
    "CR100777BA": {
      "name": "Secklow Sounds",
      "radiodnsId":null
    },
    "CR000240BA": {
      "name": "Sedgemoor FM",
      "radiodnsId":null
    },
    "CR102883BA": {
      "name": "Select Radio",
      "radiodnsId":null
    },
    "CR000083BA": {
      "name": "Sheffield Live! 93.2 FM",
      "radiodnsId":null
    },
    "CR101266BA": {
      "name": "Sheppey FM",
      "radiodnsId":null
    },
    "CR103150BA": {
      "name": "Shoreline FM",
      "radiodnsId":null
    },
    "CR000150BA": {
      "name": "Sine FM",
      "radiodnsId":null
    },
    "CR000088BA": {
      "name": "Siren FM",
      "radiodnsId":null
    },
    "CR102164BA": {
      "name": "Skylark",
      "radiodnsId":null
    },
    "CR000009BA": {
      "name": "Skyline Gold 102.5",
      "radiodnsId":null
    },
    "CR000113BA": {
      "name": "Somer Valley FM",
      "radiodnsId":null
    },
    "CR102884BA": {
      "name": "Sound Radio",
      "radiodnsId":null
    },
    "CR000112BA": {
      "name": "Soundart Radio",
      "radiodnsId":null
    },
    "CR000143BA": {
      "name": "Spark FM",
      "radiodnsId":null
    },
    "CR000133BA": {
      "name": "Speysound Radio",
      "radiodnsId":null
    },
    "CR000142BA": {
      "name": "Spice FM",
      "radiodnsId":null
    },
    "CR100531BA": {
      "name": "Stafford FM",
      "radiodnsId":null
    },
    "CR000018BA": {
      "name": "Sunny Govan Radio",
      "radiodnsId":null
    },
    "CR102263BA": {
      "name": "Sunshine",
      "radiodnsId":null
    },
    "CR000223BA": {
      "name": "Susy Radio",
      "radiodnsId":null
    },
    "CR000119BA": {
      "name": "Swindon 105.5",
      "radiodnsId":null
    },
    "CR000174BA": {
      "name": "Switch Radio 107.5",
      "radiodnsId":null
    },
    "CR000266BA": {
      "name": "TD1 Radio",
      "radiodnsId":null
    },
    "CR000154BA": {
      "name": "TMCR",
      "radiodnsId":null
    },
    "CR000010BA": {
      "name": "Takeover Radio",
      "radiodnsId":null
    },
    "CR000169BA": {
      "name": "Takeover Radio 106.9",
      "radiodnsId":null
    },
    "CR000033BA": {
      "name": "Tameside Radio",
      "radiodnsId":null
    },
    "CR000064BA": {
      "name": "Tempo 107.4 FM",
      "radiodnsId":null
    },
    "CR000068BA": {
      "name": "The Beat London 103.6FM",
      "radiodnsId":null
    },
    "CR100139BA": {
      "name": "The Cat",
      "radiodnsId":null
    },
    "CR000012BA": {
      "name": "The Eye",
      "radiodnsId":null
    },
    "CR102255BA": {
      "name": "The Flash",
      "radiodnsId":null
    },
    "CR000114BA": {
      "name": "The Source",
      "radiodnsId":null
    },
    "CR000238BA": {
      "name": "The Voice",
      "radiodnsId":null
    },
    "CR102878BA": {
      "name": "Thornbury Radio",
      "radiodnsId":null
    },
    "CR000242BA": {
      "name": "Tone FM",
      "radiodnsId":null
    },
    "CR000207BA": {
      "name": "Uckfield FM",
      "radiodnsId":null
    },
    "CR000116BA": {
      "name": "Ujima Radio",
      "radiodnsId":null
    },
    "CR000008BA": {
      "name": "Unity 101",
      "radiodnsId":null
    },
    "CR000039BA": {
      "name": "Unity FM",
      "radiodnsId":null
    },
    "CR000187BA": {
      "name": "Unity Radio",
      "radiodnsId":null
    },
    "CR102291BA": {
      "name": "Vanny Radio",
      "radiodnsId":null
    },
    "CR101286BA": {
      "name": "Vectis Radio",
      "radiodnsId":null
    },
    "CR000216BA": {
      "name": "Vibe 107.6 FM",
      "radiodnsId":null
    },
    "CR000152BA": {
      "name": "Vixen 101",
      "radiodnsId":null
    },
    "CR000213BA": {
      "name": "Voice FM",
      "radiodnsId":null
    },
    "CR000229BA": {
      "name": "WCR",
      "radiodnsId":null
    },
    "CR000042BA": {
      "name": "WCR FM",
      "radiodnsId":null
    },
    "CR000056BA": {
      "name": "West Hull FM",
      "radiodnsId":null
    },
    "CR102851BA": {
      "name": "West Kent Radio",
      "radiodnsId":null
    },
    "CR102172BA": {
      "name": "West Somerset Radio",
      "radiodnsId":null
    },
    "CR000072BA": {
      "name": "Westside 89.6 FM",
      "radiodnsId":null
    },
    "CR101263BA": {
      "name": "Wey Valley Radio",
      "radiodnsId":null
    },
    "CR101262BA": {
      "name": "Winchester Radio",
      "radiodnsId":"fm:ce1.c05d.09470"
    },
    "CR101261BA": {
      "name": "Witney Radio",
      "radiodnsId":"fm:ce1.c07d.09020"
    },
    "CR101226BA": {
      "name": "Wycombe Sound",
      "radiodnsId":"fm:ce1.c0a6.10660"
    },
    "CR000024BA": {
      "name": "Wythenshawe FM",
      "radiodnsId":null
    },
    "CR102166BA": {
      "name": "YO1 Radio",
      "radiodnsId":null
    },
    "CR000034BA": {
      "name": "Your FM",
      "radiodnsId":null
    },
    "CR000053BA": {
      "name": "Youthcomm Radio",
      "radiodnsId":null
    },
    "CR000191BA": {
      "name": "Zack FM 105.3",
      "radiodnsId":null
    },
    "CR100123BA": {
      "name": "Zetland FM",
      "radiodnsId":null
    },
    "CR100061BA": {
      "name": "fUSe FM",
      "radiodnsId":null
    },
    "CR000028BA": {
      "name": "shmu FM",
      "radiodnsId":null
    }
  }
}
