[
    {
        "opcode": "jmp",
        "position": 0,
        "args": [
            {
                "data": 1,
                "mode": "relative"
            }
        ]
    },
    {
        "opcode": "mov",
        "position": 1,
        "args": [
            {
                "data": "r4",
                "mode": "register"
            },
            {
                "data": 20,
                "mode": "data"
            }
        ]
    },
    {
        "opcode": "mov",
        "position": 2,
        "args": [
            {
                "data": "r5",
                "mode": "register"
            },
            {
                "data": 2,
                "mode": "data"
            }
        ]
    },
    {
        "opcode": "mov",
        "position": 3,
        "args": [
            {
                "data": "r1",
                "mode": "register"
            },
            {
                "data": "r5",
                "mode": "register"
            }
        ]
    },
    {
        "opcode": "inc",
        "position": 4,
        "args": [
            {
                "data": "r1",
                "mode": "register"
            }
        ]
    },
    {
        "opcode": "cmp",
        "position": 5,
        "args": [
            {
                "data": "r1",
                "mode": "register"
            },
            {
                "data": "r4",
                "mode": "register"
            }
        ]
    },
    {
        "opcode": "jg",
        "position": 6,
        "args": [
            {
                "data": 10,
                "mode": "relative"
            }
        ]
    },
    {
        "opcode": "mov",
        "position": 7,
        "args": [
            {
                "data": "r3",
                "mode": "register"
            },
            {
                "data": 2,
                "mode": "data"
            }
        ]
    },
    {
        "opcode": "mod",
        "position": 8,
        "args": [
            {
                "data": "r2",
                "mode": "register"
            },
            {
                "data": "r1",
                "mode": "register"
            },
            {
                "data": "r3",
                "mode": "register"
            }
        ]
    },
    {
        "opcode": "je",
        "position": 9,
        "args": [
            {
                "data": -5,
                "mode": "relative"
            }
        ]
    },
    {
        "opcode": "inc",
        "position": 10,
        "args": [
            {
                "data": "r3",
                "mode": "register"
            }
        ]
    },
    {
        "opcode": "cmp",
        "position": 11,
        "args": [
            {
                "data": "r1",
                "mode": "register"
            },
            {
                "data": "r3",
                "mode": "register"
            }
        ]
    },
    {
        "opcode": "je",
        "position": 12,
        "args": [
            {
                "data": 2,
                "mode": "relative"
            }
        ]
    },
    {
        "opcode": "jmp",
        "position": 13,
        "args": [
            {
                "data": -5,
                "mode": "relative"
            }
        ]
    },
    {
        "opcode": "mul",
        "position": 14,
        "args": [
            {
                "data": "r5",
                "mode": "register"
            },
            {
                "data": "r5",
                "mode": "register"
            },
            {
                "data": "r1",
                "mode": "register"
            }
        ]
    },
    {
        "opcode": "jmp",
        "position": 15,
        "args": [
            {
                "data": -11,
                "mode": "relative"
            }
        ]
    },
    {
        "opcode": "mov",
        "position": 16,
        "args": [
            {
                "data": "r1",
                "mode": "register"
            },
            {
                "data": 0,
                "mode": "data"
            }
        ]
    },
    {
        "opcode": "add",
        "position": 17,
        "args": [
            {
                "data": "r1",
                "mode": "register"
            },
            {
                "data": "r1",
                "mode": "register"
            },
            {
                "data": "r5",
                "mode": "register"
            }
        ]
    },
    {
        "opcode": "mov",
        "position": 18,
        "args": [
            {
                "data": "r3",
                "mode": "register"
            },
            {
                "data": 0,
                "mode": "data"
            }
        ]
    },
    {
        "opcode": "inc",
        "position": 19,
        "args": [
            {
                "data": "r3",
                "mode": "register"
            }
        ]
    },
    {
        "opcode": "mod",
        "position": 20,
        "args": [
            {
                "data": "r2",
                "mode": "register"
            },
            {
                "data": "r1",
                "mode": "register"
            },
            {
                "data": "r3",
                "mode": "register"
            }
        ]
    },
    {
        "opcode": "jne",
        "position": 21,
        "args": [
            {
                "data": -4,
                "mode": "relative"
            }
        ]
    },
    {
        "opcode": "cmp",
        "position": 22,
        "args": [
            {
                "data": "r3",
                "mode": "register"
            },
            {
                "data": "r4",
                "mode": "register"
            }
        ]
    },
    {
        "opcode": "je",
        "position": 23,
        "args": [
            {
                "data": 2,
                "mode": "relative"
            }
        ]
    },
    {
        "opcode": "jmp",
        "position": 24,
        "args": [
            {
                "data": -5,
                "mode": "relative"
            }
        ]
    },
    {
        "opcode": "st",
        "position": 25,
        "args": [
            {
                "data": 15,
                "mode": "absolute"
            },
            {
                "data": "r1",
                "mode": "register"
            }
        ]
    },
    {
        "opcode": "hlt",
        "position": 26,
        "args": []
    }
]