[
    {
        "opcode": "jmp",
        "position": 0,
        "args": [
            {
                "data": 1,
                "mode": "relative"
            }
        ]
    },
    {
        "opcode": "mov",
        "position": 1,
        "args": [
            {
                "data": "r",
                "mode": "redster"
            },
            {
                "data": 53,
                "mode": "data"
            }
        ]
    },
    {
        "opcode": "mov",
        "position": 2,
        "args": [
            {
                "data": "r3",
                "mode": "register"
            },
            {
                "data": "r1",
                "mode": "register"
            }
        ]
    },
    {
        "opcode": "mov",
        "position": 3,
        "args": [
            {
                "data": "r4",
                "mode": "register"
            },
            {
                "data": "r3",
                "mode": "register"
            }
        ]
    },
    {
        "opcode": "hlt",
        "position": 4,
        "args": []
    }
]