[
 {
  name_mm : "|-",
  name_dk : "taquet",
  type    : "wff → TYPE",
  mixfix  : "prefix",
  prec    : 11
 },
 {
  name_mm : "<->",
  mixfix  : "infix left",
  prec    : 9
 },
 {
  name_mm : "->",
  mixfix  : "infix left",
  prec    : 8
 },
 {
  name_mm : "-.",
  name_dk : "not",
  mixfix  : "prefix",
  prec    : 10
 },
 {
  name_mm : "/\\",
  name_dk : "and",
  mixfix  : "infix left",
  prec    : 6
 },
 {
  name_mm : "\\/",
  name_dk : "or",
  mixfix  : "infix left",
  prec    : 5
 }
]
