module.exports = {
    successResponse(response, data, successCode = 0, status = 200) {
        response
            .status(status)
            .json({
                code: successCode,
                msg: null,
                data
            });
    },
    errorResponse(response, error, errorCode = 500, status = 200) {
        response
            .status(status)
            .json({
                code: errorCode,
                msg: error.message,
                data: null,
            });
    },
    waitFor(ms) {
        return new Promise(resolve => {
            setTimeout(() => resolve(undefined), ms);
        });
    },
    copy(data) {
        return JSON.parse(JSON.stringify(data));
    },
};
