^C:\SKILLBOX\HOMEWORK18\HOMEWORK18\HOMEWORK18\HOMEWORK18.CPP|C:\SKILLBOX\TEST\18 MODUL\TEST\TEST.CPP
C:\SKILLBOX\HOMEWORK18\HOMEWORK18\HOMEWORK18\DEBUG\VC141.PDB
C:\SKILLBOX\HOMEWORK18\HOMEWORK18\HOMEWORK18\DEBUG\VC141.IDB
C:\SKILLBOX\HOMEWORK18\HOMEWORK18\HOMEWORK18\DEBUG\TEST.OBJ
^C:\SKILLBOX\TEST\18 MODUL\TEST\TEST.CPP
C:\SKILLBOX\HOMEWORK18\HOMEWORK18\HOMEWORK18\DEBUG\VC141.PDB
C:\SKILLBOX\HOMEWORK18\HOMEWORK18\HOMEWORK18\DEBUG\VC141.IDB
C:\SKILLBOX\HOMEWORK18\HOMEWORK18\HOMEWORK18\DEBUG\TEST.OBJ
^C:\SKILLBOX\HOMEWORK18\HOMEWORK18\HOMEWORK18\HOMEWORK18.CPP
C:\SKILLBOX\HOMEWORK18\HOMEWORK18\HOMEWORK18\DEBUG\VC141.PDB
C:\SKILLBOX\HOMEWORK18\HOMEWORK18\HOMEWORK18\DEBUG\VC141.IDB
C:\SKILLBOX\HOMEWORK18\HOMEWORK18\HOMEWORK18\DEBUG\HOMEWORK18.OBJ
