^C:\SKILLBOX\HOMEWORK13\HOMEWORK13\SOURCE.CPP
C:\SKILLBOX\HOMEWORK13\HOMEWORK13\DEBUG\VC142.PDB
C:\SKILLBOX\HOMEWORK13\HOMEWORK13\DEBUG\VC142.IDB
C:\SKILLBOX\HOMEWORK13\HOMEWORK13\DEBUG\SOURCE.OBJ
