E:\Selva\Assignment\ApiTestAssignment\src\main\java\application\lib\ApplicationAPIKeys.java
E:\Selva\Assignment\ApiTestAssignment\src\main\java\application\lib\ApplicationInputData.java
E:\Selva\Assignment\ApiTestAssignment\src\main\java\com\org\runner\Runner.java
