{
  "extensionName": {
    "message": "Kodi Movies on IMDB",
    "description": "Name of the extension"
  },
  "extensionDescription": {
    "message": "Highlight my movies from Kodi on IMDB",
    "description": "Description of the extension"
  },
  "pageTitleMovieSeen": {
    "message": "You have seen this movie",
    "description": ""
  },
  "pageTitleMovieHave": {
    "message": "You have this movie",
    "description": ""
  },
  "menuItemPlayMovie": {
    "message": "Play movie on the server",
    "description": ""
  },
  "popupPrefs": {
    "message": "Setup server",
    "description": ""
  },
  "popupReload": {
    "message": "Reload database",
    "description": ""
  }
}