<?xml version="1.0" encoding="utf-8"?>
<!-- This URDF was automatically created by SolidWorks to URDF Exporter! Originally created by Stephen Brawner (brawner@gmail.com) 
     Commit Version: 1.5.1-0-g916b5db  Build Version: 1.5.7152.31018
     For more information, please see http://wiki.ros.org/sw_urdf_exporter -->
<robot
  name="RobotUV">
  <link
    name="base_link">
    <inertial>
      <origin
        xyz="0.0029356 -0.036438 0.29533"
        rpy="0 0 0" />
      <mass
        value="7.3178" />
      <inertia
        ixx="0.13611"
        ixy="1.7357E-05"
        ixz="-1.3885E-06"
        iyy="0.13595"
        iyz="0.00015979"
        izz="0.011627" />
    </inertial>
    <visual>
      <origin
        xyz="0 0 0"
        rpy="0 0 0" />
      <geometry>
        <mesh
          filename="package://RobotUV/meshes/base_link.STL" />
      </geometry>
      <material
        name="">
        <color
          rgba="0.79216 0.81961 0.93333 1" />
      </material>
    </visual>
    <collision>
      <origin
        xyz="0 0 0"
        rpy="0 0 0" />
      <geometry>
        <mesh
          filename="package://RobotUV/meshes/base_link.STL" />
      </geometry>
    </collision>
  </link>
  <link
    name="wheel-l1">
    <inertial>
      <origin
        xyz="1.8713E-07 -0.0074838 2.2724E-06"
        rpy="0 0 0" />
      <mass
        value="0.097374" />
      <inertia
        ixx="9.4532E-05"
        ixy="7.2819E-09"
        ixz="8.4139E-08"
        iyy="0.00016476"
        iyz="8.2118E-09"
        izz="9.4551E-05" />
    </inertial>
    <visual>
      <origin
        xyz="0 0 0"
        rpy="0 0 0" />
      <geometry>
        <mesh
          filename="package://RobotUV/meshes/wheel-l1.STL" />
      </geometry>
      <material
        name="">
        <color
          rgba="0.75294 0.75294 0.75294 1" />
      </material>
    </visual>
    <collision>
      <origin
        xyz="0 0 0"
        rpy="0 0 0" />
      <geometry>
        <mesh
          filename="package://RobotUV/meshes/wheel-l1.STL" />
      </geometry>
    </collision>
  </link>
  <joint
    name="l1"
    type="continuous">
    <origin
      xyz="-0.16 0.104 0.0185"
      rpy="0 0 1.5708" />
    <parent
      link="base_link" />
    <child
      link="wheel-l1" />
    <axis
      xyz="0 -1 0" />
    <limit
      effort="50"
      velocity="10" />
  </joint>
  <link
    name="wheel-l2">
    <inertial>
      <origin
        xyz="1.9344E-06 -0.0074838 5.4473E-07"
        rpy="0 0 0" />
      <mass
        value="0.097374" />
      <inertia
        ixx="9.4609E-05"
        ixy="-9.8186E-09"
        ixz="4.9593E-08"
        iyy="0.00016476"
        iyz="-2.8982E-09"
        izz="9.4474E-05" />
    </inertial>
    <visual>
      <origin
        xyz="0 0 0"
        rpy="0 0 0" />
      <geometry>
        <mesh
          filename="package://RobotUV/meshes/wheel-l2.STL" />
      </geometry>
      <material
        name="">
        <color
          rgba="0.75294 0.75294 0.75294 1" />
      </material>
    </visual>
    <collision>
      <origin
        xyz="0 0 0"
        rpy="0 0 0" />
      <geometry>
        <mesh
          filename="package://RobotUV/meshes/wheel-l2.STL" />
      </geometry>
    </collision>
  </link>
  <joint
    name="l2"
    type="continuous">
    <origin
      xyz="-0.16 -0.104 0.0185"
      rpy="0 0 1.5708" />
    <parent
      link="base_link" />
    <child
      link="wheel-l2" />
    <axis
      xyz="0 1 0" />
    <limit
      effort="50"
      velocity="10" />
  </joint>
  <link
    name="wheel-r2">
    <inertial>
      <origin
        xyz="9.3684E-07 0.007485 2.373E-06"
        rpy="0 0 0" />
      <mass
        value="0.097374" />
      <inertia
        ixx="9.4609E-05"
        ixy="9.8186E-09"
        ixz="4.9592E-08"
        iyy="0.00016476"
        iyz="2.8982E-09"
        izz="9.4474E-05" />
    </inertial>
    <visual>
      <origin
        xyz="0 0 0"
        rpy="0 0 0" />
      <geometry>
        <mesh
          filename="package://RobotUV/meshes/wheel-r2.STL" />
      </geometry>
      <material
        name="">
        <color
          rgba="0.75294 0.75294 0.75294 1" />
      </material>
    </visual>
    <collision>
      <origin
        xyz="0 0 0"
        rpy="0 0 0" />
      <geometry>
        <mesh
          filename="package://RobotUV/meshes/wheel-r2.STL" />
      </geometry>
    </collision>
  </link>
  <joint
    name="r2"
    type="continuous">
    <origin
      xyz="0.16 -0.104 0.0185"
      rpy="0 0 1.5708" />
    <parent
      link="base_link" />
    <child
      link="wheel-r2" />
    <axis
      xyz="0 -1 0" />
    <limit
      effort="50"
      velocity="10" />
  </joint>
  <link
    name="wheel-r1">
    <inertial>
      <origin
        xyz="1.9929E-06 0.0074851 1.2081E-06"
        rpy="0 0 0" />
      <mass
        value="0.097374" />
      <inertia
        ixx="9.4532E-05"
        ixy="-7.3112E-09"
        ixz="8.4139E-08"
        iyy="0.00016476"
        iyz="-8.2451E-09"
        izz="9.4551E-05" />
    </inertial>
    <visual>
      <origin
        xyz="0 0 0"
        rpy="0 0 0" />
      <geometry>
        <mesh
          filename="package://RobotUV/meshes/wheel-r1.STL" />
      </geometry>
      <material
        name="">
        <color
          rgba="0.75294 0.75294 0.75294 1" />
      </material>
    </visual>
    <collision>
      <origin
        xyz="0 0 0"
        rpy="0 0 0" />
      <geometry>
        <mesh
          filename="package://RobotUV/meshes/wheel-r1.STL" />
      </geometry>
    </collision>
  </link>
  <joint
    name="r1"
    type="continuous">
    <origin
      xyz="0.16 0.104 0.0185"
      rpy="0 0 1.5708" />
    <parent
      link="base_link" />
    <child
      link="wheel-r1" />
    <axis
      xyz="0 -1 0" />
    <limit
      effort="50"
      velocity="10" />
  </joint>
  <!--########################## SENSORS ############################################-->
  <link name="laser_link">
  <collision>
   <origin xyz="-0.00011484 0.0067662 -0.0073819" rpy="0 0 0"/>
   <geometry>
    <box size="0.1 0.1 0.1"/>
   </geometry>
  </collision>
  <visual>
   <origin xyz="0 0 0" rpy="0 0 0"/>
    <geometry>
     <box size="0.05 0.05 0.05"/>
    </geometry>
  </visual>
  <inertial>
    <mass value="1e-5" />
    <origin xyz="0 0 0" rpy="0 0 0"/>
    <inertia ixx="1e-6" ixy="0" ixz="0" iyy="1e-6" iyz="0" izz="1e-6" />
  </inertial>
</link>

<joint name="laser_joint" type="fixed">
  <axis xyz="0 1 0" />
  <origin xyz="-0.0036397 0.04974 0.14865" rpy="0 0 0"/>
  <parent link="base_link"/>
  <child link="laser_link"/>
</joint>
<gazebo reference="laser_link">
  <sensor type="ray" name="laser">
    <pose>0 0 0 0 0 0</pose>
    <visualize>true</visualize>
    <update_rate>40</update_rate>
    <ray>
    <scan>
    <horizontal>
      <samples>720</samples>
      <resolution>1</resolution>
      <min_angle>0</min_angle>
      <max_angle>3.14159</max_angle>
    </horizontal>
    </scan>
    <range>
    <min>0.10</min>
    <max>12.0</max>
    <resolution>0.01</resolution>
    </range>
    </ray>
    <plugin name="gazebo_ros_head_hokuyo_controller" filename="libgazebo_ros_laser.so">
      <topicName>/scan</topicName>
      <frameName>laser_link</frameName>
    </plugin>
  </sensor>
</gazebo>

<link name="imu_link">
  <inertial>
    <mass value="0.001"/>
    <origin rpy="0 0 0" xyz="0 0 0"/>
    <inertia ixx="0.0001" ixy="0" ixz="0" iyy="0.000001" iyz="0" izz="0.0001"/>
  </inertial>
  <visual>
    <origin rpy="0 0 0" xyz="0 0 0"/>
    <geometry>
      <box size="0.001 0.001 0.001"/>
    </geometry>
  </visual>
  <collision>
    <origin rpy="0 0 0" xyz="0 0 0"/>
    <geometry>
      <box size=".001 .001 .001"/>
    </geometry>
  </collision>
</link>

<joint name="imu_joint" type="fixed">
  <axis xyz="1 0 0"/> <!-- 0 1 0 -->
    <origin xyz="-0.350 0 0.115"/>
    <parent link="base_link"/>
    <child link="imu_link"/>
</joint>

  <gazebo reference="imu_link">
    <gravity>true</gravity>
    <sensor name="imu_sensor" type="imu">
      <always_on>true</always_on>
      <update_rate>100</update_rate>
      <visualize>true</visualize>
      <topic>__default_topic__</topic>
      <plugin filename="libgazebo_ros_imu_sensor.so" name="imu_plugin">
        <topicName>imu_data</topicName>
        <bodyName>imu_link</bodyName>
        <updateRateHZ>10.0</updateRateHZ>
        <gaussianNoise>0.0</gaussianNoise>
        <xyzOffset>0 0 0</xyzOffset>
        <rpyOffset>0 0 0</rpyOffset>
        <frameName>imu_link</frameName>
        <initialOrientationAsReference>false</initialOrientationAsReference>
      </plugin>
      <pose>0 0 0 0 0 0</pose>
    </sensor>
  </gazebo>
<!--###############################################################################-->

<!--########################## BASE TRANSMISSIONS ############################################-->
<transmission name="front_left_wheel_trans" type="SimpleTransmission">
  <type>transmission_interface/SimpleTransmission</type>
  <actuator name="front_left_wheel_motor">
   <hardwareInterface>hardware_interface/VelocityJointInterface</hardwareInterface>
   <mechanicalReduction>1</mechanicalReduction>
  </actuator>
  <joint name="l1">
   <hardwareInterface>hardware_interface/VelocityJointInterface</hardwareInterface>
  </joint>
</transmission>

<transmission name="front_right_wheel_trans" type="SimpleTransmission">
  <type>transmission_interface/SimpleTransmission</type>
  <actuator name="front_right_wheel_motor">
   <hardwareInterface>hardware_interface/VelocityJointInterface</hardwareInterface>
   <mechanicalReduction>1</mechanicalReduction>
  </actuator>
  <joint name="r1">
   <hardwareInterface>hardware_interface/VelocityJointInterface</hardwareInterface>
  </joint>
</transmission>

<transmission name="rear_left_wheel_trans" type="SimpleTransmission">
  <type>transmission_interface/SimpleTransmission</type>
  <actuator name="rear_left_wheel_motor">
   <hardwareInterface>hardware_interface/VelocityJointInterface</hardwareInterface>
   <mechanicalReduction>1</mechanicalReduction>
  </actuator>
  <joint name="l2">
   <hardwareInterface>hardware_interface/VelocityJointInterface</hardwareInterface>
  </joint>
</transmission>

<transmission name="rear_right_wheel_trans" type="SimpleTransmission">
  <type>transmission_interface/SimpleTransmission</type>
  <actuator name="rear_right_wheel_motor">
   <hardwareInterface>hardware_interface/VelocityJointInterface</hardwareInterface>
   <mechanicalReduction>1</mechanicalReduction>
  </actuator>
  <joint name="r2">
   <hardwareInterface>hardware_interface/VelocityJointInterface</hardwareInterface>
  </joint>
</transmission>
<!--######################################################################-->
<gazebo>
    <plugin name="gazebo_ros_control" filename="libgazebo_ros_control.so">
      <robotNamespace>/</robotNamespace>
      <controlPeriod>0.001</controlPeriod>
      <legacyModeNS>false</legacyModeNS>
    </plugin>
  </gazebo>
<!--######################################################################-->
<gazebo>
<plugin name="p3d_base_controller" filename="libgazebo_ros_p3d.so">
  <alwaysOn>true</alwaysOn>
  <updateRate>50.0</updateRate>
  <bodyName>base_link</bodyName>
  <topicName>base_truth_odom</topicName>
  <gaussianNoise>0.01</gaussianNoise>
  <frameName>world</frameName>
  <xyzOffsets>0 0 0</xyzOffsets>
  <rpyOffsets>0 0 0</rpyOffsets>
</plugin>
</gazebo>
<!--######################################################################-->
<gazebo reference="wheel-l1">
 <mu1 value="1.0"/>
 <mu2 value="1.0"/>
 <kp value="10000000.0" />
 <kd value="1.0" />
 <fdir1 value="1 0 0"/>
</gazebo>

<gazebo reference="wheel-r1">
 <mu1 value="1.0"/>
 <mu2 value="1.0"/>
 <kp value="10000000.0" />
 <kd value="1.0" />
 <fdir1 value="1 0 0"/>
</gazebo>

<gazebo reference="wheel-l2">
 <mu1 value="1.0"/>
 <mu2 value="1.0"/>
 <kp value="10000000.0" />
 <kd value="1.0" />
 <fdir1 value="1 0 0"/>
</gazebo>

<gazebo reference="wheel-r2">
 <mu1 value="1.0"/>
 <mu2 value="1.0"/>
 <kp value="10000000.0" />
 <kd value="1.0" />
 <fdir1 value="1 0 0"/>
</gazebo>
<!--######################################################################-->




</robot>