HW.txt
ori amit daniel dor baruchi
oooooooo
Thu Jan 25 18:40:47 UTC 2024
node1
cat: can't open 'oo': No such file or directory

total 8
69340802      4 HW.txt
69351188      4 file_names
total 8
     4 file_names
     4 HW.txt
total 8
     4 -rw-r--r--    1 0        0              226 Jan 25 19:41 HW.txt
     4 -rw-r--r--    1 0        0               28 Jan 25 18:29 file_names
