-------------------------------------------------------------------------------
Test set: tn.esprit.spring.TimesheetApplicationTests
-------------------------------------------------------------------------------
Tests run: 1, Failures: 0, Errors: 0, Skipped: 0, Time elapsed: 6.949 s - in tn.esprit.spring.TimesheetApplicationTests
