C:\Users\seifa\OneDrive\Bureau\Devops\timesheetci\src\test\java\tn\esprit\spring\JunitTest.java
C:\Users\seifa\OneDrive\Bureau\Devops\timesheetci\src\test\java\tn\esprit\spring\TimesheetApplicationTests.java
C:\Users\seifa\OneDrive\Bureau\Devops\timesheetci\src\test\java\tn\esprit\spring\Calcul.java
C:\Users\seifa\OneDrive\Bureau\Devops\timesheetci\src\test\java\tn\esprit\spring\jenkins.java
C:\Users\seifa\OneDrive\Bureau\Devops\timesheetci\src\test\java\tn\esprit\spring\TestBuild.java
