# Title: SegtiNet/hosts related with Instagram
#
# Date: 16 November 2021
# Number of unique domains: 184
# ===============================================================

127.0.0.1 localhost
127.0.0.1 localhost.localdomain
127.0.0.1 local
255.255.255.255 broadcasthost
::1 localhost
::1 ip6-localhost
::1 ip6-loopback
fe80::1%lo0 localhost
ff00::0 ip6-localnet
ff00::0 ip6-mcastprefix
ff02::1 ip6-allnodes
ff02::2 ip6-allrouters
ff02::3 ip6-allhosts
0.0.0.0 0.0.0.0

# PRIMARY DOMAINS
0.0.0.0 cdninstagram.com
0.0.0.0 ns.cdninstagram.com
0.0.0.0 scontent.cdninstagram.com
0.0.0.0 scontent-ams4-1.cdninstagram.com
0.0.0.0 scontent-amt2-1.cdninstagram.com
0.0.0.0 scontent-arn2-1.cdninstagram.com
0.0.0.0 scontent-atl3-1.cdninstagram.com
0.0.0.0 scontent-atl3-2.cdninstagram.com
0.0.0.0 scontent-bom1-1.cdninstagram.com
0.0.0.0 scontent-bom1-2.cdninstagram.com
0.0.0.0 scontent-bru2-1.cdninstagram.com
0.0.0.0 scontent-cdg2-1.cdninstagram.com
0.0.0.0 scontent-cdt1-1.cdninstagram.com
0.0.0.0 scontent-cgk1-1.cdninstagram.com
0.0.0.0 scontent-cgk1-2.cdninstagram.com
0.0.0.0 scontent-del1-1.cdninstagram.com
0.0.0.0 scontent-den4-1.cdninstagram.com
0.0.0.0 scontent-dfw5-1.cdninstagram.com
0.0.0.0 scontent-dfw5-2.cdninstagram.com
0.0.0.0 scontent-fml2-1.cdninstagram.com
0.0.0.0 scontent-frt3-1.cdninstagram.com
0.0.0.0 scontent-frt3-2.cdninstagram.com
0.0.0.0 scontent-frx5-1.cdninstagram.com
0.0.0.0 scontent-frx5-2.cdninstagram.com
0.0.0.0 scontent-gmp1-1.cdninstagram.com
0.0.0.0 scontent-hbe1-1.cdninstagram.com
0.0.0.0 scontent-hel3-1.cdninstagram.com
0.0.0.0 scontent-hkg4-1.cdninstagram.com
0.0.0.0 scontent-hkg4-2.cdninstagram.com
0.0.0.0 scontent-hkt1-1.cdninstagram.com
0.0.0.0 scontent-hkt1-2.cdninstagram.com
0.0.0.0 scontent-iad3-1.cdninstagram.com
0.0.0.0 scontent-iad3-2.cdninstagram.com
0.0.0.0 scontent-iev1-1.cdninstagram.com
0.0.0.0 scontent-itm1-1.cdninstagram.com
0.0.0.0 scontent-kut2-1.cdninstagram.com
0.0.0.0 scontent-kut2-2.cdninstagram.com
0.0.0.0 scontent-lax3-1.cdninstagram.com
0.0.0.0 scontent-lax3-2.cdninstagram.com
0.0.0.0 scontent-lcy1-1.cdninstagram.com
0.0.0.0 scontent-lcy1-2.cdninstagram.com
0.0.0.0 scontent-lga3-1.cdninstagram.com
0.0.0.0 scontent-lga3-2.cdninstagram.com
0.0.0.0 scontent-lhr8-1.cdninstagram.com
0.0.0.0 scontent-lhr8-2.cdninstagram.com
0.0.0.0 scontent-lht6-1.cdninstagram.com
0.0.0.0 scontent-los2-1.cdninstagram.com
0.0.0.0 scontent-maa2-1.cdninstagram.com
0.0.0.0 scontent-mad1-1.cdninstagram.com
0.0.0.0 scontent-mia3-1.cdninstagram.com
0.0.0.0 scontent-mia3-2.cdninstagram.com
0.0.0.0 scontent-mrs2-1.cdninstagram.com
0.0.0.0 scontent-mxp1-1.cdninstagram.com
0.0.0.0 scontent-nrt1-1.cdninstagram.com
0.0.0.0 scontent-ort2-1.cdninstagram.com
0.0.0.0 scontent-ort2-2.cdninstagram.com
0.0.0.0 scontent-otp1-1.cdninstagram.com
0.0.0.0 scontent-prg1-1.cdninstagram.com
0.0.0.0 scontent-sea1-1.cdninstagram.com
0.0.0.0 scontent-sin6-1.cdninstagram.com
0.0.0.0 scontent-sin6-2.cdninstagram.com
0.0.0.0 scontent-sin6-3.cdninstagram.com
0.0.0.0 scontent-sin6-4.cdninstagram.com
0.0.0.0 scontent-sjc3-1.cdninstagram.com
0.0.0.0 scontent-ssn1-1.cdninstagram.com
0.0.0.0 scontent-syd2-1.cdninstagram.com
0.0.0.0 scontent-tpe1-1.cdninstagram.com
0.0.0.0 scontent-vie1-1.cdninstagram.com
0.0.0.0 scontent-waw1-1.cdninstagram.com
0.0.0.0 scontent-xsp1-1.cdninstagram.com
0.0.0.0 scontent-xsp1-3.cdninstagram.com
0.0.0.0 scontent-yyz1-1.cdninstagram.com
0.0.0.0 static.cdninstagram.com
0.0.0.0 video-iad3-1.cdninstagram.com
0.0.0.0 z-p4-scontent.cdninstagram.com
0.0.0.0 0.instagram.com
0.0.0.0 0.intern.instagram.com
0.0.0.0 00.intern.instagram.com
0.0.0.0 00000000000000000www.00.intern.instagram.com
0.0.0.0 00000000000000000www.000adtservice.intern.instagram.com
0.0.0.0 00000000000000000www.000businessbrand.intern.instagram.com
0.0.0.0 00000000000000000www.000businesschunderm.intern.instagram.com
0.0.0.0 00000000000000000www.000-businessdede.intern.instagram.com
0.0.0.0 00000000000000000www.000businesshomedepot.intern.instagram.com
0.0.0.0 00000000000000000www.000businessjob.intern.instagram.com
0.0.0.0 00000000000000000www.000business-ny2.intern.instagram.com
0.0.0.0 00000000000000000www.000portalui-business.intern.instagram.com
0.0.0.0 00000000000000000www.000preprod-business.intern.instagram.com
0.0.0.0 00000000000000000www.000remote.intern.instagram.com
0.0.0.0 00000000000000000www.000reth1.intern.instagram.com
0.0.0.0 00000000000000000www.000www.intern.instagram.com
0.0.0.0 00000000000000000www.00-aep.intern.instagram.com
0.0.0.0 00000000000000000www.00-businesscl2000.intern.instagram.com
0.0.0.0 00000000000000000www.00-businessdebug100.intern.instagram.com
0.0.0.0 00000000000000000www.00-businessdistilleryvesper10.intern.instagram.com
0.0.0.0 00000000000000000www.0-business.intern.instagram.com
0.0.0.0 00000000000000000www.0-businessadtservice.intern.instagram.com
0.0.0.0 000adtservice.intern.instagram.com
0.0.0.0 000businessbrand.intern.instagram.com
0.0.0.0 000businesschunderm.intern.instagram.com
0.0.0.0 000-businessdede.intern.instagram.com
0.0.0.0 000businesshomedepot.intern.instagram.com
0.0.0.0 000businessjob.intern.instagram.com
0.0.0.0 000business-ny2.intern.instagram.com
0.0.0.0 000portalui-business.intern.instagram.com
0.0.0.0 000preprod-business.intern.instagram.com
0.0.0.0 000remote.intern.instagram.com
0.0.0.0 000www.intern.instagram.com
0.0.0.0 00-aep.intern.instagram.com
0.0.0.0 00-businesscl2000.intern.instagram.com
0.0.0.0 00-businessdebug100.intern.instagram.com
0.0.0.0 00-businessdistilleryvesper10.intern.instagram.com
0.0.0.0 0-a001business.intern.instagram.com
0.0.0.0 0-aep.intern.instagram.com
0.0.0.0 0-ashbusiness.intern.instagram.com
0.0.0.0 0-business.intern.instagram.com
0.0.0.0 0-businessadtservice.intern.instagram.com
0.0.0.0 0-businessdebug100.intern.instagram.com
0.0.0.0 about.instagram.com
0.0.0.0 api.instagram.com
0.0.0.0 applink.instagram.com
0.0.0.0 b.i.instagram.com
0.0.0.0 b.secure.instagram.com
0.0.0.0 badges.instagram.com
0.0.0.0 business.instagram.com
0.0.0.0 default-geo.instagram.com
0.0.0.0 default-geo-p42.instagram.com
0.0.0.0 edge-chat.instagram.com
0.0.0.0 geo-p42.instagram.com
0.0.0.0 graph.instagram.com
0.0.0.0 graphql.instagram.com
0.0.0.0 help.instagram.com
0.0.0.0 i.instagram.com
0.0.0.0 instagram.com
0.0.0.0 intern.instagram.com
0.0.0.0 l.instagram.com
0.0.0.0 live-upload.instagram.com
0.0.0.0 live-vp-upload.instagram.com
0.0.0.0 mail.instagram.com
0.0.0.0 maps.instagram.com
0.0.0.0 platform.instagram.com
0.0.0.0 secure.instagram.com
0.0.0.0 wellbeing.instagram.com
0.0.0.0 ww.instagram.com
0.0.0.0 www.instagram.com
0.0.0.0 z-p15.graph.instagram.com
0.0.0.0 z-p15.i.instagram.com
0.0.0.0 z-p15.upload.instagram.com
0.0.0.0 z-p15.www.instagram.com
0.0.0.0 z-p3.www.instagram.com
0.0.0.0 z-p4.graph.instagram.com
0.0.0.0 z-p4.i.instagram.com
0.0.0.0 z-p4.maps.instagram.com
0.0.0.0 z-p4.upload.instagram.com
0.0.0.0 z-p4.www.instagram.com
0.0.0.0 z-p42.graph.instagram.com
0.0.0.0 z-p42.i.instagram.com
0.0.0.0 z-p42.maps.instagram.com
0.0.0.0 z-p42.www.instagram.com

# PLATFORM DOMAINS
0.0.0.0 instagram.c10r.facebook.com
0.0.0.0 z-p42-instagram.c10r.facebook.com
0.0.0.0 z-p4-instagram.c10r.facebook.com
0.0.0.0 instagram-p15-shv-01-any2.fbcdn.net
0.0.0.0 instagram-p15-shv-01-gua1.fbcdn.net
0.0.0.0 instagram-p3-shv-01-amt2.fbcdn.net
0.0.0.0 instagram-p3-shv-01-any2.fbcdn.net
0.0.0.0 instagram-p3-shv-01-atl3.fbcdn.net
0.0.0.0 instagram-p3-shv-01-gua1.fbcdn.net
0.0.0.0 instagram-p3-shv-01-iad3.fbcdn.net
0.0.0.0 instagram-p42-shv-01-amt2.fbcdn.net
0.0.0.0 instagram-p42-shv-01-any2.fbcdn.net
0.0.0.0 instagram-p42-shv-01-atl3.fbcdn.net
0.0.0.0 instagram-p42-shv-01-gua1.fbcdn.net
0.0.0.0 instagram-p4-new-shv-01-any2.fbcdn.net
0.0.0.0 instagram-p4-new-shv-01-gua1.fbcdn.net
0.0.0.0 instagram-p4-shv-01-any2.fbcdn.net
0.0.0.0 instagram-p4-shv-01-gua1.fbcdn.net
0.0.0.0 z-p42-instagram.fbsr2-1.fna.fbcdn.net
0.0.0.0 z-p42-instagram.fcrk3-1.fna.fbcdn.net
0.0.0.0 z-p42-instagram.flhe2-1.fna.fbcdn.net
0.0.0.0 z-p42-instagram.flun1-1.fna.fbcdn.net
0.0.0.0 z-p42-instagram.flun1-2.fna.fbcdn.net
0.0.0.0 z-p4-instagram.ffor11-1.fna.fbcdn.net
0.0.0.0 z-p4-instagram.fsvq1-2.fna.fbcdn.net
