@startuml

title __EXAM's Class Diagram__\n

  namespace fr.cnam.foad.nfa035.exam {
    class fr.cnam.foad.nfa035.exam.Nfa035ExamConfiguration {
    }
  }
  



right footer


PlantUML diagram generated by SketchIt! (https://bitbucket.org/pmesmeur/sketch.it)
For more information about this tool, please contact philippe.mesmeur@gmail.com
endfooter

@enduml
