<mxfile host="app.diagrams.net" agent="Mozilla/5.0 (Windows NT 10.0; Win64; x64; rv:127.0) Gecko/20100101 Firefox/127.0" version="24.8.3">
  <diagram name="Seite-1" id="yVZxWYo2t4LnXlxojopJ">
    <mxGraphModel dx="1195" dy="752" grid="1" gridSize="10" guides="1" tooltips="1" connect="1" arrows="1" fold="1" page="1" pageScale="1" pageWidth="827" pageHeight="1169" math="0" shadow="0">
      <root>
        <mxCell id="0" />
        <mxCell id="1" parent="0" />
        <mxCell id="9YqxdJ_pKENaooPdWQ8g-1" value="EPS" style="swimlane;whiteSpace=wrap;html=1;" vertex="1" parent="1">
          <mxGeometry x="70" y="150" width="280" height="510" as="geometry" />
        </mxCell>
        <mxCell id="9YqxdJ_pKENaooPdWQ8g-5" value="SAA" style="rounded=0;whiteSpace=wrap;html=1;" vertex="1" parent="9YqxdJ_pKENaooPdWQ8g-1">
          <mxGeometry x="80" y="200" width="120" height="130" as="geometry" />
        </mxCell>
        <mxCell id="9YqxdJ_pKENaooPdWQ8g-6" value="PCDU" style="rounded=0;whiteSpace=wrap;html=1;" vertex="1" parent="9YqxdJ_pKENaooPdWQ8g-1">
          <mxGeometry x="80" y="360" width="120" height="130" as="geometry" />
        </mxCell>
        <mxCell id="9YqxdJ_pKENaooPdWQ8g-4" value="BA" style="rounded=0;whiteSpace=wrap;html=1;" vertex="1" parent="9YqxdJ_pKENaooPdWQ8g-1">
          <mxGeometry x="80" y="40" width="120" height="130" as="geometry" />
        </mxCell>
        <mxCell id="9YqxdJ_pKENaooPdWQ8g-33" value="" style="endArrow=classic;html=1;rounded=0;entryX=0;entryY=0.833;entryDx=0;entryDy=0;entryPerimeter=0;" edge="1" parent="9YqxdJ_pKENaooPdWQ8g-1" target="9YqxdJ_pKENaooPdWQ8g-3">
          <mxGeometry relative="1" as="geometry">
            <mxPoint x="200" y="424.79999999999995" as="sourcePoint" />
            <mxPoint x="533.96" y="424.5799999999999" as="targetPoint" />
          </mxGeometry>
        </mxCell>
        <mxCell id="9YqxdJ_pKENaooPdWQ8g-34" value="Thermal" style="edgeLabel;resizable=0;html=1;;align=center;verticalAlign=middle;" connectable="0" vertex="1" parent="9YqxdJ_pKENaooPdWQ8g-33">
          <mxGeometry relative="1" as="geometry" />
        </mxCell>
        <mxCell id="9YqxdJ_pKENaooPdWQ8g-3" value="&lt;b&gt;OBC&lt;/b&gt;" style="rounded=0;whiteSpace=wrap;html=1;" vertex="1" parent="1">
          <mxGeometry x="680" y="150" width="120" height="510" as="geometry" />
        </mxCell>
        <mxCell id="9YqxdJ_pKENaooPdWQ8g-7" value="" style="endArrow=classic;html=1;rounded=0;exitX=1;exitY=0.25;exitDx=0;exitDy=0;entryX=0;entryY=0.142;entryDx=0;entryDy=0;entryPerimeter=0;" edge="1" parent="1" source="9YqxdJ_pKENaooPdWQ8g-4" target="9YqxdJ_pKENaooPdWQ8g-3">
          <mxGeometry relative="1" as="geometry">
            <mxPoint x="360" y="460" as="sourcePoint" />
            <mxPoint x="460" y="460" as="targetPoint" />
          </mxGeometry>
        </mxCell>
        <mxCell id="9YqxdJ_pKENaooPdWQ8g-8" value="Voltage, Current, Temperature" style="edgeLabel;resizable=0;html=1;;align=center;verticalAlign=middle;" connectable="0" vertex="1" parent="9YqxdJ_pKENaooPdWQ8g-7">
          <mxGeometry relative="1" as="geometry" />
        </mxCell>
        <mxCell id="9YqxdJ_pKENaooPdWQ8g-10" value="" style="endArrow=classic;html=1;rounded=0;entryX=0;entryY=0.27;entryDx=0;entryDy=0;entryPerimeter=0;exitX=1;exitY=0.75;exitDx=0;exitDy=0;" edge="1" parent="1" source="9YqxdJ_pKENaooPdWQ8g-4" target="9YqxdJ_pKENaooPdWQ8g-3">
          <mxGeometry relative="1" as="geometry">
            <mxPoint x="280" y="288" as="sourcePoint" />
            <mxPoint x="540" y="280" as="targetPoint" />
          </mxGeometry>
        </mxCell>
        <mxCell id="9YqxdJ_pKENaooPdWQ8g-11" value="SOC, SOH" style="edgeLabel;resizable=0;html=1;;align=center;verticalAlign=middle;" connectable="0" vertex="1" parent="9YqxdJ_pKENaooPdWQ8g-10">
          <mxGeometry relative="1" as="geometry" />
        </mxCell>
        <mxCell id="9YqxdJ_pKENaooPdWQ8g-12" value="" style="endArrow=classic;html=1;rounded=0;exitX=1;exitY=0.5;exitDx=0;exitDy=0;" edge="1" parent="1" source="9YqxdJ_pKENaooPdWQ8g-4">
          <mxGeometry relative="1" as="geometry">
            <mxPoint x="240" y="310" as="sourcePoint" />
            <mxPoint x="679" y="255" as="targetPoint" />
          </mxGeometry>
        </mxCell>
        <mxCell id="9YqxdJ_pKENaooPdWQ8g-13" value="Discharge Rate, Remaining Capacity" style="edgeLabel;resizable=0;html=1;;align=center;verticalAlign=middle;" connectable="0" vertex="1" parent="9YqxdJ_pKENaooPdWQ8g-12">
          <mxGeometry relative="1" as="geometry" />
        </mxCell>
        <mxCell id="9YqxdJ_pKENaooPdWQ8g-14" value="" style="endArrow=classic;html=1;rounded=0;exitX=1;exitY=0.25;exitDx=0;exitDy=0;entryX=-0.014;entryY=0.455;entryDx=0;entryDy=0;entryPerimeter=0;" edge="1" parent="1" source="9YqxdJ_pKENaooPdWQ8g-5" target="9YqxdJ_pKENaooPdWQ8g-3">
          <mxGeometry relative="1" as="geometry">
            <mxPoint x="414" y="390" as="sourcePoint" />
            <mxPoint x="514" y="390" as="targetPoint" />
          </mxGeometry>
        </mxCell>
        <mxCell id="9YqxdJ_pKENaooPdWQ8g-15" value="Voltage, Current, Power Generated" style="edgeLabel;resizable=0;html=1;;align=center;verticalAlign=middle;" connectable="0" vertex="1" parent="9YqxdJ_pKENaooPdWQ8g-14">
          <mxGeometry relative="1" as="geometry" />
        </mxCell>
        <mxCell id="9YqxdJ_pKENaooPdWQ8g-16" value="" style="endArrow=classic;html=1;rounded=0;exitX=1;exitY=0.75;exitDx=0;exitDy=0;entryX=-0.021;entryY=0.586;entryDx=0;entryDy=0;entryPerimeter=0;" edge="1" parent="1" source="9YqxdJ_pKENaooPdWQ8g-5" target="9YqxdJ_pKENaooPdWQ8g-3">
          <mxGeometry relative="1" as="geometry">
            <mxPoint x="480" y="470" as="sourcePoint" />
            <mxPoint x="580" y="470" as="targetPoint" />
          </mxGeometry>
        </mxCell>
        <mxCell id="9YqxdJ_pKENaooPdWQ8g-17" value="Operational Status" style="edgeLabel;resizable=0;html=1;;align=center;verticalAlign=middle;" connectable="0" vertex="1" parent="9YqxdJ_pKENaooPdWQ8g-16">
          <mxGeometry relative="1" as="geometry" />
        </mxCell>
        <mxCell id="9YqxdJ_pKENaooPdWQ8g-18" value="" style="endArrow=classic;html=1;rounded=0;" edge="1" parent="1">
          <mxGeometry relative="1" as="geometry">
            <mxPoint x="270" y="520" as="sourcePoint" />
            <mxPoint x="680" y="520" as="targetPoint" />
          </mxGeometry>
        </mxCell>
        <mxCell id="9YqxdJ_pKENaooPdWQ8g-19" value="Total Power Consumption" style="edgeLabel;resizable=0;html=1;;align=center;verticalAlign=middle;" connectable="0" vertex="1" parent="9YqxdJ_pKENaooPdWQ8g-18">
          <mxGeometry relative="1" as="geometry" />
        </mxCell>
        <mxCell id="9YqxdJ_pKENaooPdWQ8g-22" value="" style="endArrow=classic;html=1;rounded=0;exitX=1;exitY=0.25;exitDx=0;exitDy=0;entryX=0;entryY=0.772;entryDx=0;entryDy=0;entryPerimeter=0;" edge="1" parent="1">
          <mxGeometry relative="1" as="geometry">
            <mxPoint x="270" y="550" as="sourcePoint" />
            <mxPoint x="680" y="551.2199999999998" as="targetPoint" />
          </mxGeometry>
        </mxCell>
        <mxCell id="9YqxdJ_pKENaooPdWQ8g-23" value="Current Draw from Subsystem" style="edgeLabel;resizable=0;html=1;;align=center;verticalAlign=middle;" connectable="0" vertex="1" parent="9YqxdJ_pKENaooPdWQ8g-22">
          <mxGeometry relative="1" as="geometry" />
        </mxCell>
        <mxCell id="9YqxdJ_pKENaooPdWQ8g-24" value="" style="endArrow=classic;html=1;rounded=0;" edge="1" parent="1">
          <mxGeometry relative="1" as="geometry">
            <mxPoint x="270" y="600" as="sourcePoint" />
            <mxPoint x="680" y="600" as="targetPoint" />
          </mxGeometry>
        </mxCell>
        <mxCell id="9YqxdJ_pKENaooPdWQ8g-25" value="Status Power Buses, Voltage, Current " style="edgeLabel;resizable=0;html=1;;align=center;verticalAlign=middle;" connectable="0" vertex="1" parent="9YqxdJ_pKENaooPdWQ8g-24">
          <mxGeometry relative="1" as="geometry" />
        </mxCell>
        <mxCell id="9YqxdJ_pKENaooPdWQ8g-26" value="" style="endArrow=classic;html=1;rounded=0;entryX=0;entryY=0.941;entryDx=0;entryDy=0;entryPerimeter=0;exitX=1.008;exitY=0.916;exitDx=0;exitDy=0;exitPerimeter=0;" edge="1" parent="1" source="9YqxdJ_pKENaooPdWQ8g-6" target="9YqxdJ_pKENaooPdWQ8g-3">
          <mxGeometry relative="1" as="geometry">
            <mxPoint x="270" y="620" as="sourcePoint" />
            <mxPoint x="677.4800000000002" y="620.48" as="targetPoint" />
          </mxGeometry>
        </mxCell>
        <mxCell id="9YqxdJ_pKENaooPdWQ8g-27" value="Detected Faults, over/under-current/voltage" style="edgeLabel;resizable=0;html=1;;align=center;verticalAlign=middle;" connectable="0" vertex="1" parent="9YqxdJ_pKENaooPdWQ8g-26">
          <mxGeometry relative="1" as="geometry" />
        </mxCell>
        <mxCell id="9YqxdJ_pKENaooPdWQ8g-29" value="" style="endArrow=classic;html=1;rounded=0;" edge="1" parent="1">
          <mxGeometry relative="1" as="geometry">
            <mxPoint x="680" y="150" as="sourcePoint" />
            <mxPoint x="350" y="151" as="targetPoint" />
          </mxGeometry>
        </mxCell>
        <mxCell id="9YqxdJ_pKENaooPdWQ8g-30" value="Heartbeat" style="edgeLabel;resizable=0;html=1;;align=center;verticalAlign=middle;" connectable="0" vertex="1" parent="9YqxdJ_pKENaooPdWQ8g-29">
          <mxGeometry relative="1" as="geometry" />
        </mxCell>
        <mxCell id="9YqxdJ_pKENaooPdWQ8g-31" value="" style="endArrow=classic;html=1;rounded=0;" edge="1" parent="1">
          <mxGeometry relative="1" as="geometry">
            <mxPoint x="680" y="170" as="sourcePoint" />
            <mxPoint x="350" y="171" as="targetPoint" />
          </mxGeometry>
        </mxCell>
        <mxCell id="9YqxdJ_pKENaooPdWQ8g-32" value="Commands, Data Request" style="edgeLabel;resizable=0;html=1;;align=center;verticalAlign=middle;" connectable="0" vertex="1" parent="9YqxdJ_pKENaooPdWQ8g-31">
          <mxGeometry relative="1" as="geometry" />
        </mxCell>
      </root>
    </mxGraphModel>
  </diagram>
</mxfile>
