%!PS-Adobe-3.0 EPSF-3.0
%%Creator: cairo 1.14.2 (http://cairographics.org)
%%CreationDate: Tue Aug 23 11:54:18 2016
%%Pages: 1
%%DocumentData: Clean7Bit
%%LanguageLevel: 2
%%BoundingBox: 0 0 193 80
%%EndComments
%%BeginProlog
save
50 dict begin
/q { gsave } bind def
/Q { grestore } bind def
/cm { 6 array astore concat } bind def
/w { setlinewidth } bind def
/J { setlinecap } bind def
/j { setlinejoin } bind def
/M { setmiterlimit } bind def
/d { setdash } bind def
/m { moveto } bind def
/l { lineto } bind def
/c { curveto } bind def
/h { closepath } bind def
/re { exch dup neg 3 1 roll 5 3 roll moveto 0 rlineto
      0 exch rlineto 0 rlineto closepath } bind def
/S { stroke } bind def
/f { fill } bind def
/f* { eofill } bind def
/n { newpath } bind def
/W { clip } bind def
/W* { eoclip } bind def
/BT { } bind def
/ET { } bind def
/pdfmark where { pop globaldict /?pdfmark /exec load put }
    { globaldict begin /?pdfmark /pop load def /pdfmark
    /cleartomark load def end } ifelse
/BDC { mark 3 1 roll /BDC pdfmark } bind def
/EMC { mark /EMC pdfmark } bind def
/cairo_store_point { /cairo_point_y exch def /cairo_point_x exch def } def
/Tj { show currentpoint cairo_store_point } bind def
/TJ {
  {
    dup
    type /stringtype eq
    { show } { -0.001 mul 0 cairo_font_matrix dtransform rmoveto } ifelse
  } forall
  currentpoint cairo_store_point
} bind def
/cairo_selectfont { cairo_font_matrix aload pop pop pop 0 0 6 array astore
    cairo_font exch selectfont cairo_point_x cairo_point_y moveto } bind def
/Tf { pop /cairo_font exch def /cairo_font_matrix where
      { pop cairo_selectfont } if } bind def
/Td { matrix translate cairo_font_matrix matrix concatmatrix dup
      /cairo_font_matrix exch def dup 4 get exch 5 get cairo_store_point
      /cairo_font where { pop cairo_selectfont } if } bind def
/Tm { 2 copy 8 2 roll 6 array astore /cairo_font_matrix exch def
      cairo_store_point /cairo_font where { pop cairo_selectfont } if } bind def
/g { setgray } bind def
/rg { setrgbcolor } bind def
/d1 { setcachedevice } bind def
%%EndProlog
%%BeginSetup
%%EndSetup
%%Page: 1 1
%%BeginPageSetup
%%PageBoundingBox: 0 0 193 80
%%EndPageSetup
q 0 0 193 80 rectclip q
0.490196 0.537255 0.564706 rg
50.246 63.414 m 50.246 50.242 l 50.246 49.59 49.68 48.508 49.023 47.852
 c 35.609 34.438 l 35.281 34.109 34.945 33.949 34.73 33.949 c 34.516 33.949
 34.391 34.109 34.391 34.438 c 34.391 32.977 l 34.391 32.32 34.953 31.754
 35.609 31.754 c 64.828 31.754 l 65.484 31.754 66.051 32.32 66.051 32.977
 c 66.051 62.242 l 66.051 62.898 65.484 63.414 64.828 63.414 c h
31.66 32.977 m 31.66 32.32 31.094 31.754 30.438 31.754 c 15.855 31.754 
l 15.855 15.852 l 15.855 15.527 15.984 15.367 16.195 15.367 c 16.406 15.367
 16.695 15.527 17.023 15.852 c 30.438 29.27 l 31.094 29.922 31.66 31.004
 31.66 31.66 c h
31.66 32.977 m f
0.886275 0 0.101961 rg
49.902 80 m 49.688 80 49.352 79.84 49.023 79.512 c 35.609 66.047 l 34.957
 65.395 34.391 64.363 34.391 63.707 c 34.391 34.438 l 34.391 33.781 34.957
 33.781 35.609 34.438 c 49.023 47.852 l 49.68 48.508 50.246 49.59 50.246
 50.242 c 50.246 79.512 l 50.246 79.84 50.117 80 49.902 80 c h
1.219 63.414 m 0.562 63.414 0 62.898 0 62.242 c 0 32.977 l 0 32.32 0.562
 31.754 1.219 31.754 c 30.438 31.754 l 31.094 31.754 31.66 32.32 31.66 32.977
 c 31.66 62.242 l 31.66 62.898 31.094 63.414 30.438 63.414 c h
1.219 63.414 m f
0.556863 0.0627451 0.0862745 rg
35.609 63.414 m 34.953 63.414 34.391 62.852 34.391 62.195 c 34.391 34.438
 l 34.391 34.109 34.516 33.949 34.73 33.949 c 34.945 33.949 35.281 34.109
 35.609 34.438 c 49.023 47.852 l 49.68 48.508 50.246 49.59 50.246 50.242
 c 50.246 63.414 l h
31.316 61.414 m 31.102 61.414 30.766 61.254 30.438 60.926 c 17.023 47.465
 l 16.371 46.797 15.855 45.777 15.855 45.121 c 15.855 31.754 l 30.438 31.754
 l 31.094 31.754 31.66 32.32 31.66 32.977 c 31.66 60.926 l 31.66 61.254 
31.531 61.414 31.316 61.414 c h
31.316 61.414 m f
0.364706 0.411765 0.443137 rg
140.195 63.367 m 139.973 63.367 139.766 63.312 139.609 63.172 c 139.449
 63.027 139.367 62.855 139.367 62.633 c 139.367 32.586 l 139.367 32.363 
139.449 32.16 139.609 32 c 139.766 31.848 139.973 31.754 140.195 31.754 
c 147.414 31.754 l 148.895 31.754 150.332 31.98 151.66 32.391 c 152.984 
32.805 154.129 33.379 155.121 34.145 c 156.121 34.926 156.898 35.883 157.465
 37.023 c 158.031 38.16 158.344 39.457 158.344 40.879 c 158.344 41.859 158.172
 42.789 157.805 43.66 c 157.441 44.527 156.957 45.289 156.344 45.949 c 155.723
 46.617 155 47.133 154.195 47.562 c 153.391 47.988 152.539 48.281 151.66
 48.438 c 152.293 48.629 152.926 48.938 153.609 49.367 c 154.293 49.793 
154.941 50.309 155.512 50.926 c 156.082 51.543 156.551 52.25 156.93 53.023
 c 157.309 53.801 157.512 54.613 157.512 55.465 c 157.512 56.824 157.258
 57.984 156.734 58.977 c 156.207 59.973 155.508 60.816 154.637 61.465 c 
153.766 62.109 152.766 62.609 151.609 62.926 c 150.457 63.242 149.238 63.367
 148 63.367 c h
162.098 63.367 m 161.879 63.367 161.707 63.312 161.562 63.172 c 161.422
 63.027 161.398 62.855 161.465 62.633 c 167.512 32.586 l 167.578 32.367 
167.73 32.16 167.902 32 c 168.078 31.844 168.27 31.754 168.488 31.754 c 
170.879 31.754 l 171.102 31.754 171.289 31.844 171.465 32 c 171.633 32.16
 171.742 32.367 171.805 32.586 c 176.977 59.074 l 182.195 32.586 l 182.258
 32.367 182.363 32.16 182.539 32 c 182.711 31.844 182.906 31.754 183.121
 31.754 c 185.512 31.754 l 185.738 31.754 185.938 31.844 186.098 32 c 186.258
 32.16 186.375 32.367 186.441 32.586 c 192.488 62.633 l 192.555 62.855 192.516
 63.027 192.391 63.172 c 192.262 63.312 192.121 63.367 191.902 63.367 c 
190 63.367 l 189.527 63.367 189.199 63.141 189.074 62.633 c 184.391 36.098
 l 179.172 62.633 l 179.043 63.141 178.773 63.367 178.293 63.367 c 175.902
 63.367 l 175.398 63.367 175.098 63.141 174.977 62.633 c 169.805 36.098 
l 165.074 62.633 l 164.945 63.141 164.602 63.367 164.098 63.367 c h
142.832 60.586 m 148 60.586 l 149.777 60.586 151.23 60.117 152.344 59.172
 c 153.449 58.223 154 56.93 154 55.316 c 154 54.496 153.809 53.766 153.465
 53.074 c 153.113 52.379 152.672 51.77 152.098 51.27 c 151.531 50.762 150.875
 50.383 150.148 50.098 c 149.418 49.812 148.645 49.66 147.855 49.66 c 142.832
 49.66 l h
142.832 46.926 m 148 46.926 l 149.996 46.926 151.625 46.375 152.879 45.316
 c 154.125 44.258 154.734 42.859 154.734 41.023 c 154.734 40.074 154.598
 39.184 154.246 38.391 c 153.895 37.602 153.398 36.91 152.781 36.34 c 152.164
 35.77 151.457 35.34 150.637 35.023 c 149.812 34.703 148.918 34.535 148 
34.535 c 142.832 34.535 l h
100.879 24.535 m 100.879 17.316 l 100.879 17.125 100.891 16.91 100.926 
16.73 c 100.961 16.555 101.031 16.426 101.121 16.293 c 101.215 16.16 101.359
 16.027 101.512 15.949 c 101.664 15.871 101.859 15.852 102.098 15.852 c 
102.219 15.852 102.344 15.859 102.488 15.902 c 102.633 15.941 102.723 16.008
 102.781 16.047 c 102.535 16.73 l 102.344 16.586 l 102.148 16.535 l 101.996
 16.535 101.867 16.629 101.805 16.781 c 101.742 16.934 101.707 17.117 101.707
 17.367 c 101.707 24.535 l h
132.246 24.535 m 132.246 16 l 133.074 16 l 133.074 20.34 l 133.219 20.633
 l 133.512 21.023 l 133.645 21.148 133.828 21.277 134 21.367 c 134.172 21.461
 134.348 21.512 134.539 21.512 c 134.73 21.512 134.875 21.453 135.023 21.367
 c 135.172 21.277 135.32 21.164 135.414 21.023 c 135.512 20.887 135.559 
20.707 135.609 20.535 c 135.664 20.363 135.707 20.211 135.707 20.047 c 135.707
 16 l 136.539 16 l 136.539 20.145 l 136.539 20.395 136.52 20.633 136.441
 20.879 c 136.359 21.125 136.207 21.367 136.051 21.562 c 135.895 21.75 135.703
 21.883 135.465 22 c 135.223 22.117 134.953 22.195 134.637 22.195 c 134.426
 22.195 134.23 22.133 134.051 22.047 c 133.871 21.961 133.699 21.867 133.562
 21.754 c 133.422 21.645 133.305 21.523 133.219 21.414 c 133.074 21.172 
l 133.074 24.535 l h
148.926 24.535 m 148.926 16 l 149.758 16 l 149.758 20.34 l 149.902 20.633
 l 150.195 21.023 l 150.328 21.148 150.461 21.277 150.637 21.367 c 150.809
 21.461 151.027 21.512 151.219 21.512 c 151.414 21.512 151.559 21.453 151.707
 21.367 c 151.855 21.277 152.004 21.164 152.098 21.023 c 152.195 20.887 
152.242 20.707 152.293 20.535 c 152.344 20.363 152.391 20.211 152.391 20.047
 c 152.391 16 l 153.219 16 l 153.219 20.145 l 153.219 20.395 153.156 20.633
 153.074 20.879 c 152.996 21.125 152.891 21.367 152.734 21.562 c 152.578
 21.75 152.387 21.883 152.148 22 c 151.906 22.117 151.641 22.195 151.316
 22.195 c 151.109 22.195 150.91 22.133 150.734 22.047 c 150.555 21.961 150.383
 21.867 150.246 21.754 c 150.105 21.645 149.988 21.523 149.902 21.414 c 
149.758 21.172 l 149.758 24.535 l h
161.512 24.535 m 161.512 17.316 l 161.512 17.125 161.523 16.91 161.562 
16.73 c 161.594 16.555 161.664 16.426 161.758 16.293 c 161.848 16.16 161.945
 16.027 162.098 15.949 c 162.25 15.871 162.445 15.852 162.684 15.852 c 162.805
 15.852 162.977 15.859 163.121 15.902 c 163.266 15.941 163.359 16.008 163.414
 16.047 c 163.172 16.73 l 162.977 16.586 l 162.734 16.535 l 162.582 16.535
 162.504 16.629 162.441 16.781 c 162.375 16.934 162.344 17.117 162.344 17.367
 c 162.344 24.535 l h
81.855 24 m 81.855 16 l 83.758 16 l 84.254 16 84.695 16.121 85.121 16.34
 c 85.547 16.555 85.938 16.844 86.246 17.219 c 86.551 17.598 86.797 18.023
 86.977 18.535 c 87.152 19.047 87.219 19.609 87.219 20.195 c 87.219 20.797
 87.109 21.332 86.926 21.805 c 86.742 22.277 86.523 22.645 86.195 22.977
 c 85.867 23.305 85.469 23.582 85.023 23.754 c 84.578 23.93 84.074 24 83.562
 24 c h
113.562 24 m 113.562 16 l 114.441 16 l 114.441 19.805 l 117.707 19.805 
l 117.707 16 l 118.586 16 l 118.586 24 l 117.707 24 l 117.707 20.535 l 114.441
 20.535 l 114.441 24 l h
82.73 23.316 m 83.707 23.316 l 84.055 23.316 84.367 23.219 84.684 23.074
 c 85 22.93 85.273 22.758 85.512 22.488 c 85.754 22.219 85.953 21.898 86.098
 21.512 c 86.242 21.125 86.344 20.684 86.344 20.195 c 86.344 19.703 86.281
 19.25 86.148 18.828 c 86.016 18.406 85.793 18.02 85.562 17.707 c 85.328
 17.395 85.051 17.156 84.73 16.977 c 84.418 16.797 84.117 16.684 83.758 
16.684 c 82.73 16.684 l h
96.781 22.195 m 96.57 22.195 96.352 22.145 96.148 22.098 c 95.941 22.047
 95.73 22.012 95.562 21.949 c 95.395 21.883 95.293 21.812 95.172 21.754 
c 94.926 21.66 l 95.172 20.977 l 95.414 21.121 l 95.531 21.184 95.66 21.207
 95.805 21.27 c 95.949 21.328 96.086 21.414 96.246 21.465 c 96.406 21.512
 96.559 21.512 96.684 21.512 c 97.117 21.512 97.445 21.391 97.66 21.121 
c 97.871 20.855 97.953 20.539 97.953 20.145 c 97.953 19.754 l 96.781 19.465
 l 96.547 19.418 96.32 19.332 96.051 19.219 c 95.781 19.109 95.5 18.992 
95.27 18.828 c 95.039 18.672 94.879 18.461 94.73 18.242 c 94.582 18.027 
94.488 17.816 94.488 17.559 c 94.488 17.023 94.684 16.59 95.023 16.293 c
 95.367 15.996 95.812 15.852 96.344 15.852 c 96.566 15.852 96.73 15.867 
96.926 15.949 c 97.125 16.035 97.312 16.18 97.465 16.293 c 97.617 16.406
 97.762 16.473 97.855 16.586 c 98 16.828 l 98 16 l 98.781 16 l 98.781 20.145
 l 98.781 20.801 98.609 21.32 98.246 21.656 c 97.879 22 97.391 22.195 96.781
 22.195 c h
106.051 22.195 m 105.68 22.195 105.352 22.051 105.074 21.852 c 104.797 
21.648 104.582 21.422 104.391 21.121 c 104.203 20.82 104.047 20.496 103.953
 20.145 c 103.855 19.793 103.805 19.465 103.805 19.172 c 103.805 18.793 
103.832 18.391 103.902 18 c 103.977 17.613 104.113 17.254 104.293 16.926
 c 104.477 16.602 104.719 16.348 105.023 16.145 c 105.328 15.938 105.723
 15.852 106.195 15.852 c 106.422 15.852 106.625 15.867 106.828 15.902 c 
107.035 15.938 107.25 16 107.414 16.047 c 107.578 16.098 107.691 16.145 
107.805 16.195 c 108.051 16.293 l 107.805 16.977 l 107.562 16.828 l 107.457
 16.777 107.309 16.73 107.172 16.684 c 107.031 16.637 106.898 16.621 106.73
 16.586 c 106.57 16.547 106.414 16.488 106.246 16.488 c 105.965 16.488 105.715
 16.574 105.512 16.73 c 105.312 16.887 105.152 17.082 105.023 17.316 c 104.895
 17.555 104.793 17.824 104.73 18.098 c 104.672 18.367 104.633 18.637 104.633
 18.879 c 108.246 18.879 l 108.246 19.172 l 108.246 19.488 108.223 19.84
 108.148 20.195 c 108.07 20.547 107.93 20.871 107.758 21.172 c 107.582 21.465
 107.352 21.707 107.074 21.902 c 106.789 22.094 106.461 22.195 106.051 22.195
 c h
122.879 22.195 m 122.457 22.195 122.109 22.066 121.805 21.852 c 121.504
 21.641 121.266 21.383 121.074 21.074 c 120.879 20.762 120.719 20.441 120.637
 20.098 c 120.547 19.75 120.488 19.441 120.488 19.172 c 120.488 18.832 120.559
 18.488 120.637 18.098 c 120.711 17.707 120.844 17.352 121.023 17.023 c 
121.207 16.695 121.449 16.414 121.758 16.195 c 122.066 15.977 122.422 15.852
 122.879 15.852 c 123.32 15.852 123.695 15.977 124 16.195 c 124.305 16.414
 124.547 16.691 124.734 17.023 c 124.918 17.359 125.039 17.707 125.121 18.098
 c 125.207 18.484 125.27 18.84 125.27 19.172 c 125.27 19.449 125.25 19.75
 125.172 20.098 c 125.09 20.445 124.918 20.77 124.73 21.074 c 124.551 21.379
 124.305 21.648 124 21.852 c 123.695 22.062 123.328 22.195 122.879 22.195
 c h
129.074 22.195 m 128.707 22.195 128.391 22.09 128.098 21.902 c 127.805 
21.715 127.57 21.461 127.367 21.172 c 127.16 20.883 126.992 20.551 126.879
 20.195 c 126.766 19.836 126.684 19.508 126.684 19.172 c 126.684 18.762 
126.746 18.348 126.828 17.949 c 126.914 17.555 127.035 17.191 127.219 16.879
 c 127.406 16.566 127.652 16.34 127.953 16.145 c 128.254 15.953 128.641 
15.852 129.074 15.852 c 129.273 15.852 129.473 15.863 129.66 15.902 c 129.844
 15.938 130 16 130.148 16.047 c 130.297 16.098 130.391 16.145 130.488 16.195
 c 130.73 16.293 l 130.441 16.977 l 130.246 16.828 l 129.902 16.684 l 129.777
 16.637 129.648 16.617 129.512 16.586 c 129.375 16.551 129.25 16.535 129.121
 16.535 c 128.852 16.535 128.586 16.621 128.391 16.781 c 128.195 16.938 
128.027 17.117 127.902 17.367 c 127.777 17.613 127.715 17.926 127.66 18.242
 c 127.602 18.559 127.562 18.859 127.562 19.172 c 127.562 19.426 127.59 
19.68 127.66 19.949 c 127.727 20.223 127.824 20.504 127.953 20.73 c 128.082
 20.961 128.254 21.125 128.441 21.27 c 128.629 21.41 128.832 21.512 129.074
 21.512 c 129.465 21.465 l 129.805 21.316 l 130.148 21.172 l 130.293 21.074
 l 130.586 21.758 l 130.391 21.902 l 130.051 22 l 129.914 22.043 129.781
 22.113 129.609 22.145 c 129.441 22.176 129.25 22.195 129.074 22.195 c h
140.246 22.195 m 139.98 22.195 139.746 22.137 139.512 22.047 c 139.277 
21.957 139.059 21.816 138.879 21.66 c 138.699 21.5 138.543 21.297 138.441
 21.074 c 138.336 20.848 138.293 20.605 138.293 20.34 c 138.293 20.094 138.352
 19.891 138.488 19.707 c 138.629 19.523 138.812 19.371 139.023 19.219 c 
139.238 19.066 139.461 18.91 139.707 18.781 c 139.957 18.645 140.18 18.523
 140.391 18.391 c 140.605 18.258 140.789 18.09 140.926 17.949 c 141.066 
17.809 141.172 17.688 141.172 17.512 c 141.172 17.199 141.059 16.957 140.832
 16.781 c 140.602 16.602 140.309 16.488 140 16.488 c 139.855 16.488 139.688
 16.496 139.512 16.535 c 139.336 16.574 139.18 16.637 139.023 16.684 c 138.871
 16.734 138.754 16.777 138.637 16.828 c 138.391 16.977 l 138.098 16.293 
l 138.391 16.145 l 138.508 16.098 138.621 16.047 138.781 16 c 138.938 15.949
 139.16 15.934 139.367 15.902 c 139.57 15.871 139.762 15.852 140 15.852 
c 140.273 15.852 140.535 15.91 140.781 16 c 141.027 16.086 141.234 16.18
 141.414 16.34 c 141.598 16.504 141.75 16.707 141.855 16.926 c 141.957 17.148
 142 17.402 142 17.656 c 142 17.883 141.949 18.062 141.805 18.242 c 141.66
 18.426 141.48 18.578 141.27 18.73 c 141.059 18.883 140.84 19.039 140.586
 19.172 c 140.332 19.301 140.066 19.422 139.855 19.559 c 139.645 19.695 
139.461 19.848 139.316 20 c 139.172 20.152 139.121 20.309 139.121 20.488
 c 139.121 20.801 139.246 21.078 139.465 21.27 c 139.68 21.457 139.938 21.562
 140.246 21.562 c 140.586 21.512 l 140.977 21.367 l 141.27 21.219 l 141.465
 21.121 l 141.707 21.758 l 141.512 21.902 l 141.418 21.945 141.309 21.961
 141.172 22 c 141.035 22.039 140.895 22.113 140.734 22.145 c 140.57 22.18
 140.406 22.195 140.246 22.195 c h
145.758 22.195 m 145.387 22.195 145.074 22.09 144.781 21.902 c 144.488 
21.715 144.207 21.461 144 21.172 c 143.797 20.883 143.676 20.551 143.562
 20.195 c 143.449 19.836 143.367 19.508 143.367 19.172 c 143.367 18.762 
143.43 18.348 143.512 17.949 c 143.598 17.555 143.719 17.191 143.902 16.879
 c 144.086 16.566 144.336 16.34 144.637 16.145 c 144.934 15.953 145.273 
15.852 145.707 15.852 c 145.906 15.852 146.109 15.863 146.293 15.902 c 146.48
 15.938 146.684 16 146.828 16.047 c 146.977 16.098 147.07 16.145 147.172
 16.195 c 147.367 16.293 l 147.121 16.977 l 146.879 16.828 l 146.586 16.684
 l 146.461 16.637 146.332 16.617 146.195 16.586 c 146.059 16.551 145.887
 16.535 145.758 16.535 c 145.484 16.535 145.27 16.621 145.074 16.781 c 144.875
 16.938 144.711 17.117 144.586 17.367 c 144.461 17.613 144.398 17.926 144.344
 18.242 c 144.285 18.559 144.246 18.859 144.246 19.172 c 144.246 19.426 
144.273 19.68 144.344 19.949 c 144.41 20.223 144.508 20.504 144.637 20.73
 c 144.766 20.961 144.934 21.125 145.121 21.27 c 145.309 21.41 145.516 21.512
 145.758 21.512 c 146.098 21.465 l 146.488 21.316 l 146.832 21.172 l 146.977
 21.074 l 147.219 21.758 l 147.074 21.902 l 146.734 22 l 146.602 22.043 
146.465 22.113 146.293 22.145 c 146.125 22.176 145.934 22.195 145.758 22.195
 c h
166.586 22.195 m 166.219 22.195 165.887 22.051 165.609 21.852 c 165.332
 21.648 165.117 21.422 164.93 21.121 c 164.742 20.82 164.586 20.496 164.488
 20.145 c 164.395 19.793 164.344 19.465 164.344 19.172 c 164.344 18.793 
164.414 18.391 164.488 18 c 164.559 17.613 164.652 17.254 164.832 16.926
 c 165.012 16.602 165.258 16.348 165.562 16.145 c 165.867 15.938 166.258
 15.852 166.734 15.852 c 166.961 15.852 167.164 15.867 167.367 15.902 c 
167.57 15.938 167.789 16 167.953 16.047 c 168.117 16.098 168.227 16.145 
168.344 16.195 c 168.586 16.293 l 168.344 16.977 l 168.098 16.828 l 167.996
 16.777 167.898 16.73 167.758 16.684 c 167.617 16.637 167.434 16.621 167.27
 16.586 c 167.102 16.547 166.953 16.488 166.781 16.488 c 166.5 16.488 166.25
 16.574 166.051 16.73 c 165.848 16.887 165.691 17.082 165.562 17.316 c 165.434
 17.555 165.328 17.824 165.27 18.098 c 165.211 18.367 165.172 18.637 165.172
 18.879 c 168.781 18.879 l 168.781 19.172 l 168.781 19.488 168.762 19.84
 168.684 20.195 c 168.609 20.547 168.469 20.871 168.293 21.172 c 168.121
 21.465 167.891 21.707 167.609 21.902 c 167.328 22.094 166.996 22.195 166.586
 22.195 c h
88.633 22.047 m 88.633 17.902 l 88.633 17.637 88.707 17.371 88.781 17.121
 c 88.852 16.871 88.969 16.676 89.121 16.488 c 89.273 16.297 89.473 16.113
 89.707 16 c 89.945 15.883 90.207 15.852 90.535 15.852 c 90.754 15.852 90.941
 15.91 91.121 16 c 91.301 16.09 91.473 16.18 91.609 16.293 c 91.746 16.406
 91.867 16.523 91.953 16.633 c 92.098 16.828 l 92.098 16 l 92.879 16 l 92.879
 22.047 l 92.051 22.047 l 92.051 17.66 l 91.902 17.414 l 91.609 17.023 l
 91.48 16.895 91.34 16.785 91.172 16.684 c 91 16.582 90.828 16.535 90.633
 16.535 c 90.426 16.535 90.242 16.598 90.098 16.684 c 89.953 16.766 89.844
 16.844 89.758 16.977 c 89.668 17.109 89.605 17.293 89.562 17.465 c 89.52
 17.637 89.465 17.812 89.465 18 c 89.465 22.047 l h
155.219 22.047 m 155.219 17.902 l 155.219 17.637 155.246 17.371 155.316
 17.121 c 155.391 16.871 155.504 16.676 155.66 16.488 c 155.809 16.297 156.008
 16.113 156.246 16 c 156.48 15.883 156.746 15.852 157.074 15.852 c 157.289
 15.852 157.527 15.91 157.707 16 c 157.887 16.09 158.012 16.18 158.148 16.293
 c 158.285 16.406 158.406 16.523 158.488 16.633 c 158.684 16.828 l 158.684
 16 l 159.465 16 l 159.465 22.047 l 158.637 22.047 l 158.637 17.66 l 158.488
 17.414 l 158.195 17.023 l 158.066 16.895 157.926 16.785 157.758 16.684 
c 157.59 16.582 157.367 16.535 157.172 16.535 c 156.965 16.535 156.828 16.598
 156.684 16.684 c 156.539 16.766 156.383 16.844 156.293 16.977 c 156.207
 17.109 156.141 17.293 156.098 17.465 c 156.055 17.637 156.051 17.812 156.051
 18 c 156.051 22.047 l h
106.051 21.512 m 106.301 21.512 106.508 21.465 106.684 21.316 c 106.859
 21.168 107.016 20.988 107.121 20.781 c 107.23 20.57 107.312 20.336 107.367
 20.098 c 107.418 19.855 107.465 19.641 107.465 19.465 c 104.684 19.465 
l 104.684 19.664 104.719 19.91 104.781 20.145 c 104.84 20.383 104.91 20.57
 105.023 20.781 c 105.137 20.992 105.285 21.176 105.465 21.316 c 105.641
 21.457 105.816 21.512 106.051 21.512 c h
122.879 21.512 m 123.168 21.512 123.418 21.387 123.609 21.219 c 123.805
 21.051 123.977 20.875 124.098 20.633 c 124.215 20.395 124.293 20.117 124.344
 19.852 c 124.391 19.59 124.391 19.371 124.391 19.172 c 124.391 18.93 124.383
 18.648 124.344 18.34 c 124.301 18.035 124.215 17.781 124.098 17.512 c 123.984
 17.246 123.809 17.012 123.609 16.828 c 123.414 16.641 123.176 16.535 122.879
 16.535 c 122.574 16.535 122.344 16.641 122.148 16.828 c 121.949 17.012 
121.77 17.246 121.66 17.512 c 121.547 17.781 121.508 18.035 121.465 18.34
 c 121.418 18.648 121.367 18.93 121.367 19.172 c 121.367 19.387 121.41 19.637
 121.465 19.902 c 121.516 20.172 121.586 20.395 121.707 20.633 c 121.828
 20.867 122.004 21.109 122.195 21.27 c 122.391 21.43 122.598 21.512 122.879
 21.512 c h
166.637 21.512 m 166.883 21.512 167.09 21.465 167.27 21.316 c 167.441 21.168
 167.547 20.988 167.66 20.781 c 167.766 20.57 167.852 20.336 167.902 20.098
 c 167.953 19.855 168 19.641 168 19.465 c 165.219 19.465 l 165.219 19.664
 165.258 19.91 165.316 20.145 c 165.379 20.383 165.449 20.57 165.562 20.781
 c 165.676 20.992 165.824 21.176 166 21.316 c 166.18 21.457 166.402 21.512
 166.637 21.512 c h
97.953 19.121 m 97.953 17.66 l 97.758 17.27 l 97.66 17.137 97.555 16.992
 97.414 16.879 c 97.273 16.762 97.098 16.711 96.926 16.633 c 96.754 16.559
 96.578 16.488 96.391 16.488 c 96.098 16.488 95.863 16.586 95.66 16.781 
c 95.453 16.973 95.367 17.223 95.367 17.562 c 95.367 17.73 95.41 17.902 
95.512 18.047 c 95.617 18.191 95.746 18.324 95.902 18.438 c 96.059 18.551
 96.246 18.652 96.441 18.73 c 96.629 18.812 96.809 18.887 96.977 18.926 
c h
97.414 11.316 m 97.414 8 l 97.219 8.242 l 96.926 8.586 l 96.801 8.691 96.652
 8.75 96.488 8.828 c 96.324 8.91 96.137 8.977 95.953 8.977 c 95.605 8.977
 95.309 8.859 95.023 8.684 c 94.738 8.508 94.496 8.289 94.293 8 c 94.094
 7.711 93.914 7.379 93.805 7.023 c 93.695 6.668 93.66 6.312 93.66 5.949 
c 93.66 5.559 93.719 5.18 93.805 4.781 c 93.891 4.383 94.012 4.023 94.195
 3.707 c 94.383 3.391 94.59 3.125 94.879 2.926 c 95.164 2.73 95.535 2.633
 95.953 2.633 c 96.129 2.633 96.316 2.695 96.488 2.781 c 96.66 2.863 96.785
 2.961 96.926 3.074 c 97.066 3.184 97.18 3.301 97.27 3.414 c 97.465 3.656
 l 97.465 2.781 l 98.246 2.781 l 98.246 11.316 l h
160.098 11.316 m 160.098 2.926 l 160.172 2.91 160.27 2.859 160.441 2.828
 c 160.609 2.797 160.785 2.762 160.977 2.73 c 161.168 2.699 161.371 2.703
 161.562 2.684 c 161.75 2.664 161.93 2.633 162.051 2.633 c 162.484 2.633
 162.844 2.727 163.172 2.926 c 163.5 3.125 163.777 3.391 164 3.707 c 164.227
 4.023 164.379 4.387 164.488 4.781 c 164.602 5.172 164.684 5.559 164.684
 5.949 c 164.684 6.285 164.621 6.668 164.539 7.023 c 164.453 7.379 164.332
 7.66 164.148 7.949 c 163.961 8.238 163.707 8.496 163.414 8.684 c 163.129
 8.871 162.801 8.977 162.391 8.977 c 162.207 8.977 162.02 8.914 161.855 
8.828 c 161.684 8.742 161.547 8.648 161.414 8.535 c 161.074 8.195 l 160.93
 8 l 160.93 11.316 l h
127.219 11.023 m 127.059 11.023 126.934 10.938 126.828 10.828 c 126.727
 10.723 126.684 10.594 126.684 10.438 c 126.684 10.289 126.727 10.156 126.828
 10.047 c 126.934 9.938 127.059 9.902 127.219 9.902 c 127.379 9.902 127.5
 9.938 127.609 10.047 c 127.719 10.156 127.805 10.289 127.805 10.438 c 127.805
 10.594 127.719 10.723 127.609 10.828 c 127.5 10.938 127.379 11.023 127.219
 11.023 c h
129.27 11.023 m 129.109 11.023 128.98 10.938 128.879 10.828 c 128.773 10.723
 128.734 10.594 128.734 10.438 c 128.734 10.289 128.777 10.156 128.879 10.047
 c 128.98 9.938 129.109 9.902 129.27 9.902 c 129.43 9.902 129.602 9.938 
129.707 10.047 c 129.816 10.156 129.855 10.289 129.855 10.438 c 129.855 
10.594 129.816 10.723 129.707 10.828 c 129.602 10.938 129.43 11.023 129.27
 11.023 c h
81.855 10.828 m 81.855 2.781 l 83.902 2.781 l 84.281 2.781 84.59 2.82 84.926
 2.926 c 85.266 3.031 85.602 3.215 85.855 3.414 c 86.109 3.609 86.297 3.809
 86.441 4.098 c 86.582 4.387 86.633 4.711 86.633 5.074 c 86.633 5.324 86.578
 5.582 86.488 5.805 c 86.395 6.023 86.305 6.219 86.148 6.391 c 85.988 6.559
 85.816 6.672 85.609 6.781 c 85.406 6.891 85.152 6.984 84.926 7.023 c 85.09
 7.074 85.293 7.16 85.465 7.27 c 85.637 7.375 85.758 7.5 85.902 7.656 c 
86.047 7.812 86.195 8 86.293 8.195 c 86.391 8.391 86.441 8.562 86.441 8.781
 c 86.441 9.125 86.379 9.453 86.246 9.707 c 86.113 9.957 85.93 10.176 85.707
 10.34 c 85.488 10.504 85.219 10.602 84.926 10.684 c 84.633 10.762 84.363
 10.828 84.051 10.828 c h
115.707 10.828 m 117.562 2.781 l 118.539 2.781 l 120.246 9.707 l 122 2.781
 l 122.977 2.781 l 124.828 10.828 l 123.953 10.828 l 122.488 3.902 l 120.781
 10.828 l 119.805 10.828 l 118.098 3.902 l 116.637 10.828 l h
136.977 10.438 m 136.977 8.828 l 136 8.828 l 136 8.145 l 136.977 8.145 
l 136.977 3.949 l 136.977 3.781 137.027 3.625 137.074 3.465 c 137.117 3.301
 137.168 3.148 137.27 3.023 c 137.371 2.898 137.492 2.805 137.66 2.73 c 
137.824 2.66 138.055 2.633 138.293 2.633 c 138.539 2.684 l 138.828 2.73 
l 139.074 2.781 l 139.219 2.828 l 138.977 3.512 l 138.926 3.48 138.82 3.457
 138.684 3.414 c 138.547 3.371 138.457 3.316 138.344 3.316 c 138.156 3.316
 138.031 3.402 137.953 3.559 c 137.879 3.715 137.805 3.879 137.805 4.047
 c 137.805 8.145 l 139.023 8.145 l 139.023 8.828 l 137.805 8.828 l 137.805
 10.438 l h
141.121 10.438 m 141.121 8.828 l 140.098 8.828 l 140.098 8.145 l 141.121
 8.145 l 141.121 3.949 l 141.121 3.781 141.125 3.625 141.172 3.465 c 141.215
 3.301 141.27 3.148 141.367 3.023 c 141.469 2.898 141.594 2.805 141.758 
2.73 c 141.922 2.66 142.152 2.633 142.391 2.633 c 142.637 2.684 l 142.926
 2.73 l 143.172 2.781 l 143.316 2.828 l 143.074 3.512 l 143.023 3.48 142.965
 3.457 142.832 3.414 c 142.695 3.371 142.555 3.316 142.441 3.316 c 142.258
 3.316 142.125 3.402 142.051 3.559 c 141.973 3.715 141.953 3.879 141.953
 4.047 c 141.953 8.145 l 143.121 8.145 l 143.121 8.828 l 141.953 8.828 l
 141.953 10.438 l h
82.73 10.098 m 84.051 10.098 l 84.5 10.098 84.84 9.996 85.121 9.754 c 85.402
 9.52 85.562 9.188 85.562 8.781 c 85.562 8.57 85.504 8.371 85.414 8.195 
c 85.328 8.02 85.219 7.832 85.074 7.707 c 84.93 7.578 84.77 7.488 84.586
 7.414 c 84.402 7.344 84.203 7.316 84 7.316 c 82.73 7.316 l h
90 8.977 m 89.793 8.977 89.57 8.926 89.367 8.879 c 89.16 8.828 88.996 8.793
 88.828 8.73 c 88.66 8.668 88.512 8.594 88.391 8.535 c 88.148 8.438 l 88.391
 7.754 l 88.633 7.902 l 88.75 7.965 88.879 8.035 89.023 8.098 c 89.168 8.156
 89.305 8.195 89.465 8.242 c 89.625 8.293 89.777 8.34 89.902 8.34 c 90.336
 8.34 90.668 8.172 90.879 7.902 c 91.09 7.633 91.172 7.32 91.172 6.926 c
 91.172 6.535 l 90 6.242 l 89.766 6.195 89.539 6.109 89.27 6 c 89 5.887 
88.766 5.77 88.535 5.609 c 88.309 5.449 88.098 5.242 87.953 5.023 c 87.801
 4.809 87.707 4.598 87.707 4.34 c 87.707 3.805 87.906 3.371 88.246 3.074
 c 88.586 2.777 89.031 2.633 89.562 2.633 c 89.785 2.633 90 2.695 90.195
 2.781 c 90.395 2.863 90.531 2.961 90.684 3.074 c 90.836 3.184 90.98 3.301
 91.074 3.414 c 91.219 3.656 l 91.219 2.781 l 92 2.781 l 92 6.977 l 92 7.633
 91.828 8.098 91.465 8.438 c 91.098 8.777 90.609 8.977 90 8.977 c h
102 8.977 m 101.633 8.977 101.301 8.883 101.023 8.684 c 100.746 8.48 100.48
 8.203 100.293 7.902 c 100.105 7.602 100 7.281 99.902 6.926 c 99.809 6.574
 99.758 6.246 99.758 5.949 c 99.758 5.574 99.781 5.219 99.855 4.828 c 99.926
 4.441 100.066 4.078 100.246 3.754 c 100.426 3.43 100.672 3.133 100.977 
2.926 c 101.281 2.723 101.672 2.633 102.148 2.633 c 102.371 2.633 102.578
 2.648 102.781 2.684 c 102.984 2.719 103.152 2.781 103.316 2.828 c 103.48
 2.875 103.641 2.93 103.758 2.977 c 104 3.074 l 103.758 3.754 l 103.465 
3.609 l 103.359 3.555 103.262 3.512 103.121 3.465 c 102.98 3.414 102.848
 3.406 102.684 3.367 c 102.52 3.332 102.316 3.316 102.148 3.316 c 101.867
 3.316 101.664 3.355 101.465 3.512 c 101.262 3.668 101.055 3.906 100.926
 4.145 c 100.797 4.379 100.742 4.605 100.684 4.879 c 100.625 5.148 100.586
 5.418 100.586 5.656 c 104.195 5.656 l 104.195 5.949 l 104.195 6.273 104.125
 6.621 104.051 6.977 c 103.973 7.328 103.883 7.652 103.707 7.949 c 103.535
 8.246 103.305 8.488 103.023 8.684 c 102.746 8.875 102.41 8.977 102 8.977
 c h
108.344 8.977 m 108.133 8.977 107.941 8.918 107.758 8.828 c 107.574 8.742
 107.363 8.645 107.219 8.535 c 107.078 8.422 106.969 8.305 106.879 8.195
 c 106.73 8 l 106.73 8.828 l 105.953 8.828 l 105.953 2.781 l 106.781 2.781
 l 106.781 7.121 l 106.926 7.465 l 107.219 7.805 l 107.352 7.93 107.535 
8.059 107.707 8.145 c 107.879 8.23 108.059 8.293 108.246 8.293 c 108.438
 8.293 108.586 8.23 108.73 8.145 c 108.879 8.059 109.027 7.945 109.121 7.805
 c 109.219 7.664 109.266 7.488 109.316 7.316 c 109.371 7.145 109.414 6.988
 109.414 6.828 c 109.414 2.781 l 110.246 2.781 l 110.246 6.926 l 110.246
 7.176 110.176 7.414 110.098 7.66 c 110.02 7.902 109.914 8.148 109.758 8.34
 c 109.602 8.535 109.41 8.664 109.172 8.781 c 108.93 8.895 108.66 8.977 
108.344 8.977 c h
134.539 8.977 m 134.328 8.977 134.117 8.922 133.953 8.828 c 133.789 8.742
 133.633 8.652 133.512 8.535 c 133.27 8.195 l 133.121 8 l 133.121 8.828 
l 132.344 8.828 l 132.344 2.781 l 133.172 2.781 l 133.172 7.121 l 133.27
 7.367 l 133.562 7.754 l 133.672 7.875 133.809 7.953 133.953 8.047 c 134.098
 8.137 134.23 8.195 134.391 8.195 c 134.637 8.145 l 134.879 8.047 l 135.121
 8.781 l 134.879 8.926 l h
146.684 8.977 m 146.316 8.977 145.984 8.883 145.707 8.684 c 145.43 8.48
 145.215 8.203 145.023 7.902 c 144.84 7.602 144.684 7.281 144.586 6.926 
c 144.488 6.574 144.441 6.246 144.441 5.949 c 144.441 5.574 144.516 5.219
 144.586 4.828 c 144.66 4.441 144.75 4.078 144.926 3.754 c 145.105 3.43 
145.355 3.133 145.66 2.926 c 145.965 2.723 146.355 2.633 146.832 2.633 c
 147.055 2.633 147.258 2.648 147.465 2.684 c 147.668 2.719 147.883 2.781
 148.051 2.828 c 148.211 2.875 148.324 2.93 148.441 2.977 c 148.684 3.074
 l 148.441 3.754 l 148.195 3.609 l 148.09 3.555 147.945 3.512 147.805 3.465
 c 147.668 3.414 147.531 3.406 147.367 3.367 c 147.203 3.332 147.047 3.316
 146.879 3.316 c 146.602 3.316 146.348 3.355 146.148 3.512 c 145.945 3.668
 145.789 3.906 145.66 4.145 c 145.531 4.379 145.426 4.605 145.367 4.879 
c 145.305 5.148 145.27 5.418 145.27 5.656 c 148.879 5.656 l 148.879 5.949
 l 148.879 6.273 148.855 6.621 148.781 6.977 c 148.703 7.328 148.566 7.652
 148.391 7.949 c 148.219 8.246 147.988 8.488 147.707 8.684 c 147.426 8.875
 147.094 8.977 146.684 8.977 c h
152.879 8.977 m 152.656 8.977 152.473 8.918 152.293 8.828 c 152.113 8.742
 151.93 8.652 151.805 8.535 c 151.512 8.195 l 151.367 8 l 151.367 8.828 
l 150.586 8.828 l 150.586 2.781 l 151.414 2.781 l 151.414 7.121 l 151.562
 7.465 l 151.805 7.805 l 151.93 7.93 152.082 8.059 152.246 8.145 c 152.41
 8.23 152.59 8.293 152.781 8.293 c 152.996 8.293 153.176 8.23 153.316 8.145
 c 153.457 8.062 153.574 7.941 153.66 7.805 c 153.742 7.668 153.82 7.539
 153.855 7.367 c 153.891 7.195 153.902 7.008 153.902 6.828 c 153.902 2.781
 l 154.734 2.781 l 154.734 7.219 l 154.832 7.562 l 155.121 7.902 l 155.238
 8.008 155.395 8.07 155.562 8.145 c 155.727 8.223 155.891 8.293 156.098 
8.293 c 156.301 8.293 156.492 8.23 156.637 8.145 c 156.781 8.062 156.891
 7.941 156.977 7.805 c 157.059 7.668 157.129 7.539 157.172 7.367 c 157.207
 7.195 157.219 7.008 157.219 6.828 c 157.219 2.781 l 158.051 2.781 l 158.051
 6.926 l 158.051 7.176 158.012 7.414 157.953 7.66 c 157.895 7.902 157.801
 8.148 157.66 8.34 c 157.516 8.535 157.309 8.664 157.074 8.781 c 156.836
 8.895 156.543 8.977 156.195 8.977 c 155.957 8.977 155.758 8.918 155.562
 8.828 c 155.363 8.742 155.168 8.645 155.023 8.535 c 154.883 8.422 154.816
 8.305 154.734 8.195 c 154.539 8 l 154.391 8.242 l 154.098 8.586 l 153.973
 8.691 153.809 8.75 153.609 8.828 c 153.414 8.91 153.176 8.977 152.879 8.977
 c h
168.148 8.977 m 167.777 8.977 167.445 8.883 167.172 8.684 c 166.895 8.48
 166.68 8.203 166.488 7.902 c 166.301 7.602 166.145 7.281 166.051 6.926 
c 165.949 6.574 165.902 6.246 165.902 5.949 c 165.902 5.574 165.977 5.219
 166.051 4.828 c 166.121 4.441 166.211 4.078 166.391 3.754 c 166.574 3.43
 166.82 3.133 167.121 2.926 c 167.426 2.723 167.816 2.633 168.293 2.633 
c 168.516 2.633 168.723 2.648 168.93 2.684 c 169.129 2.719 169.348 2.781
 169.512 2.828 c 169.68 2.875 169.785 2.93 169.902 2.977 c 170.148 3.074
 l 169.902 3.754 l 169.66 3.609 l 169.555 3.555 169.457 3.512 169.316 3.465
 c 169.176 3.414 168.996 3.406 168.832 3.367 c 168.668 3.332 168.512 3.316
 168.344 3.316 c 168.062 3.316 167.809 3.355 167.609 3.512 c 167.406 3.668
 167.254 3.906 167.121 4.145 c 166.996 4.379 166.891 4.605 166.832 4.879
 c 166.77 5.148 166.734 5.418 166.734 5.656 c 170.344 5.656 l 170.344 5.949
 l 170.344 6.273 170.324 6.621 170.246 6.977 c 170.168 7.328 170.027 7.652
 169.855 7.949 c 169.684 8.246 169.5 8.488 169.219 8.684 c 168.941 8.875
 168.555 8.977 168.148 8.977 c h
174.246 8.977 m 174.035 8.977 173.824 8.922 173.66 8.828 c 173.492 8.742
 173.387 8.652 173.27 8.535 c 172.977 8.195 l 172.832 8 l 172.832 8.828 
l 172.051 8.828 l 172.051 2.781 l 172.879 2.781 l 172.879 7.121 l 173.027
 7.367 l 173.27 7.754 l 173.379 7.875 173.516 7.953 173.66 8.047 c 173.805
 8.137 173.938 8.195 174.098 8.195 c 174.391 8.145 l 174.586 8.047 l 174.832
 8.781 l 174.586 8.926 l h
177.855 8.977 m 177.566 8.977 177.324 8.898 177.074 8.781 c 176.824 8.66
 176.582 8.488 176.391 8.293 c 176.203 8.094 176.062 7.906 175.953 7.656
 c 175.844 7.41 175.805 7.137 175.805 6.879 c 175.805 6.531 175.816 6.242
 175.902 6 c 175.992 5.754 176.113 5.531 176.246 5.367 c 176.379 5.203 176.539
 5.117 176.684 5.023 c 176.828 4.934 176.961 4.82 177.074 4.781 c 176.832
 4.73 l 176.539 4.535 l 176.344 4.293 l 176.246 4 l 176.246 3.855 176.277
 3.715 176.344 3.609 c 176.586 3.367 l 176.832 3.219 l 177.074 3.172 l 176.965
 3.164 176.812 3.094 176.637 3.023 c 176.457 2.957 176.316 2.898 176.148
 2.781 c 175.98 2.66 175.832 2.473 175.707 2.293 c 175.582 2.113 175.512
 1.938 175.512 1.707 c 175.512 1.469 175.539 1.227 175.66 1.023 c 175.781
 0.82 175.992 0.637 176.195 0.488 c 176.406 0.34 176.637 0.23 176.93 0.145
 c 177.223 0.059 177.52 0 177.855 0 c 178.234 0 178.57 0.039 178.879 0.145
 c 179.184 0.254 179.484 0.41 179.707 0.586 c 179.93 0.762 180.074 0.961
 180.195 1.172 c 180.316 1.379 180.391 1.598 180.391 1.805 c 180.391 2.078
 180.332 2.324 180.195 2.535 c 180.059 2.75 179.844 2.926 179.609 3.074 
c 179.375 3.223 179.133 3.336 178.832 3.414 c 178.527 3.488 178.184 3.512
 177.855 3.512 c 177.598 3.512 177.387 3.594 177.219 3.707 c 177.059 3.82
 176.977 3.922 176.977 4.098 c 177.074 4.34 l 177.316 4.488 l 177.609 4.633
 l 177.855 4.684 l 178.152 4.684 178.43 4.715 178.684 4.828 c 178.941 4.945
 179.184 5.117 179.367 5.316 c 179.555 5.52 179.703 5.777 179.805 6.047 
c 179.91 6.316 179.953 6.57 179.953 6.879 c 179.953 7.047 179.945 7.219 
179.902 7.367 c 179.863 7.516 179.809 7.641 179.758 7.754 c 179.609 8.047
 l 179.465 8.242 l 180.441 8.242 l 180.441 8.828 l 178.734 8.828 l 178.66
 8.855 178.555 8.891 178.391 8.926 c 178.227 8.965 178.039 8.977 177.855
 8.977 c h
126.148 8.828 m 126.148 4.684 l 126.148 4.418 126.172 4.148 126.246 3.902
 c 126.316 3.652 126.434 3.457 126.586 3.27 c 126.738 3.078 126.938 2.945
 127.172 2.828 c 127.41 2.711 127.668 2.633 128 2.633 c 128.215 2.633 128.406
 2.691 128.586 2.781 c 128.766 2.867 128.938 2.961 129.074 3.074 c 129.211
 3.184 129.328 3.301 129.414 3.414 c 129.562 3.656 l 129.562 2.781 l 130.344
 2.781 l 130.344 8.828 l 129.512 8.828 l 129.512 4.488 l 129.414 4.195 l
 129.074 3.805 l 128.945 3.676 128.801 3.562 128.637 3.465 c 128.469 3.363
 128.289 3.316 128.098 3.316 c 127.891 3.316 127.707 3.379 127.562 3.465
 c 127.418 3.547 127.309 3.625 127.219 3.754 c 127.133 3.887 127.066 4.07
 127.023 4.242 c 126.98 4.418 126.977 4.598 126.977 4.781 c 126.977 8.828
 l h
102 8.34 m 102.25 8.34 102.457 8.246 102.633 8.098 c 102.809 7.949 102.965
 7.766 103.074 7.562 c 103.18 7.352 103.266 7.117 103.316 6.879 c 103.367
 6.637 103.367 6.418 103.367 6.242 c 100.586 6.242 l 100.586 6.441 100.621
 6.688 100.684 6.926 c 100.742 7.16 100.812 7.352 100.926 7.562 c 101.039
 7.77 101.188 7.957 101.367 8.098 c 101.543 8.238 101.77 8.34 102 8.34 c
 h
146.684 8.34 m 146.93 8.34 147.141 8.246 147.316 8.098 c 147.496 7.949 
147.648 7.766 147.758 7.562 c 147.863 7.352 147.949 7.117 148 6.879 c 148.051
 6.637 148.098 6.418 148.098 6.242 c 145.316 6.242 l 145.316 6.441 145.355
 6.688 145.414 6.926 c 145.477 7.16 145.547 7.352 145.66 7.562 c 145.773
 7.77 145.922 7.957 146.098 8.098 c 146.273 8.238 146.449 8.34 146.684 8.34
 c h
168.195 8.34 m 168.445 8.34 168.652 8.246 168.832 8.098 c 169.008 7.949
 169.109 7.766 169.219 7.562 c 169.328 7.352 169.41 7.117 169.465 6.879 
c 169.516 6.637 169.562 6.418 169.562 6.242 c 166.781 6.242 l 166.781 6.441
 166.82 6.688 166.879 6.926 c 166.938 7.16 167.012 7.352 167.121 7.562 c
 167.234 7.77 167.383 7.957 167.562 8.098 c 167.738 8.238 167.965 8.34 168.195
 8.34 c h
177.855 8.34 m 178.242 8.34 178.562 8.219 178.781 7.949 c 179.004 7.684
 179.121 7.32 179.121 6.879 c 179.121 6.695 179.066 6.531 179.027 6.34 c
 178.98 6.152 178.93 5.957 178.832 5.805 c 178.73 5.656 178.598 5.512 178.441
 5.414 c 178.285 5.312 178.078 5.27 177.855 5.27 c 177.625 5.27 177.426 
5.332 177.27 5.414 c 177.113 5.5 177.027 5.613 176.93 5.754 c 176.832 5.898
 176.727 6.047 176.684 6.242 c 176.641 6.438 176.637 6.66 176.637 6.879 
c 176.637 7.07 176.676 7.238 176.734 7.414 c 176.789 7.594 176.871 7.766
 176.977 7.902 c 177.082 8.039 177.211 8.164 177.367 8.242 c 177.523 8.324
 177.664 8.34 177.855 8.34 c h
96.051 8.293 m 96.242 8.293 96.426 8.246 96.586 8.145 c 96.746 8.039 96.855
 7.891 96.977 7.758 c 97.098 7.621 97.195 7.5 97.27 7.367 c 97.414 7.074
 l 97.414 4.488 l 97.27 4.195 l 96.977 3.805 l 96.855 3.676 96.703 3.559
 96.539 3.465 c 96.375 3.367 96.227 3.316 96.051 3.316 c 95.77 3.316 95.512
 3.395 95.316 3.562 c 95.125 3.73 95 3.938 94.879 4.195 c 94.758 4.449 94.637
 4.762 94.586 5.074 c 94.535 5.387 94.539 5.672 94.539 5.953 c 94.539 6.273
 94.562 6.598 94.637 6.879 c 94.707 7.16 94.797 7.398 94.926 7.609 c 95.059
 7.824 95.23 7.977 95.414 8.098 c 95.598 8.219 95.816 8.293 96.051 8.293
 c h
162.293 8.293 m 162.559 8.293 162.789 8.188 162.977 8.047 c 163.164 7.906
 163.34 7.738 163.465 7.512 c 163.59 7.289 163.648 7.059 163.707 6.781 c
 163.77 6.504 163.805 6.215 163.805 5.949 c 163.805 5.672 163.789 5.387 
163.707 5.074 c 163.629 4.762 163.469 4.449 163.316 4.195 c 163.164 3.934
 163 3.73 162.781 3.562 c 162.559 3.391 162.332 3.316 162.051 3.316 c 161.758
 3.367 l 161.414 3.367 l 161.121 3.414 l 160.93 3.465 l 160.93 7.121 l 161.074
 7.414 l 161.367 7.805 l 161.496 7.926 161.652 8.047 161.805 8.145 c 161.965
 8.242 162.133 8.293 162.293 8.293 c h
112.051 6.828 m 112.051 6.047 l 114.586 6.047 l 114.586 6.828 l h
82.73 6.633 m 84.051 6.633 l 84.555 6.633 84.949 6.512 85.27 6.242 c 85.586
 5.977 85.758 5.586 85.758 5.121 c 85.758 4.883 85.699 4.688 85.609 4.488
 c 85.523 4.285 85.379 4.094 85.219 3.949 c 85.062 3.805 84.891 3.691 84.684
 3.609 c 84.477 3.531 84.281 3.512 84.051 3.512 c 82.73 3.512 l h
91.172 5.902 m 91.172 4.438 l 90.977 4.047 l 90.879 3.914 90.773 3.824 
90.633 3.707 c 90.496 3.594 90.32 3.492 90.148 3.414 c 89.973 3.34 89.797
 3.27 89.609 3.27 c 89.312 3.27 89.082 3.367 88.879 3.562 c 88.672 3.754
 88.586 4.051 88.586 4.391 c 88.586 4.559 88.629 4.688 88.73 4.828 c 88.836
 4.973 88.965 5.109 89.121 5.219 c 89.281 5.332 89.465 5.43 89.66 5.512 
c 89.852 5.59 90.027 5.668 90.195 5.707 c h
177.855 2.879 m 178.336 2.879 178.758 2.789 179.074 2.586 c 179.391 2.379
 179.562 2.117 179.562 1.805 c 179.562 1.664 179.5 1.504 179.414 1.367 c
 179.328 1.227 179.223 1.082 179.074 0.977 c 178.922 0.867 178.738 0.801
 178.539 0.73 c 178.34 0.664 178.098 0.633 177.855 0.633 c 177.625 0.633
 177.414 0.668 177.219 0.73 c 177.031 0.793 176.871 0.867 176.734 0.977 
c 176.598 1.086 176.516 1.227 176.441 1.367 c 176.367 1.504 176.293 1.656
 176.293 1.805 c 176.293 1.957 176.352 2.113 176.441 2.242 c 176.527 2.375
 176.637 2.488 176.781 2.586 c 176.926 2.68 177.082 2.723 177.27 2.781 c
 177.457 2.836 177.656 2.879 177.855 2.879 c h
177.855 2.879 m f
0.886275 0 0.101961 rg
82.926 63.367 m 82.578 63.367 82.305 63.297 82.098 63.074 c 81.895 62.855
 81.805 62.543 81.805 62.195 c 81.805 32.926 l 81.805 32.578 81.895 32.32
 82.098 32.098 c 82.301 31.879 82.578 31.754 82.926 31.754 c 90.879 31.754
 l 93.059 31.754 95.008 32.152 96.781 32.977 c 98.559 33.793 100.086 34.969
 101.316 36.438 c 102.551 37.91 103.516 39.637 104.195 41.66 c 104.875 43.68
 105.172 45.871 105.172 48.242 c 105.172 50.516 104.844 52.594 104.148 54.438
 c 103.453 56.289 102.473 57.891 101.219 59.219 c 99.973 60.547 98.457 61.566
 96.684 62.293 c 94.914 63.02 92.98 63.367 90.828 63.367 c h
111.707 63.367 m 111.363 63.367 111.086 63.297 110.879 63.074 c 110.676
 62.855 110.539 62.543 110.539 62.195 c 110.539 32.926 l 110.539 32.578 
110.676 32.32 110.879 32.098 c 111.086 31.879 111.363 31.754 111.707 31.754
 c 114.977 31.754 l 115.32 31.754 115.59 31.875 115.805 32.098 c 116.027
 32.316 116.148 32.578 116.148 32.926 c 116.148 45.949 l 127.074 45.949 
l 127.074 32.926 l 127.074 32.578 127.211 32.316 127.414 32.098 c 127.617
 31.875 127.848 31.754 128.195 31.754 c 131.465 31.754 l 131.812 31.754 
132.121 31.879 132.344 32.098 c 132.562 32.32 132.684 32.578 132.684 32.926
 c 132.684 62.195 l 132.684 62.543 132.562 62.855 132.344 63.074 c 132.121
 63.297 131.812 63.367 131.465 63.367 c 128.195 63.367 l 127.848 63.367 
127.617 63.297 127.414 63.074 c 127.211 62.855 127.074 62.543 127.074 62.195
 c 127.074 50.586 l 116.148 50.586 l 116.148 62.195 l 116.148 62.543 116.027
 62.855 115.805 63.074 c 115.59 63.297 115.32 63.367 114.977 63.367 c h
87.367 58.977 m 90.926 58.977 l 92.258 58.977 93.441 58.699 94.488 58.145
 c 95.531 57.59 96.43 56.852 97.172 55.902 c 97.914 54.953 98.496 53.801
 98.879 52.488 c 99.258 51.176 99.414 49.762 99.414 48.242 c 99.414 46.473
 99.242 44.891 98.828 43.414 c 98.418 41.945 97.801 40.637 97.023 39.562
 c 96.25 38.484 95.32 37.676 94.246 37.074 c 93.164 36.473 91.961 36.145
 90.633 36.145 c 87.367 36.145 l h
87.367 58.977 m f
Q Q
showpage
%%Trailer
end restore
%%EOF
