%!PS-Adobe-3.0 EPSF-3.0
%%BoundingBox: 0 0 431 331
%%Creator: yExport 1.5
%%Producer: org.freehep.graphicsio.ps.EPSGraphics2D Revision: 12753 
%%For: 
%%Title: 
%%CreationDate: Freitag, 9. September 2016 12:57 Uhr MESZ
%%LanguageLevel: 3
%%EndComments
%%BeginProlog
100 dict dup begin

%
% File: org/freehep/graphicsio.ps/PSProlog.txt
% Author: Charles Loomis
%

% Redefinitions which save some space in the output file.  These are also
% the same as the PDF operators.
/q {gsave} def
/Q {grestore} def

/n {newpath} def
/m {moveto} def
/l {lineto} def
/c {curveto} def
/h {closepath} def

/re {4 -2 roll moveto
     dup 0 exch rlineto exch 0 rlineto
     neg 0 exch rlineto closepath} def

/f {fill} def
/f* {eofill} def
/F {gsave vg&FC fill grestore} def
/F* {gsave vg&FC eofill grestore} def

/s {closepath stroke} def
/S {stroke} def

/b {closepath gsave vg&FC fill grestore
    gsave stroke grestore newpath} def
/B {gsave vg&FC fill grestore gsave stroke grestore newpath} def
/b* {closepath gsave vg&FC eofill grestore
    gsave stroke grestore newpath} def
/B* {gsave vg&FC eofill grestore gsave stroke grestore newpath} def

/g {1 array astore /vg&fcolor exch def} def
/G {setgray} def
/k {4 array astore /vg&fcolor exch def} def
/K {setcmykcolor} def
/rg {3 array astore /vg&fcolor exch def} def
/RG {setrgbcolor} def

% Initialize the fill color.
0 0 0 rg

/vg&FC {mark vg&fcolor aload pop
        counttomark 1 eq {G} if
        counttomark 3 eq {RG} if
        counttomark 4 eq {K} if
        cleartomark } def

/vg&DFC {/vg&fcolor exch def} def

/vg&C {mark exch aload pop
       counttomark 1 eq {G} if
       counttomark 3 eq {RG} if
       counttomark 4 eq {K} if
       cleartomark } def

/w {setlinewidth} def
/j {setlinejoin} def
/J {setlinecap} def
/M {setmiterlimit} def
/d {setdash} def
/i {setflat} def

/W {clip} def
/W* {eoclip} def

% Setup the default graphics state.
% (black; 1 pt. linewidth; miter join; butt-ends; solid)
/defaultGraphicsState {0 g 1 w 0 j 0 J [] 0 d} def

% Emulation of the rectangle operators for PostScript implementations
% which do not implement all Level 2 features.  This is an INCOMPLETE
% emulation; only the "x y width height rect..." form is emulated.
/*rf {gsave newpath re fill grestore} def
/*rs {gsave newpath re stroke grestore} def
/*rc {newpath re clip} def
/rf  /rectfill where {pop /rectfill}{/*rf} ifelse load def
/rs  /rectstroke where {pop /rectstroke}{/*rs} ifelse load def
/rc  /rectclip where {pop /rectclip}{/*rc} ifelse load def

% Emulation of the selectfont operator.  This includes a 20% increase in
% the fontsize which is necessary to get sizes similar to the Java fonts.
/*sf {exch findfont exch
      dup type /arraytype eq {makefont}{scalefont} ifelse setfont} bind def
/sf /selectfont where {pop {1.2 mul selectfont}}{{1.2 mul *sf}} ifelse def

% Special version of stroke which allows the dash pattern to continue
% across path segments.  (This may be needed for PostScript although
% modern printers seem to do this correctly.)
/vg&stroke {
  currentdash pop length 0 eq
  {stroke}
  {
    currentdash /vg&doffset exch def pop
    flattenpath
    {m vg&resetdash}
    {2 copy
     currentpoint
     3 -1 roll sub dup mul
     3 1 roll sub dup mul
     add sqrt
     3 1 roll l
     currentdash 3 -1 roll add setdash}
     {}
     {h vg&resetdash}
     pathforall
     stroke
     vg&resetdash
  } ifelse
} def
/vg&resetdash {currentdash pop vg&doffset setdash} def

% Initialize variables for safety.
/delta 0 def
/xv 0 def  /yv 0 def  /width 0 def  /height 0 def

% Initialize to portrait INTERNATIONAL (Letter-height, A4-width) page.
/pw 595 def  /ph 791  def  /po true def /ftp false def

% Initialize margins to 20 points.
/ml 20 def  /mr 20 def  /mt 20 def  /mb 20 def

% Temporary matrices.
/smatrix 0 def  /nmatrix 0 def

% set page size (usage: <page width><page height> setpagesize)
/setpagesize {/ph exch def /pw exch def} def

% set page orientation (usage: portrait or landscape)
/portrait {/po true def} def
/landscape {/po false def} def

% force natural size for image (usage: naturalsize)
/naturalsize {/ftp false def} def

% resize image to fill page (usage: fittopage)
/fittopage {/ftp true def} def

% set margins of the page (usage: <left><bottom><top><right> setmargins)
/setmargins {/mr exch def /mt exch def /mb exch def /ml exch def} def

% set the graphic's size (usage: <width><height> setsize)
/setsize {/gh exch def /gw exch def} def

% set the graphic's origin (usage: <x0><y0> setorigin)
/setorigin {/gy exch def /gx exch def} def

% calculate image center
/imagecenter {pw ml sub mr sub 2 div ml add
              ph mt sub mb sub 2 div mb add} def

% calculate the necessary scaling
/imagescale {po {gw}{gh} ifelse pw ml sub mr sub div
             po {gh}{gw} ifelse ph mt sub mb sub div
             2 copy lt {exch} if pop
             ftp not {1 2 copy lt {exch} if pop} if
             1 exch div /sfactor exch def
             /gw gw sfactor mul def /gh gh sfactor mul def} def

% calculate image origin
/imageorigin {pw ml sub mr sub 2 div ml add
              po {gw}{gh} ifelse 2 div sub
              ph mt sub mb sub 2 div mb add
              po {gh}{gw} ifelse 2 div po {add}{sub} ifelse} def

% calculate the clipping origin
/cliporigin  {pw ml sub mr sub 2 div ml add
              po {gw}{gh} ifelse 2 div sub floor
              ph mt sub mb sub 2 div mb add
              po {gh}{gw} ifelse 2 div sub floor} def

% Set the clipping region to the bounding box.
/cliptobounds {cliporigin po {gw}{gh} ifelse 1 add
                          po {gh}{gw} ifelse 1 add rc} def

% set the base transformation matrix (usage: setbasematrix)
/setbasematrix {imageorigin translate
                po {0}{90} ifelse rotate
                sfactor sfactor neg scale
                /defaultmatrix matrix currentmatrix def} def

% The lower-right bias in drawing 1 pt. wide lines.
/bias  {q 0.5 0.5 translate} def
/unbias {Q} def

% Define the composite fonts used to print Unicode strings.
% Undefine particular values in an encoding array.
/vg&undef { {exch dup 3 -1 roll /.notdef put} forall } def
/vg&redef { {3 -1 roll dup 4 2 roll put} forall } def

% usage: key encoding basefontname vg&newbasefont font
/vg&newbasefont {
findfont dup length dict copy
  begin
    currentdict /FID undef
    /Encoding exch def
    dup /FontName exch def
    currentdict
  end
definefont
} def

% usage: key encoding basefontname vg&newskewedbasefont font
/vg&newskewedbasefont {
findfont dup length dict copy
  begin
    currentdict /FID undef
    /Encoding exch def
    dup /FontName exch def
    exch FontMatrix exch matrix concatmatrix /FontMatrix exch def
    currentdict
  end
definefont
} def

% usage: basekey suffix vg&nconcat name
/vg&nconcat {
  2 {dup length string cvs exch} repeat
  dup length 3 -1 roll dup length 3 -1 roll add string
  dup 0 4 -1 roll dup length 5 1 roll putinterval
  dup 4 -2 roll exch putinterval cvn
} def

%usage: fontname vg&skewmatrix matrix
/vg&skewmatrix {
findfont dup /FontInfo known
  {
    /FontInfo get dup /ItalicAngle known
    {
      [ 1 0 4 -1 roll /ItalicAngle get neg dup sin exch cos div 1 0 0 ]
    }
    {pop matrix} ifelse
  }
  {pop matrix} ifelse
} def

% usage: newfontname basefontname vg&newcompositefont --
/vg&newcompositefont {
/vg&fstyle exch def
/vg&bfont exch def
/vg&fname exch def
<<
/FontStyleBits vg&fstyle
/FontType 0
/FontMatrix matrix
/FontName vg&fname
/FMapType 2
/Encoding [ 0 1 255 {pop 6} for ]
          dup 16#00 0 put % Latin
          dup 16#03 1 put % Greek
          dup 16#20 2 put % Punctuation
          dup 16#21 3 put % Arrows
          dup 16#22 4 put % MathOps
          dup 16#27 5 put % Dingbats

/FDepVector [
vg&bfont /-UC-Latin vg&nconcat UCLatinEncoding
vg&bfont vg&newbasefont

vg&bfont vg&skewmatrix
vg&bfont /-UC-Greek vg&nconcat UCGreekEncoding
/Symbol vg&newskewedbasefont

vg&bfont /-UC-Punctuation vg&nconcat UCPunctuationEncoding
vg&bfont vg&newbasefont

/Arrows-UC findfont
/MathOps-UC findfont
/Dingbats-UC findfont
/Undefined-UC findfont ]
>>
vg&fname exch definefont pop
} def

% Null encoding vector (all elements set to .notdef)
/NullEncoding [ 256 {/.notdef} repeat ] def

% Unicode Latin encoding (unicode codes \u0000-\u00ff)
/UCLatinEncoding
  ISOLatin1Encoding dup length array copy
  dup 16#60 /grave put
  [ 16#90 16#91 16#92 16#93 16#94 16#95 16#96
    16#97 16#98 16#9a 16#9b 16#9d 16#9e 16#9f
  ] vg&undef
  def

% Unicode Greek encoding (unicode codes \u0370-\u03ff)
/UCGreekEncoding
  NullEncoding dup length array copy
  << 16#91 /Alpha    16#92 /Beta      16#93 /Gamma    16#94 /Delta
     16#95 /Epsilon  16#96 /Zeta      16#97 /Eta      16#98 /Theta
     16#99 /Iota     16#9a /Kappa     16#9b /Lambda   16#9c /Mu
     16#9d /Nu       16#9e /Xi        16#9f /Omicron  16#a0 /Pi
     16#a1 /Rho      16#a3 /Sigma     16#a4 /Tau      16#a5 /Upsilon
     16#a6 /Phi      16#a7 /Chi       16#a8 /Psi      16#a9 /Omega
     16#b1 /alpha    16#b2 /beta      16#b3 /gamma    16#b4 /delta
     16#b5 /epsilon  16#b6 /zeta      16#b7 /eta      16#b8 /theta
     16#b9 /iota     16#ba /kappa     16#bb /lambda   16#bc /mu
     16#bd /nu       16#be /xi        16#bf /omicron  16#c0 /pi
     16#c1 /rho      16#c2 /sigma1    16#c3 /sigma    16#c4 /tau
     16#c5 /upsilon  16#c6 /phi1      16#c7 /chi      16#c8 /psi
     16#c9 /omega    16#7e /semicolon 16#87 /dotmath  16#d1 /theta1
     16#d2 /Upsilon1 16#d5 /phi       16#d6 /omega1
  >> vg&redef
  def

% Unicode punctuation encoding (unicode codes \u2000-\u206f)
/UCPunctuationEncoding
  NullEncoding dup length array copy
  << 16#10 /hyphen          16#11 /hyphen              16#12 /endash
     16#13 /emdash          16#18 /quoteleft           16#19 /quoteright
     16#1a /quotesinglbase  16#1b /quotesingle         16#1c /quotedblleft
     16#1d /quotedblright   16#1e /quotedblbase        16#1f /quotedbl
     16#20 /dagger          16#21 /daggerdbl           16#22 /bullet
     16#24 /period          16#26 /ellipsis            16#27 /periodcentered
     16#30 /perthousand     16#44 /fraction
     16#70 /zerosuperior    16#74 /foursuperior        16#75 /fivesuperior
     16#76 /sixsuperior     16#77 /sevensuperior       16#78 /eightsuperior
     16#79 /ninesuperior    16#7b /hyphensuperior      16#7d /parenleftsuperior
     16#7e /parenrightsuperior
     16#80 /zeroinferior    16#84 /fourinferior        16#85 /fiveinferior
     16#81 /oneinferior     16#82 /twoinferior         16#83 /threeinferior
     16#86 /sixinferior     16#87 /seveninferior       16#88 /eightinferior
     16#89 /nineinferior    16#8b /hypheninferior      16#8d /parenleftinferior
     16#8e /parenrightinferior
  >> vg&redef
  def

% Unicode mathematical operators encoding (unicode codes \u2200-\u22ff)
/UCMathOpsEncoding
  NullEncoding dup length array copy
  << 16#00 /universal       16#02 /partialdiff         16#03 /existential
     16#05 /emptyset        16#06 /Delta               16#07 /gradient
     16#08 /element         16#09 /notelement          16#0b /suchthat
     16#0f /product         16#11 /summation           16#12 /minus
     16#15 /fraction        16#17 /asteriskmath        16#19 /bullet
     16#1a /radical         16#1d /proportional        16#1e /infinity
     16#20 /angle           16#23 /bar                 16#27 /logicaland
     16#28 /logicalor       16#29 /intersection        16#2a /union
     16#2b /integral        16#34 /therefore           16#36 /colon
     16#3c /similar         16#45 /congruent           16#48 /approxequal
     16#60 /notequal        16#61 /equivalence         16#64 /lessequal
     16#65 /greaterequal    16#82 /propersubset        16#83 /propersuperset
     16#86 /reflexsubset    16#87 /reflexsuperset      16#95 /circleplus
     16#97 /circlemultiply  16#a5 /perpendicular       16#03 /existential
     16#c0 /logicaland      16#c1 /logicalor           16#c2 /intersection
     16#c3 /union           16#c4 /diamond             16#c5 /dotmath
  >> vg&redef
  def

% Unicode arrows encoding (unicode codes \u2190-\u21ff)
% Also includes those "Letterlike" unicode characters
% which are available in the symbol font. (unicode codes \u2100-\u214f)
/UCArrowsEncoding
  NullEncoding dup length array copy
  << 16#11 /Ifraktur        16#1c /Rfraktur            16#22 /trademarkserif
     16#35 /aleph
     16#90 /arrowleft       16#91 /arrowup             16#92 /arrowright
     16#93 /arrowdown       16#94 /arrowboth           16#d0 /arrowdblleft
     16#d1 /arrowdblup      16#d2 /arrowdblright       16#d3 /arrowdbldown
     16#d4 /arrowdblboth
  >> vg&redef
  def

/ZapfDingbats findfont /Encoding get
dup length array copy /UCDingbatsEncoding exch def
16#20 1 16#7f {
  dup 16#20 sub exch
  UCDingbatsEncoding exch get
  UCDingbatsEncoding 3 1 roll put
} for
16#a0 1 16#ff {
  dup 16#40 sub exch
  UCDingbatsEncoding exch get
  UCDingbatsEncoding 3 1 roll put
} for
UCDingbatsEncoding [ 16#c0 1 16#ff {} for ] vg&undef
[ 16#00  16#05 16#0a 16#0b  16#28 16#4c 16#4e  16#53 16#54 16#55  16#57 16#5f
  16#60  16#68 16#69 16#6a  16#6b 16#6c 16#6d  16#6e 16#6f 16#70  16#71 16#72
  16#73  16#74 16#75 16#95  16#96 16#97 16#b0  16#bf
] vg&undef pop

% Define the base fonts which don't change.
/Undefined-UC NullEncoding       /Helvetica    vg&newbasefont pop
/MathOps-UC   UCMathOpsEncoding  /Symbol       vg&newbasefont pop
/Arrows-UC    UCArrowsEncoding   /Symbol       vg&newbasefont pop
/Dingbats-UC  UCDingbatsEncoding /ZapfDingbats vg&newbasefont pop

% Make the SansSerif composite fonts.
/SansSerif /Helvetica 16#00 vg&newcompositefont
/SansSerif-Bold /Helvetica-Bold 16#01 vg&newcompositefont
/SansSerif-Italic /Helvetica-Oblique 16#02 vg&newcompositefont
/SansSerif-BoldItalic /Helvetica-BoldOblique 16#03 vg&newcompositefont

% Make the Serif composite fonts.
/Serif /Times-Roman 16#00 vg&newcompositefont
/Serif-Bold /Times-Bold 16#01 vg&newcompositefont
/Serif-Italic /Times-Italic 16#02 vg&newcompositefont
/Serif-BoldItalic /Times-BoldItalic 16#03 vg&newcompositefont

% Make the Monospaced composite fonts.
/Monospaced /Courier 16#00 vg&newcompositefont
/Monospaced-Bold /Courier-Bold 16#01 vg&newcompositefont
/Monospaced-Italic /Courier-Oblique 16#02 vg&newcompositefont
/Monospaced-BoldItalic /Courier-BoldOblique 16#03 vg&newcompositefont

% Make the Dialog composite fonts.
/Dialog /Helvetica 16#00 vg&newcompositefont
/Dialog-Bold /Helvetica-Bold 16#01 vg&newcompositefont
/Dialog-Italic /Helvetica-Oblique 16#02 vg&newcompositefont
/Dialog-BoldItalic /Helvetica-BoldOblique 16#03 vg&newcompositefont

% Make the DialogInput composite fonts.
/DialogInput /Courier 16#00 vg&newcompositefont
/DialogInput-Bold /Courier-Bold 16#01 vg&newcompositefont
/DialogInput-Italic /Courier-Oblique 16#02 vg&newcompositefont
/DialogInput-BoldItalic /Courier-BoldOblique 16#03 vg&newcompositefont

% Make the Typewriter composite fonts (JDK 1.1 only).
/Typewriter /Courier 16#00 vg&newcompositefont
/Typewriter-Bold /Courier-Bold 16#01 vg&newcompositefont
/Typewriter-Italic /Courier-Oblique 16#02 vg&newcompositefont
/Typewriter-BoldItalic /Courier-BoldOblique 16#03 vg&newcompositefont


/cfontH {
 dup /fontsize exch def /SansSerif exch sf
 /vg&fontstyles [{cfontH} {cfontHB} {cfontHI} {cfontHBI}] def
} def
/cfontHB {
  dup /fontsize exch def /SansSerif-Bold exch sf
 /vg&fontstyles [{cfontH} {cfontHB} {cfontHI} {cfontHBI}] def
} def
/cfontHI {
 dup /fontsize exch def /SansSerif-Italic exch sf
 /vg&fontstyles [{cfontH} {cfontHB} {cfontHI} {cfontHBI}] def
} def
/cfontHBI {
 dup /fontsize exch def /SansSerif-BoldItalic exch sf
 /vg&fontstyles [{cfontH} {cfontHB} {cfontHI} {cfontHBI}] def
} def

/cfontT {
 dup /fontsize exch def /Serif exch sf
 /vg&fontstyles [{cfontT} {cfontTB} {cfontTI} {cfontTBI}] def
} def
/cfontTB {
 dup /fontsize exch def /Serif-Bold exch sf
 /vg&fontstyles [{cfontT} {cfontTB} {cfontTI} {cfontTBI}] def
} def
/cfontTI {
 dup /fontsize exch def /Serif-Italic exch sf
 /vg&fontstyles [{cfontT} {cfontTB} {cfontTI} {cfontTBI}] def
} def
/cfontTBI {
 dup /fontsize exch def /Serif-BoldItalic exch sf
 /vg&fontstyles [{cfontT} {cfontTB} {cfontTI} {cfontTBI}] def
} def

/cfontC {
 dup /fontsize exch def /Typewriter exch sf
 /vg&fontstyles [{cfontC} {cfontCB} {cfontCI} {cfontCBI}] def
} def
/cfontCB {
 dup /fontsize exch def /Typewriter-Bold exch sf
 /vg&fontstyles [{cfontC} {cfontCB} {cfontCI} {cfontCBI}] def
} def
/cfontCI {
 dup /fontsize exch def /Typewriter-Italic exch sf
 /vg&fontstyles [{cfontC} {cfontCB} {cfontCI} {cfontCBI}] def
} def
/cfontCBI {
 dup /fontsize exch def /Typewriter-BoldItalic exch sf
 /vg&fontstyles [{cfontC} {cfontCB} {cfontCI} {cfontCBI}] def
} def

% Darken or lighten the current color.
/darken {0.7 exch exp 3 copy
         q 4 -1 roll vg&C
         currentrgbcolor 3 {4 -2 roll mul} repeat
         3 array astore Q} def

/displayColorMap
<< /Cr   [1.00 0.00 0.00]       /Cg     [0.00 1.00 0.00]
   /Cb   [0.00 0.00 1.00]       /Cc     [1.00 0.00 0.00 0.00]
   /Cm   [0.00 1.00 0.00 0.00]  /Cy     [0.00 0.00 1.00 0.00]
   /Co   [1.00 0.78 0.00]       /Cp     [1.00 0.67 0.67]
   /Cw   [1   ]                 /Cgrl   [0.75]
   /Cgr  [0.50]                 /Cgrd   [0.25]
   /Ck   [0   ]
   /CGr  [1.00 0.00 0.00]       /CGg    [0.00 1.00 0.00]
   /CGb  [0.00 0.00 1.00]       /CGc    [1.00 0.00 0.00 0.00]
   /CGm  [0.00 1.00 0.00 0.00]  /CGy    [0.00 0.00 1.00 0.00]
   /CGo  [1.00 0.78 0.00]       /CGp    [1.00 0.67 0.67]
   /CGw  [1   ]                 /CGgrl  [0.75]
   /CGgr [0.50]                 /CGgrd  [0.25]
   /CGk  [0   ]
   /CIr  [1.00 0.00 0.00]       /CIg    [0.00 1.00 0.00]
   /CIb  [0.00 0.00 1.00]       /CIc    [1.00 0.00 0.00 0.00]
   /CIm  [0.00 1.00 0.00 0.00]  /CIy    [0.00 0.00 1.00 0.00]
   /CIo  [1.00 0.78 0.00]       /CIp    [1.00 0.67 0.67]
   /CIw  [1   ]                 /CIgrl  [0.75]
   /CIgr [0.50]                 /CIgrd  [0.25]
   /CIk  [0   ]
>> def

/printColorMap
<< /Cr   [1.00 0.33 0.33]       /Cg     [0.33 1.00 0.33]
   /Cb   [0.33 0.33 1.00]       /Cc     [1.00 0.00 0.00 0.00]
   /Cm   [0.00 1.00 0.00 0.00]  /Cy     [0.00 0.00 1.00 0.00]
   /Co   [1.00 0.78 0.00]       /Cp     [1.00 0.67 0.67]
   /Cw   [1   ]                 /Cgrl   [0.75]
   /Cgr  [0.50]                 /Cgrd   [0.25]
   /Ck   [0   ]
   /CGr  [1.00 0.33 0.33]       /CGg    [0.33 1.00 0.33]
   /CGb  [0.33 0.33 1.00]       /CGc    [1.00 0.00 0.00 0.00]
   /CGm  [0.00 1.00 0.00 0.00]  /CGy    [0.00 0.00 1.00 0.00]
   /CGo  [1.00 0.78 0.00]       /CGp    [1.00 0.67 0.67]
   /CGw  [1   ]                 /CGgrl  [0.75]
   /CGgr [0.50]                 /CGgrd  [0.25]
   /CGk  [0   ]
   /CIr  [1.00 0.33 0.33]       /CIg    [0.33 1.00 0.33]
   /CIb  [0.33 0.33 1.00]       /CIc    [1.00 0.00 0.00 0.00]
   /CIm  [0.00 1.00 0.00 0.00]  /CIy    [0.00 0.00 1.00 0.00]
   /CIo  [1.00 0.78 0.00]       /CIp    [1.00 0.67 0.67]
   /CIw  [1   ]                 /CIgrl  [0.75]
   /CIgr [0.50]                 /CIgrd  [0.25]
   /CIk  [0   ]
>> def

/grayColorMap
<< /Cr   [0   ]                 /Cg     [0   ]
   /Cb   [0   ]                 /Cc     [0   ]
   /Cm   [0   ]                 /Cy     [0   ]
   /Co   [0   ]                 /Cp     [0   ]
   /Cw   [0   ]                 /Cgrl   [0   ]
   /Cgr  [0   ]                 /Cgrd   [0   ]
   /Ck   [0   ]
   /CGr  [0.75]                 /CGg    [1   ]
   /CGb  [0.50]                 /CGc    [0.75]
   /CGm  [0.50]                 /CGy    [1   ]
   /CGo  [0.75]                 /CGp    [1   ]
   /CGw  [0   ]                 /CGgrl  [0.25]
   /CGgr [0.50]                 /CGgrd  [0.75]
   /CGk  [1   ]
   /CIr  [1   ]                 /CIg    [1   ]
   /CIb  [1   ]                 /CIc    [1   ]
   /CIm  [1   ]                 /CIy    [1   ]
   /CIo  [1   ]                 /CIp    [1   ]
   /CIw  [1   ]                 /CIgrl  [1   ]
   /CIgr [1   ]                 /CIgrd  [1   ]
   /CIk  [1   ]
>> def

/bwColorMap
<< /Cr   [0   ]                 /Cg     [0   ]
   /Cb   [0   ]                 /Cc     [0   ]
   /Cm   [0   ]                 /Cy     [0   ]
   /Co   [0   ]                 /Cp     [0   ]
   /Cw   [0   ]                 /Cgrl   [0   ]
   /Cgr  [0   ]                 /Cgrd   [0   ]
   /Ck   [0   ]
   /CGr  [1   ]                 /CGg    [1   ]
   /CGb  [1   ]                 /CGc    [1   ]
   /CGm  [1   ]                 /CGy    [1   ]
   /CGo  [1   ]                 /CGp    [1   ]
   /CGw  [0   ]                 /CGgrl  [1   ]
   /CGgr [1   ]                 /CGgrd  [1   ]
   /CGk  [1   ]
   /CIr  [1   ]                 /CIg    [1   ]
   /CIb  [1   ]                 /CIc    [1   ]
   /CIm  [1   ]                 /CIy    [1   ]
   /CIo  [1   ]                 /CIp    [1   ]
   /CIw  [1   ]                 /CIgrl  [1   ]
   /CIgr [1   ]                 /CIgrd  [1   ]
   /CIk  [1   ]
>> def

%
% The following routines handle the alignment of and printing of
% tagged strings.
%

% Predefine the bounding box values.
/bbllx 0 def /bblly 0 def /bburx 0 def /bbury 0 def

% This routine pops the first unicode character off of a string and returns
% the remainder of the string, the character code of first character,
% and a "true" if the string was non-zero length.
% <string>      popfirst <remaining string> <true>
% <null string> popfirst <false>
/popfirst {
  dup length 1 gt
    {dup 0 get /vg&fbyte exch def
     dup 1 get /vg&cbyte exch def
     dup length 2 sub 2 exch getinterval true}
    {pop false} ifelse
} def

% This routine shows a single unicode character given the font and
% character codes.
% <font code> <char code> unicharshow --
/unicharshow {
  2 string
  dup 0 5 -1 roll put
  dup 1 4 -1 roll put
  internalshow
} def

% This is an internal routine to alternate between determining the
% bounding box for stringsize and showing the string for recshow.
% <string> internalshow --
/internalshow {show} def

% This is an internal routine to alternate between determining the
% bounding box for stringsize and stroking various ornaments.
% <string> internalstroke --
/internalstroke {S} def

% Sets up internalshow to use the null device to determine string size.
% -- nullinternalshow --
/nullinternalshow {/internalshow {false charpath flattenpath
                                  pathbbox updatebbox} def} def

% Sets up internalstroke to use the null device to determine string size.
% -- nullinternalstroke --
/nullinternalstroke {
 /internalstroke {flattenpath pathbbox updatebbox} def} def

% This routine tests to see if the character code matches the first
% character of a string.
% <char code> <string> testchar <char code> <true or false>
/testchar {exch dup 3 -1 roll 0 get eq} def

% Raise the text baseline for superscripts.
% -- raise --
/raise {
  0 fontsize 2 div rmoveto
  /fontsize fontsize 2 mul 3 div def
  currentfont /FontName get fontsize sf
} def

% Un-raise the text baseline for superscripts.
% -- unraise --
/unraise {
  /fontsize fontsize 1.5 mul def
  0 fontsize 2 div neg rmoveto
} def

% Lower the text baseline for subscripts.
% -- lower --
/lower {
  0 fontsize 3 div neg rmoveto
  /fontsize fontsize 2 mul 3 div def
  currentfont /FontName get fontsize sf
} def

% Un-lower the text baseline for subscripts.
% -- unlower --
/unlower {
  /fontsize fontsize 1.5 mul def
  0 fontsize 3 div rmoveto
} def

% Compare the top two elements on the stack and leave only the
% larger one.
/maxval {2 copy gt {pop} {exch pop} ifelse} def

% Tokenize a string.  Do not use the usual PostScript token because
% parentheses will not be interpreted correctly because of rescanning
% of the string.
/vg&token {/vg&string exch def /vg&index -1 def /vg&level 0 def
0 2 vg&string length 2 sub {
  dup dup 1 add exch vg&string exch get 8 bitshift vg&string 3 -1 roll get or
  dup 16#f0fe eq {pop 1}{16#f0ff eq {-1}{0} ifelse} ifelse
  /vg&level exch vg&level add def
  vg&level 0 eq {/vg&index exch def exit} if pop
} for
vg&index 0 ge {
  vg&string vg&index 2 add dup vg&string length exch sub getinterval
  vg&index 2 gt {vg&string 2 vg&index 2 sub getinterval}{()} ifelse
  true}
{false} ifelse
} bind def

% Recursively show an unicode string.
% <string> recshow --
/recshow {
  popfirst
  {
    % Test to see if this is a string attribute.
    vg&fbyte 16#f0 and 16#e0 eq
    {
      q

      % Font style.
      currentfont dup /FontStyleBits known {/FontStyleBits get}{pop 0} ifelse
      vg&cbyte or vg&fontstyles exch get fontsize exch exec

      vg&token pop recshow currentpoint Q m recshow
    }
    {
      vg&fbyte 16#F8 and 16#F0 eq {

        % Superscript and/or subscript.
        vg&cbyte 16#00 eq {
          vg&token pop exch vg&token pop 3 -1 roll
          q raise recshow unraise currentpoint pop Q exch
          q lower recshow unlower currentpoint pop Q
          maxval currentpoint exch pop m recshow } if

        % Strikeout.
        vg&cbyte 16#01 eq {
          vg&token pop currentpoint 3 -1 roll recshow
          q 0 J vg&underline vg&uthick w
          currentpoint 4 -2 roll fontsize 3 div add moveto
          fontsize 3 div add lineto internalstroke Q
          recshow} if

        % Underline.
        vg&cbyte 16#02 eq {
          vg&token pop currentpoint 3 -1 roll recshow
          q 0 J vg&underline vg&uthick w
          currentpoint 4 -2 roll vg&uoffset add moveto
          vg&uoffset add lineto internalstroke Q
          recshow} if

        % Dashed underline.
        vg&cbyte 16#03 eq {
          vg&token pop currentpoint 3 -1 roll recshow
          q 0 J [ vg&uthick 5 mul vg&uthick 2 mul] 0 d
          vg&underline vg&uthick w
          currentpoint 4 -2 roll vg&uoffset add moveto
          vg&uoffset add lineto internalstroke Q
          recshow} if

        % Dotted underline.
        vg&cbyte 16#04 eq {
          vg&token pop currentpoint 3 -1 roll recshow
          q 1 J [ 0 vg&uthick 3 mul] 0 d
          vg&underline vg&uthick w
          currentpoint 4 -2 roll vg&uoffset add moveto
          vg&uoffset add lineto internalstroke Q
          recshow} if

        % Thick underline.
        vg&cbyte 16#05 eq {
          vg&token pop currentpoint 3 -1 roll recshow
          q 0 J vg&underline vg&uthick 2 mul w
          currentpoint 4 -2 roll vg&uoffset vg&uthick 2 div sub add moveto
          vg&uoffset vg&uthick 2 div sub add lineto internalstroke Q
          recshow} if

        % Gray thick underline.
        vg&cbyte 16#06 eq {
          vg&token pop currentpoint 3 -1 roll recshow
          q 0 J vg&underline vg&uthick 2 mul w 0.5 setgray
          currentpoint 4 -2 roll vg&uoffset vg&uthick 2 div sub add moveto
          vg&uoffset vg&uthick 2 div sub add lineto internalstroke Q
          recshow} if

        % Overbar.
        vg&cbyte 16#07 eq {
          vg&token pop dup stringsize relative 4 1 roll pop pop exch
          3 -1 roll recshow
          q 0 J vg&underline vg&uthick w
          vg&uoffset neg add dup currentpoint pop exch m l internalstroke Q
          recshow} if
      }
      {
        vg&fbyte vg&cbyte unicharshow recshow
      } ifelse
    } ifelse
  } if
} def

% Get the underline position and thickness from the current font.
/vg&underline {

currentfont dup /FontType get 0 eq {/FDepVector get 0 get} if
dup dup /FontInfo known {
  /FontInfo get dup
  dup /UnderlinePosition known {
    /UnderlinePosition get /vg&uoffset exch def
  }
  {
    pop /vg&uoffset 0 def
  } ifelse
  dup /UnderlineThickness known {
    /UnderlineThickness get /vg&uthick exch def
  }
  {
    pop /vg&uthick 0 def
  } ifelse
}
{
  pop /vg&uoffset 0 def /vg&uthick 0 def
} ifelse
/FontMatrix get
currentfont dup /FontType get 0 eq
{/FontMatrix get matrix concatmatrix}{pop} ifelse
dup 0 vg&uoffset 3 -1 roll transform /vg&uoffset exch def pop
0 vg&uthick 3 -1 roll transform /vg&uthick exch def pop
} def

% Make a frame with the coordinates on the stack.
% <llx> <lly> <urx> <ury> frame --
/frame {4 copy m 3 1 roll exch l 4 -2 roll l l h} def

% Resets the accumulated bounding box to a degenerate box at the
% current point.
% -- resetbbox --
/resetbbox {
  currentpoint 2 copy
  /bbury exch def
  /bburx exch def
  /bblly exch def
  /bbllx exch def
} def

% Update the accumulated bounding box.
% <llx'> <lly'> <urx'> <ury'> updatebbox --
/updatebbox {
  dup bbury gt {/bbury exch def} {pop} ifelse
  dup bburx gt {/bburx exch def} {pop} ifelse
  dup bblly lt {/bblly exch def} {pop} ifelse
  dup bbllx lt {/bbllx exch def} {pop} ifelse
} def

% Set the bounding box to the values on the stack.
% <llx'> <lly'> <urx'> <ury'> updatebbox --
/restorebbox {
  /bbury exch def /bburx exch def /bblly exch def /bbllx exch def
} def

% Push the accumulated bounding box onto the stack.
% -- pushbbox <llx> <lly> <urx> <ury>
/pushbbox {bbllx bblly bburx bbury} def

% Make the relative bounding box relative to the currentpoint.
% <llx'> <lly'> <urx'> <ury'> inflate <llx> <lly> <urx> <ury>
/inflate {
  2 {fontsize 0.2 mul add 4 1 roll} repeat
  2 {fontsize 0.2 mul sub 4 1 roll} repeat
} def

% Make the relative bounding box relative to the currentpoint.
% <llx'> <lly'> <urx'> <ury'> relative <llx> <lly> <urx> <ury>
/relative {
  currentpoint 3 -1 roll add 3 1 roll add exch 4 2 roll
  currentpoint 3 -1 roll add 3 1 roll add exch 4 2 roll
} def

% Returns the size of a string appropriate for recshow.
% <string> stringsize <llx> <lly> <urx> <ury>
/stringsize {
  pushbbox /internalshow load /internalstroke load 7 -1 roll
  q
  nulldevice 0 0 m
  nullinternalshow nullinternalstroke
  resetbbox
  recshow
  /internalstroke exch def /internalshow exch def
  pushbbox 8 -4 roll restorebbox
  Q
} def

% Calculate values for string positioning.
/calcval {4 copy
  3 -1 roll sub /widy exch def sub neg /widx exch def
  pop pop /dy exch def /dx exch def} def

% Utilities to position a string.
% First letter (U=upper, C=center, B=baseline, L=lower)
% Second letter (L=left, C=center, R=right)
/align [
{calcval dx neg widy dy add neg rmoveto} % UL
{calcval dx neg widy 2 div dy add neg rmoveto} % CL
{calcval dx neg 0 rmoveto} % BL
{calcval dx neg dy neg rmoveto} % LL
{calcval widx dx add neg widy dy add neg rmoveto} % UR
{calcval widx dx add neg widy 2 div dy add neg rmoveto} % CR
{calcval widx dx add neg 0 rmoveto} % BR
{calcval widx dx add neg dy neg rmoveto} % LR
{calcval widx 2 div dx add neg widy dy add neg rmoveto} % UC
{calcval widx 2 div dx add neg widy 2 div dy add neg rmoveto} % CC
{calcval widx 2 div dx add neg 0 rmoveto} % BC
{calcval widx 2 div dx add neg dy neg rmoveto} % LC
] def

/vg&str {m q 1 -1 scale dup stringsize 4 copy align 11 -1 roll get exec
         q inflate relative frame exch exec Q recshow Q} def

end /procDict exch def
%%EndProlog

%%BeginSetup
save
procDict begin
printColorMap begin
431 331 setpagesize
0 0 0 0 setmargins
0 0 setorigin
431 331 setsize
naturalsize
portrait
imagescale
cliptobounds
setbasematrix
/Helvetica 10 sf
defaultGraphicsState
%%EndSetup

0.00000 0.00000 0.00000 RG
[ 1.00000 0.00000 0.00000 1.00000 0.00000 0.00000 ] defaultmatrix matrix concatmatrix setmatrix
cliprestore
1.00000 1.00000 1.00000 RG
newpath
0.00000 0.00000 m
431.000 0.00000 l
431.000 331.000 l
0.00000 331.000 l
0.00000 0.00000 l
h
f
0.00000 0.00000 0.00000 RG
0.00000 0.00000 0.00000 RG
[ 1.00000 0.00000 0.00000 1.00000 0.00000 0.00000 ] defaultmatrix matrix concatmatrix setmatrix
cliprestore
1.00000 1.00000 1.00000 RG
newpath
0.00000 0.00000 m
431.000 0.00000 l
431.000 331.000 l
0.00000 331.000 l
0.00000 0.00000 l
h
f
0.00000 0.00000 0.00000 RG
0 0 431 331 rc
q
[ 1.00000 0.00000 0.00000 1.00000 0.00000 0.00000 ] concat
[ 1.00000 0.00000 0.00000 1.00000 -559.000 -312.000 ] concat
1.00000 1.00000 1.00000 RG
newpath
559.000 312.000 m
990.000 312.000 l
990.000 643.000 l
559.000 643.000 l
559.000 312.000 l
h
f
0.00000 0.00000 0.00000 RG
[ 1.00000 0.00000 0.00000 1.00000 -559.000 -312.000 ] defaultmatrix matrix concatmatrix setmatrix
[ 1.00000 0.00000 0.00000 1.00000 -559.000 -312.000 ] defaultmatrix matrix concatmatrix setmatrix
[ 1.00000 0.00000 0.00000 1.00000 0.00000 0.00000 ] defaultmatrix matrix concatmatrix setmatrix
[ 1.00000 0.00000 0.00000 1.00000 -559.000 -312.000 ] defaultmatrix matrix concatmatrix setmatrix
0.00000 0.00000 1.00000 RG
newpath
974.500 477.500 m
974.500 560.343 884.957 627.500 774.500 627.500  c
664.043 627.500 574.500 560.343 574.500 477.500  c
574.500 394.657 664.043 327.500 774.500 327.500  c
884.957 327.500 974.500 394.657 974.500 477.500  c
h
f
1.00000 1.00000 1.00000 RG
0 J
1.45000 M
newpath
720.027 348.815 m
721.605 348.565 l
721.689 349.190 721.931 349.670 722.332 350.003  c
722.733 350.336 723.293 350.503 724.012 350.503  c
724.741 350.503 725.283 350.354 725.637 350.058  c
725.991 349.761 726.168 349.414 726.168 349.019  c
726.168 348.664 726.012 348.383 725.699 348.175  c
725.480 348.039 724.939 347.862 724.074 347.644  c
722.918 347.352 722.116 347.099 721.668 346.886  c
721.220 346.672 720.879 346.375 720.645 345.995  c
720.410 345.615 720.293 345.196 720.293 344.737  c
720.293 344.321 720.389 343.935 720.582 343.581  c
720.775 343.227 721.033 342.935 721.355 342.706  c
721.605 342.519 721.944 342.362 722.371 342.237  c
722.798 342.112 723.251 342.050 723.730 342.050  c
724.470 342.050 725.116 342.157 725.668 342.370  c
726.220 342.584 726.629 342.870 726.895 343.229  c
727.160 343.589 727.340 344.071 727.434 344.675  c
725.887 344.878 l
725.814 344.399 725.611 344.024 725.277 343.753  c
724.944 343.482 724.470 343.347 723.855 343.347  c
723.126 343.347 722.605 343.466 722.293 343.706  c
721.980 343.946 721.824 344.227 721.824 344.550  c
721.824 344.758 721.892 344.946 722.027 345.112  c
722.152 345.279 722.350 345.420 722.621 345.534  c
722.788 345.586 723.257 345.722 724.027 345.940  c
725.142 346.232 725.921 346.474 726.363 346.667  c
726.806 346.860 727.155 347.138 727.410 347.503  c
727.665 347.868 727.793 348.315 727.793 348.847  c
727.793 349.378 727.639 349.878 727.332 350.347  c
727.025 350.815 726.579 351.177 725.996 351.433  c
725.413 351.688 724.757 351.815 724.027 351.815  c
722.809 351.815 721.882 351.563 721.246 351.058  c
720.611 350.552 720.204 349.805 720.027 348.815  c
h
729.668 355.175 m
729.668 342.269 l
731.105 342.269 l
731.105 343.472 l
731.449 343.003 731.835 342.649 732.262 342.409  c
732.689 342.170 733.204 342.050 733.809 342.050  c
734.611 342.050 735.316 342.256 735.926 342.667  c
736.535 343.078 736.996 343.657 737.309 344.401  c
737.621 345.146 737.777 345.966 737.777 346.862  c
737.777 347.810 737.605 348.667 737.262 349.433  c
736.918 350.198 736.418 350.787 735.762 351.198  c
735.105 351.610 734.418 351.815 733.699 351.815  c
733.178 351.815 732.707 351.703 732.285 351.479  c
731.863 351.256 731.517 350.972 731.246 350.628  c
731.246 355.175 l
729.668 355.175 l
h
731.105 346.987 m
731.105 348.185 731.348 349.071 731.832 349.644  c
732.316 350.216 732.902 350.503 733.590 350.503  c
734.298 350.503 734.902 350.206 735.402 349.612  c
735.902 349.019 736.152 348.097 736.152 346.847  c
736.152 345.659 735.908 344.769 735.418 344.175  c
734.928 343.581 734.345 343.284 733.668 343.284  c
732.991 343.284 732.395 343.599 731.879 344.229  c
731.363 344.860 731.105 345.779 731.105 346.987  c
h
745.772 350.440 m
745.189 350.940 744.624 351.295 744.077 351.503  c
743.530 351.711 742.950 351.815 742.335 351.815  c
741.304 351.815 740.515 351.563 739.968 351.058  c
739.421 350.552 739.147 349.909 739.147 349.128  c
739.147 348.680 739.252 348.266 739.460 347.886  c
739.668 347.506 739.939 347.201 740.272 346.972  c
740.606 346.743 740.986 346.571 741.413 346.456  c
741.726 346.373 742.194 346.295 742.819 346.222  c
744.090 346.065 745.028 345.883 745.632 345.675  c
745.642 345.456 745.647 345.315 745.647 345.253  c
745.647 344.618 745.496 344.164 745.194 343.894  c
744.788 343.539 744.189 343.362 743.397 343.362  c
742.647 343.362 742.095 343.493 741.741 343.753  c
741.387 344.013 741.127 344.477 740.960 345.144  c
739.413 344.925 l
739.559 344.258 739.791 343.722 740.108 343.315  c
740.426 342.909 740.890 342.597 741.499 342.378  c
742.108 342.159 742.819 342.050 743.632 342.050  c
744.424 342.050 745.069 342.144 745.569 342.331  c
746.069 342.519 746.437 342.756 746.671 343.042  c
746.905 343.328 747.069 343.685 747.163 344.112  c
747.215 344.383 747.241 344.873 747.241 345.581  c
747.241 347.690 l
747.241 349.159 747.275 350.089 747.343 350.479  c
747.410 350.870 747.543 351.243 747.741 351.597  c
746.085 351.597 l
745.918 351.263 745.814 350.878 745.772 350.440  c
h
745.632 346.909 m
745.059 347.149 744.200 347.347 743.054 347.503  c
742.408 347.597 741.950 347.703 741.679 347.823  c
741.408 347.943 741.200 348.115 741.054 348.339  c
740.908 348.563 740.835 348.815 740.835 349.097  c
740.835 349.513 740.994 349.862 741.312 350.144  c
741.629 350.425 742.095 350.565 742.710 350.565  c
743.325 350.565 743.869 350.433 744.343 350.167  c
744.817 349.901 745.163 349.539 745.382 349.081  c
745.549 348.716 745.632 348.185 745.632 347.487  c
745.632 346.909 l
h
755.783 348.175 m
757.330 348.378 l
757.163 349.451 756.731 350.292 756.033 350.901  c
755.335 351.511 754.476 351.815 753.455 351.815  c
752.174 351.815 751.145 351.396 750.369 350.558  c
749.593 349.719 749.205 348.524 749.205 346.972  c
749.205 345.961 749.372 345.078 749.705 344.323  c
750.038 343.568 750.546 343.000 751.229 342.620  c
751.911 342.240 752.653 342.050 753.455 342.050  c
754.476 342.050 755.307 342.308 755.947 342.823  c
756.588 343.339 757.002 344.065 757.189 345.003  c
755.643 345.237 l
755.497 344.612 755.239 344.141 754.869 343.823  c
754.499 343.506 754.049 343.347 753.518 343.347  c
752.726 343.347 752.080 343.633 751.580 344.206  c
751.080 344.779 750.830 345.685 750.830 346.925  c
750.830 348.175 751.070 349.084 751.549 349.651  c
752.028 350.219 752.658 350.503 753.439 350.503  c
754.054 350.503 754.570 350.313 754.986 349.933  c
755.403 349.552 755.669 348.966 755.783 348.175  c
h
765.080 348.597 m
766.721 348.800 l
766.460 349.748 765.981 350.487 765.283 351.019  c
764.585 351.550 763.695 351.815 762.611 351.815  c
761.247 351.815 760.163 351.394 759.361 350.550  c
758.559 349.706 758.158 348.524 758.158 347.003  c
758.158 345.440 758.562 344.224 759.369 343.354  c
760.176 342.485 761.226 342.050 762.518 342.050  c
763.768 342.050 764.788 342.474 765.580 343.323  c
766.372 344.172 766.768 345.368 766.768 346.909  c
766.768 347.003 766.762 347.144 766.752 347.331  c
759.799 347.331 l
759.851 348.362 760.140 349.149 760.666 349.690  c
761.192 350.232 761.840 350.503 762.611 350.503  c
763.195 350.503 763.692 350.352 764.104 350.050  c
764.515 349.748 764.840 349.263 765.080 348.597  c
h
759.877 346.034 m
765.096 346.034 l
765.023 345.253 764.825 344.664 764.502 344.269  c
763.992 343.654 763.335 343.347 762.533 343.347  c
761.814 343.347 761.208 343.591 760.713 344.081  c
760.218 344.571 759.939 345.222 759.877 346.034  c
h
773.061 348.815 m
774.639 348.565 l
774.722 349.190 774.964 349.670 775.365 350.003  c
775.766 350.336 776.326 350.503 777.045 350.503  c
777.774 350.503 778.316 350.354 778.670 350.058  c
779.024 349.761 779.201 349.414 779.201 349.019  c
779.201 348.664 779.045 348.383 778.732 348.175  c
778.514 348.039 777.972 347.862 777.107 347.644  c
775.951 347.352 775.149 347.099 774.701 346.886  c
774.253 346.672 773.912 346.375 773.678 345.995  c
773.443 345.615 773.326 345.196 773.326 344.737  c
773.326 344.321 773.423 343.935 773.615 343.581  c
773.808 343.227 774.066 342.935 774.389 342.706  c
774.639 342.519 774.977 342.362 775.404 342.237  c
775.831 342.112 776.285 342.050 776.764 342.050  c
777.503 342.050 778.149 342.157 778.701 342.370  c
779.253 342.584 779.662 342.870 779.928 343.229  c
780.193 343.589 780.373 344.071 780.467 344.675  c
778.920 344.878 l
778.847 344.399 778.644 344.024 778.311 343.753  c
777.977 343.482 777.503 343.347 776.889 343.347  c
776.160 343.347 775.639 343.466 775.326 343.706  c
775.014 343.946 774.857 344.227 774.857 344.550  c
774.857 344.758 774.925 344.946 775.061 345.112  c
775.186 345.279 775.383 345.420 775.654 345.534  c
775.821 345.586 776.290 345.722 777.061 345.940  c
778.175 346.232 778.954 346.474 779.396 346.667  c
779.839 346.860 780.188 347.138 780.443 347.503  c
780.699 347.868 780.826 348.315 780.826 348.847  c
780.826 349.378 780.673 349.878 780.365 350.347  c
780.058 350.815 779.613 351.177 779.029 351.433  c
778.446 351.688 777.790 351.815 777.061 351.815  c
775.842 351.815 774.915 351.563 774.279 351.058  c
773.644 350.552 773.238 349.805 773.061 348.815  c
h
782.623 355.190 m
782.451 353.706 l
782.795 353.800 783.097 353.847 783.357 353.847  c
783.712 353.847 783.993 353.789 784.201 353.675  c
784.410 353.560 784.581 353.394 784.717 353.175  c
784.821 353.019 784.982 352.628 785.201 352.003  c
785.232 351.909 785.279 351.779 785.342 351.612  c
781.811 342.269 l
783.514 342.269 l
785.451 347.675 l
785.701 348.352 785.925 349.071 786.123 349.831  c
786.311 349.102 786.529 348.394 786.779 347.706  c
788.779 342.269 l
790.357 342.269 l
786.811 351.753 l
786.425 352.784 786.128 353.493 785.920 353.878  c
785.639 354.399 785.316 354.779 784.951 355.019  c
784.587 355.258 784.154 355.378 783.654 355.378  c
783.342 355.378 782.998 355.315 782.623 355.190  c
h
791.061 348.815 m
792.639 348.565 l
792.722 349.190 792.964 349.670 793.365 350.003  c
793.766 350.336 794.326 350.503 795.045 350.503  c
795.774 350.503 796.316 350.354 796.670 350.058  c
797.024 349.761 797.201 349.414 797.201 349.019  c
797.201 348.664 797.045 348.383 796.732 348.175  c
796.514 348.039 795.972 347.862 795.107 347.644  c
793.951 347.352 793.149 347.099 792.701 346.886  c
792.253 346.672 791.912 346.375 791.678 345.995  c
791.443 345.615 791.326 345.196 791.326 344.737  c
791.326 344.321 791.423 343.935 791.615 343.581  c
791.808 343.227 792.066 342.935 792.389 342.706  c
792.639 342.519 792.977 342.362 793.404 342.237  c
793.831 342.112 794.285 342.050 794.764 342.050  c
795.503 342.050 796.149 342.157 796.701 342.370  c
797.253 342.584 797.662 342.870 797.928 343.229  c
798.193 343.589 798.373 344.071 798.467 344.675  c
796.920 344.878 l
796.847 344.399 796.644 344.024 796.311 343.753  c
795.977 343.482 795.503 343.347 794.889 343.347  c
794.160 343.347 793.639 343.466 793.326 343.706  c
793.014 343.946 792.857 344.227 792.857 344.550  c
792.857 344.758 792.925 344.946 793.061 345.112  c
793.186 345.279 793.383 345.420 793.654 345.534  c
793.821 345.586 794.290 345.722 795.061 345.940  c
796.175 346.232 796.954 346.474 797.396 346.667  c
797.839 346.860 798.188 347.138 798.443 347.503  c
798.699 347.868 798.826 348.315 798.826 348.847  c
798.826 349.378 798.673 349.878 798.365 350.347  c
798.058 350.815 797.613 351.177 797.029 351.433  c
796.446 351.688 795.790 351.815 795.061 351.815  c
793.842 351.815 792.915 351.563 792.279 351.058  c
791.644 350.552 791.238 349.805 791.061 348.815  c
h
804.154 350.175 m
804.389 351.581 l
803.941 351.675 803.540 351.722 803.186 351.722  c
802.613 351.722 802.167 351.631 801.850 351.448  c
801.532 351.266 801.311 351.026 801.186 350.729  c
801.061 350.433 800.998 349.810 800.998 348.862  c
800.998 343.487 l
799.826 343.487 l
799.826 342.269 l
800.998 342.269 l
800.998 339.956 l
802.561 339.003 l
802.561 342.269 l
804.154 342.269 l
804.154 343.487 l
802.561 343.487 l
802.561 348.956 l
802.561 349.404 802.589 349.693 802.646 349.823  c
802.704 349.953 802.795 350.055 802.920 350.128  c
803.045 350.201 803.227 350.237 803.467 350.237  c
803.633 350.237 803.863 350.216 804.154 350.175  c
h
812.093 348.597 m
813.733 348.800 l
813.473 349.748 812.994 350.487 812.296 351.019  c
811.598 351.550 810.707 351.815 809.624 351.815  c
808.259 351.815 807.176 351.394 806.374 350.550  c
805.572 349.706 805.171 348.524 805.171 347.003  c
805.171 345.440 805.575 344.224 806.382 343.354  c
807.189 342.485 808.239 342.050 809.530 342.050  c
810.780 342.050 811.801 342.474 812.593 343.323  c
813.384 344.172 813.780 345.368 813.780 346.909  c
813.780 347.003 813.775 347.144 813.765 347.331  c
806.812 347.331 l
806.864 348.362 807.153 349.149 807.679 349.690  c
808.205 350.232 808.853 350.503 809.624 350.503  c
810.207 350.503 810.705 350.352 811.116 350.050  c
811.528 349.748 811.853 349.263 812.093 348.597  c
h
806.890 346.034 m
812.108 346.034 l
812.035 345.253 811.838 344.664 811.515 344.269  c
811.004 343.654 810.348 343.347 809.546 343.347  c
808.827 343.347 808.220 343.591 807.726 344.081  c
807.231 344.571 806.952 345.222 806.890 346.034  c
h
815.713 351.597 m
815.713 342.269 l
817.135 342.269 l
817.135 343.565 l
817.426 343.118 817.814 342.753 818.299 342.472  c
818.783 342.190 819.338 342.050 819.963 342.050  c
820.650 342.050 821.215 342.193 821.658 342.479  c
822.101 342.766 822.411 343.170 822.588 343.690  c
823.327 342.597 824.291 342.050 825.479 342.050  c
826.406 342.050 827.117 342.308 827.611 342.823  c
828.106 343.339 828.354 344.128 828.354 345.190  c
828.354 351.597 l
826.791 351.597 l
826.791 345.722 l
826.791 345.086 826.739 344.628 826.635 344.347  c
826.531 344.065 826.343 343.841 826.072 343.675  c
825.801 343.508 825.484 343.425 825.119 343.425  c
824.463 343.425 823.919 343.644 823.486 344.081  c
823.054 344.519 822.838 345.216 822.838 346.175  c
822.838 351.597 l
821.260 351.597 l
821.260 345.534 l
821.260 344.826 821.130 344.297 820.869 343.948  c
820.609 343.599 820.187 343.425 819.604 343.425  c
819.156 343.425 818.744 343.542 818.369 343.776  c
817.994 344.011 817.721 344.352 817.549 344.800  c
817.377 345.248 817.291 345.899 817.291 346.753  c
817.291 351.597 l
815.713 351.597 l
h
f
newpath
719.526 370.867 m
721.104 370.617 l
721.188 371.242 721.430 371.721 721.831 372.055  c
722.232 372.388 722.792 372.555 723.511 372.555  c
724.240 372.555 724.782 372.406 725.136 372.109  c
725.490 371.812 725.667 371.466 725.667 371.070  c
725.667 370.716 725.511 370.435 725.198 370.227  c
724.979 370.091 724.438 369.914 723.573 369.695  c
722.417 369.404 721.615 369.151 721.167 368.938  c
720.719 368.724 720.378 368.427 720.144 368.047  c
719.909 367.667 719.792 367.247 719.792 366.789  c
719.792 366.372 719.888 365.987 720.081 365.633  c
720.274 365.279 720.532 364.987 720.854 364.758  c
721.104 364.570 721.443 364.414 721.870 364.289  c
722.297 364.164 722.750 364.102 723.229 364.102  c
723.969 364.102 724.615 364.208 725.167 364.422  c
725.719 364.635 726.128 364.922 726.394 365.281  c
726.659 365.641 726.839 366.122 726.933 366.727  c
725.386 366.930 l
725.313 366.451 725.110 366.076 724.776 365.805  c
724.443 365.534 723.969 365.398 723.354 365.398  c
722.625 365.398 722.104 365.518 721.792 365.758  c
721.479 365.997 721.323 366.279 721.323 366.602  c
721.323 366.810 721.391 366.997 721.526 367.164  c
721.651 367.331 721.849 367.471 722.120 367.586  c
722.287 367.638 722.756 367.773 723.526 367.992  c
724.641 368.284 725.420 368.526 725.862 368.719  c
726.305 368.911 726.654 369.190 726.909 369.555  c
727.164 369.919 727.292 370.367 727.292 370.898  c
727.292 371.430 727.138 371.930 726.831 372.398  c
726.524 372.867 726.078 373.229 725.495 373.484  c
724.912 373.740 724.256 373.867 723.526 373.867  c
722.308 373.867 721.381 373.615 720.745 373.109  c
720.110 372.604 719.703 371.857 719.526 370.867  c
h
735.558 370.648 m
737.198 370.852 l
736.938 371.799 736.459 372.539 735.761 373.070  c
735.063 373.602 734.172 373.867 733.089 373.867  c
731.724 373.867 730.641 373.445 729.839 372.602  c
729.037 371.758 728.636 370.576 728.636 369.055  c
728.636 367.492 729.039 366.276 729.847 365.406  c
730.654 364.536 731.703 364.102 732.995 364.102  c
734.245 364.102 735.266 364.526 736.058 365.375  c
736.849 366.224 737.245 367.419 737.245 368.961  c
737.245 369.055 737.240 369.195 737.229 369.383  c
730.276 369.383 l
730.328 370.414 730.618 371.201 731.144 371.742  c
731.670 372.284 732.318 372.555 733.089 372.555  c
733.672 372.555 734.170 372.404 734.581 372.102  c
734.993 371.799 735.318 371.315 735.558 370.648  c
h
730.354 368.086 m
735.573 368.086 l
735.500 367.305 735.302 366.716 734.979 366.320  c
734.469 365.706 733.813 365.398 733.011 365.398  c
732.292 365.398 731.685 365.643 731.190 366.133  c
730.696 366.622 730.417 367.273 730.354 368.086  c
h
739.162 373.648 m
739.162 364.320 l
740.584 364.320 l
740.584 365.727 l
740.949 365.070 741.285 364.635 741.592 364.422  c
741.899 364.208 742.235 364.102 742.600 364.102  c
743.141 364.102 743.683 364.273 744.225 364.617  c
743.693 366.086 l
743.298 365.857 742.907 365.742 742.521 365.742  c
742.178 365.742 741.868 365.846 741.592 366.055  c
741.316 366.263 741.120 366.549 741.006 366.914  c
740.829 367.477 740.740 368.091 740.740 368.758  c
740.740 373.648 l
739.162 373.648 l
h
747.766 373.648 m
744.219 364.320 l
745.891 364.320 l
747.891 369.898 l
748.109 370.503 748.307 371.133 748.484 371.789  c
748.630 371.289 748.828 370.695 749.078 370.008  c
751.141 364.320 l
752.781 364.320 l
749.234 373.648 l
747.766 373.648 l
h
754.188 362.586 m
754.188 360.758 l
755.766 360.758 l
755.766 362.586 l
754.188 362.586 l
h
754.188 373.648 m
754.188 364.320 l
755.766 364.320 l
755.766 373.648 l
754.188 373.648 l
h
764.265 370.227 m
765.812 370.430 l
765.645 371.503 765.213 372.344 764.515 372.953  c
763.817 373.562 762.957 373.867 761.937 373.867  c
760.655 373.867 759.627 373.448 758.851 372.609  c
758.075 371.771 757.687 370.576 757.687 369.023  c
757.687 368.013 757.853 367.130 758.187 366.375  c
758.520 365.620 759.028 365.052 759.710 364.672  c
760.392 364.292 761.134 364.102 761.937 364.102  c
762.957 364.102 763.788 364.359 764.429 364.875  c
765.069 365.391 765.483 366.117 765.671 367.055  c
764.124 367.289 l
763.978 366.664 763.720 366.193 763.351 365.875  c
762.981 365.557 762.530 365.398 761.999 365.398  c
761.207 365.398 760.562 365.685 760.062 366.258  c
759.562 366.831 759.312 367.737 759.312 368.977  c
759.312 370.227 759.551 371.135 760.030 371.703  c
760.509 372.271 761.140 372.555 761.921 372.555  c
762.535 372.555 763.051 372.365 763.468 371.984  c
763.884 371.604 764.150 371.018 764.265 370.227  c
h
773.562 370.648 m
775.202 370.852 l
774.942 371.799 774.463 372.539 773.765 373.070  c
773.067 373.602 772.176 373.867 771.093 373.867  c
769.728 373.867 768.645 373.445 767.843 372.602  c
767.041 371.758 766.640 370.576 766.640 369.055  c
766.640 367.492 767.043 366.276 767.851 365.406  c
768.658 364.536 769.707 364.102 770.999 364.102  c
772.249 364.102 773.270 364.526 774.062 365.375  c
774.853 366.224 775.249 367.419 775.249 368.961  c
775.249 369.055 775.244 369.195 775.233 369.383  c
768.280 369.383 l
768.332 370.414 768.621 371.201 769.147 371.742  c
769.674 372.284 770.322 372.555 771.093 372.555  c
771.676 372.555 772.174 372.404 772.585 372.102  c
772.996 371.799 773.322 371.315 773.562 370.648  c
h
768.358 368.086 m
773.577 368.086 l
773.504 367.305 773.306 366.716 772.983 366.320  c
772.473 365.706 771.817 365.398 771.015 365.398  c
770.296 365.398 769.689 365.643 769.194 366.133  c
768.700 366.622 768.421 367.273 768.358 368.086  c
h
782.183 373.648 m
782.183 364.320 l
783.604 364.320 l
783.604 365.617 l
783.896 365.169 784.284 364.805 784.769 364.523  c
785.253 364.242 785.808 364.102 786.433 364.102  c
787.120 364.102 787.685 364.245 788.128 364.531  c
788.571 364.818 788.881 365.221 789.058 365.742  c
789.797 364.648 790.761 364.102 791.948 364.102  c
792.875 364.102 793.586 364.359 794.081 364.875  c
794.576 365.391 794.823 366.180 794.823 367.242  c
794.823 373.648 l
793.261 373.648 l
793.261 367.773 l
793.261 367.138 793.209 366.680 793.104 366.398  c
793.000 366.117 792.813 365.893 792.542 365.727  c
792.271 365.560 791.953 365.477 791.589 365.477  c
790.933 365.477 790.388 365.695 789.956 366.133  c
789.524 366.570 789.308 367.268 789.308 368.227  c
789.308 373.648 l
787.729 373.648 l
787.729 367.586 l
787.729 366.878 787.599 366.349 787.339 366.000  c
787.078 365.651 786.657 365.477 786.073 365.477  c
785.625 365.477 785.214 365.594 784.839 365.828  c
784.464 366.062 784.190 366.404 784.019 366.852  c
783.847 367.299 783.761 367.951 783.761 368.805  c
783.761 373.648 l
782.183 373.648 l
h
796.583 368.977 m
796.583 367.247 797.067 365.966 798.036 365.133  c
798.838 364.445 799.812 364.102 800.958 364.102  c
802.250 364.102 803.302 364.523 804.114 365.367  c
804.927 366.211 805.333 367.372 805.333 368.852  c
805.333 370.049 805.153 370.992 804.794 371.680  c
804.435 372.367 803.911 372.904 803.224 373.289  c
802.536 373.674 801.781 373.867 800.958 373.867  c
799.656 373.867 798.601 373.448 797.794 372.609  c
796.987 371.771 796.583 370.560 796.583 368.977  c
h
798.208 368.977 m
798.208 370.174 798.468 371.070 798.989 371.664  c
799.510 372.258 800.166 372.555 800.958 372.555  c
801.750 372.555 802.406 372.255 802.927 371.656  c
803.448 371.057 803.708 370.148 803.708 368.930  c
803.708 367.773 803.445 366.898 802.919 366.305  c
802.393 365.711 801.739 365.414 800.958 365.414  c
800.166 365.414 799.510 365.711 798.989 366.305  c
798.468 366.898 798.208 367.789 798.208 368.977  c
h
813.250 373.648 m
813.250 372.477 l
812.656 373.404 811.781 373.867 810.625 373.867  c
809.885 373.867 809.203 373.661 808.578 373.250  c
807.953 372.839 807.469 372.266 807.125 371.531  c
806.781 370.797 806.609 369.951 806.609 368.992  c
806.609 368.055 806.766 367.208 807.078 366.453  c
807.391 365.698 807.857 365.117 808.477 364.711  c
809.096 364.305 809.792 364.102 810.562 364.102  c
811.125 364.102 811.625 364.221 812.062 364.461  c
812.500 364.701 812.859 365.008 813.141 365.383  c
813.141 360.758 l
814.703 360.758 l
814.703 373.648 l
813.250 373.648 l
h
808.234 368.992 m
808.234 370.190 808.487 371.083 808.992 371.672  c
809.497 372.260 810.094 372.555 810.781 372.555  c
811.469 372.555 812.055 372.273 812.539 371.711  c
813.023 371.148 813.266 370.284 813.266 369.117  c
813.266 367.846 813.021 366.911 812.531 366.312  c
812.042 365.714 811.438 365.414 810.719 365.414  c
810.010 365.414 809.419 365.701 808.945 366.273  c
808.471 366.846 808.234 367.753 808.234 368.992  c
h
823.589 370.648 m
825.229 370.852 l
824.969 371.799 824.490 372.539 823.792 373.070  c
823.094 373.602 822.203 373.867 821.120 373.867  c
819.756 373.867 818.672 373.445 817.870 372.602  c
817.068 371.758 816.667 370.576 816.667 369.055  c
816.667 367.492 817.071 366.276 817.878 365.406  c
818.685 364.536 819.735 364.102 821.026 364.102  c
822.276 364.102 823.297 364.526 824.089 365.375  c
824.881 366.224 825.276 367.419 825.276 368.961  c
825.276 369.055 825.271 369.195 825.261 369.383  c
818.308 369.383 l
818.360 370.414 818.649 371.201 819.175 371.742  c
819.701 372.284 820.349 372.555 821.120 372.555  c
821.703 372.555 822.201 372.404 822.612 372.102  c
823.024 371.799 823.349 371.315 823.589 370.648  c
h
818.386 368.086 m
823.604 368.086 l
823.532 367.305 823.334 366.716 823.011 366.320  c
822.500 365.706 821.844 365.398 821.042 365.398  c
820.323 365.398 819.716 365.643 819.222 366.133  c
818.727 366.622 818.448 367.273 818.386 368.086  c
h
827.178 373.648 m
827.178 360.758 l
828.756 360.758 l
828.756 373.648 l
827.178 373.648 l
h
f
2 J
10.0000 M
0.00000 0.00000 1.00000 RG
0 J
1.45000 M
0.00000 0.00000 0.00000 RG
newpath
974.500 477.500 m
974.500 560.343 884.957 627.500 774.500 627.500  c
664.043 627.500 574.500 560.343 574.500 477.500  c
574.500 394.657 664.043 327.500 774.500 327.500  c
884.957 327.500 974.500 394.657 974.500 477.500  c
h
S
2 J
10.0000 M
1.00000 1.00000 .600000 RG
newpath
914.500 477.500 m
914.500 531.348 851.820 575.000 774.500 575.000  c
697.180 575.000 634.500 531.348 634.500 477.500  c
634.500 423.652 697.180 380.000 774.500 380.000  c
851.820 380.000 914.500 423.652 914.500 477.500  c
h
f
0.00000 0.00000 0.00000 RG
0 J
1.45000 M
newpath
746.540 401.315 m
748.118 401.065 l
748.201 401.690 748.443 402.170 748.844 402.503  c
749.245 402.836 749.805 403.003 750.524 403.003  c
751.253 403.003 751.795 402.854 752.149 402.558  c
752.503 402.261 752.680 401.914 752.680 401.519  c
752.680 401.164 752.524 400.883 752.211 400.675  c
751.993 400.539 751.451 400.362 750.586 400.144  c
749.430 399.852 748.628 399.599 748.180 399.386  c
747.732 399.172 747.391 398.875 747.157 398.495  c
746.922 398.115 746.805 397.696 746.805 397.237  c
746.805 396.821 746.902 396.435 747.094 396.081  c
747.287 395.727 747.545 395.435 747.868 395.206  c
748.118 395.019 748.456 394.862 748.883 394.737  c
749.310 394.612 749.764 394.550 750.243 394.550  c
750.982 394.550 751.628 394.657 752.180 394.870  c
752.732 395.084 753.141 395.370 753.407 395.729  c
753.672 396.089 753.852 396.571 753.946 397.175  c
752.399 397.378 l
752.326 396.899 752.123 396.524 751.790 396.253  c
751.456 395.982 750.982 395.847 750.368 395.847  c
749.639 395.847 749.118 395.966 748.805 396.206  c
748.493 396.446 748.336 396.727 748.336 397.050  c
748.336 397.258 748.404 397.446 748.540 397.612  c
748.665 397.779 748.862 397.920 749.133 398.034  c
749.300 398.086 749.769 398.222 750.540 398.440  c
751.654 398.732 752.433 398.974 752.875 399.167  c
753.318 399.360 753.667 399.638 753.922 400.003  c
754.178 400.368 754.305 400.815 754.305 401.347  c
754.305 401.878 754.152 402.378 753.844 402.847  c
753.537 403.315 753.092 403.677 752.508 403.933  c
751.925 404.188 751.269 404.315 750.540 404.315  c
749.321 404.315 748.394 404.063 747.758 403.558  c
747.123 403.052 746.717 402.305 746.540 401.315  c
h
762.571 401.097 m
764.211 401.300 l
763.951 402.248 763.472 402.987 762.774 403.519  c
762.076 404.050 761.185 404.315 760.102 404.315  c
758.737 404.315 757.654 403.894 756.852 403.050  c
756.050 402.206 755.649 401.024 755.649 399.503  c
755.649 397.940 756.053 396.724 756.860 395.854  c
757.667 394.985 758.717 394.550 760.008 394.550  c
761.258 394.550 762.279 394.974 763.071 395.823  c
763.862 396.672 764.258 397.868 764.258 399.409  c
764.258 399.503 764.253 399.644 764.243 399.831  c
757.290 399.831 l
757.342 400.862 757.631 401.649 758.157 402.190  c
758.683 402.732 759.331 403.003 760.102 403.003  c
760.685 403.003 761.183 402.852 761.594 402.550  c
762.006 402.248 762.331 401.763 762.571 401.097  c
h
757.368 398.534 m
762.586 398.534 l
762.514 397.753 762.316 397.164 761.993 396.769  c
761.482 396.154 760.826 395.847 760.024 395.847  c
759.305 395.847 758.698 396.091 758.204 396.581  c
757.709 397.071 757.430 397.722 757.368 398.534  c
h
766.175 404.097 m
766.175 394.769 l
767.597 394.769 l
767.597 396.175 l
767.962 395.519 768.298 395.084 768.605 394.870  c
768.912 394.657 769.248 394.550 769.613 394.550  c
770.154 394.550 770.696 394.722 771.238 395.065  c
770.707 396.534 l
770.311 396.305 769.920 396.190 769.535 396.190  c
769.191 396.190 768.881 396.295 768.605 396.503  c
768.329 396.711 768.134 396.998 768.019 397.362  c
767.842 397.925 767.753 398.539 767.753 399.206  c
767.753 404.097 l
766.175 404.097 l
h
774.779 404.097 m
771.232 394.769 l
772.904 394.769 l
774.904 400.347 l
775.123 400.951 775.320 401.581 775.498 402.237  c
775.643 401.737 775.841 401.144 776.091 400.456  c
778.154 394.769 l
779.794 394.769 l
776.248 404.097 l
774.779 404.097 l
h
781.201 393.034 m
781.201 391.206 l
782.779 391.206 l
782.779 393.034 l
781.201 393.034 l
h
781.201 404.097 m
781.201 394.769 l
782.779 394.769 l
782.779 404.097 l
781.201 404.097 l
h
791.278 400.675 m
792.825 400.878 l
792.658 401.951 792.226 402.792 791.528 403.401  c
790.830 404.011 789.971 404.315 788.950 404.315  c
787.668 404.315 786.640 403.896 785.864 403.058  c
785.088 402.219 784.700 401.024 784.700 399.472  c
784.700 398.461 784.866 397.578 785.200 396.823  c
785.533 396.068 786.041 395.500 786.723 395.120  c
787.405 394.740 788.148 394.550 788.950 394.550  c
789.971 394.550 790.801 394.808 791.442 395.323  c
792.083 395.839 792.497 396.565 792.684 397.503  c
791.137 397.737 l
790.991 397.112 790.734 396.641 790.364 396.323  c
789.994 396.006 789.543 395.847 789.012 395.847  c
788.221 395.847 787.575 396.133 787.075 396.706  c
786.575 397.279 786.325 398.185 786.325 399.425  c
786.325 400.675 786.564 401.584 787.043 402.151  c
787.523 402.719 788.153 403.003 788.934 403.003  c
789.549 403.003 790.064 402.813 790.481 402.433  c
790.898 402.052 791.163 401.466 791.278 400.675  c
h
800.575 401.097 m
802.215 401.300 l
801.955 402.248 801.476 402.987 800.778 403.519  c
800.080 404.050 799.189 404.315 798.106 404.315  c
796.741 404.315 795.658 403.894 794.856 403.050  c
794.054 402.206 793.653 401.024 793.653 399.503  c
793.653 397.940 794.056 396.724 794.864 395.854  c
795.671 394.985 796.721 394.550 798.012 394.550  c
799.262 394.550 800.283 394.974 801.075 395.823  c
801.866 396.672 802.262 397.868 802.262 399.409  c
802.262 399.503 802.257 399.644 802.247 399.831  c
795.293 399.831 l
795.346 400.862 795.635 401.649 796.161 402.190  c
796.687 402.732 797.335 403.003 798.106 403.003  c
798.689 403.003 799.187 402.852 799.598 402.550  c
800.010 402.248 800.335 401.763 800.575 401.097  c
h
795.372 398.534 m
800.590 398.534 l
800.517 397.753 800.319 397.164 799.997 396.769  c
799.486 396.154 798.830 395.847 798.028 395.847  c
797.309 395.847 796.702 396.091 796.208 396.581  c
795.713 397.071 795.434 397.722 795.372 398.534  c
h
f
newpath
735.116 424.727 m
735.351 426.133 l
734.903 426.227 734.502 426.273 734.147 426.273  c
733.575 426.273 733.129 426.182 732.812 426.000  c
732.494 425.818 732.272 425.578 732.147 425.281  c
732.022 424.984 731.960 424.362 731.960 423.414  c
731.960 418.039 l
730.788 418.039 l
730.788 416.820 l
731.960 416.820 l
731.960 414.508 l
733.522 413.555 l
733.522 416.820 l
735.116 416.820 l
735.116 418.039 l
733.522 418.039 l
733.522 423.508 l
733.522 423.956 733.551 424.245 733.608 424.375  c
733.666 424.505 733.757 424.607 733.882 424.680  c
734.007 424.753 734.189 424.789 734.429 424.789  c
734.595 424.789 734.825 424.768 735.116 424.727  c
h
736.586 429.742 m
736.414 428.258 l
736.758 428.352 737.060 428.398 737.320 428.398  c
737.674 428.398 737.956 428.341 738.164 428.227  c
738.372 428.112 738.544 427.945 738.680 427.727  c
738.784 427.570 738.945 427.180 739.164 426.555  c
739.195 426.461 739.242 426.331 739.305 426.164  c
735.773 416.820 l
737.477 416.820 l
739.414 422.227 l
739.664 422.904 739.888 423.622 740.086 424.383  c
740.273 423.654 740.492 422.945 740.742 422.258  c
742.742 416.820 l
744.320 416.820 l
740.773 426.305 l
740.388 427.336 740.091 428.044 739.883 428.430  c
739.602 428.951 739.279 429.331 738.914 429.570  c
738.549 429.810 738.117 429.930 737.617 429.930  c
737.305 429.930 736.961 429.867 736.586 429.742  c
h
745.664 429.727 m
745.664 416.820 l
747.102 416.820 l
747.102 418.023 l
747.445 417.555 747.831 417.201 748.258 416.961  c
748.685 416.721 749.201 416.602 749.805 416.602  c
750.607 416.602 751.312 416.807 751.922 417.219  c
752.531 417.630 752.992 418.208 753.305 418.953  c
753.617 419.698 753.773 420.518 753.773 421.414  c
753.773 422.362 753.602 423.219 753.258 423.984  c
752.914 424.750 752.414 425.339 751.758 425.750  c
751.102 426.161 750.414 426.367 749.695 426.367  c
749.174 426.367 748.703 426.255 748.281 426.031  c
747.859 425.807 747.513 425.523 747.242 425.180  c
747.242 429.727 l
745.664 429.727 l
h
747.102 421.539 m
747.102 422.737 747.344 423.622 747.828 424.195  c
748.312 424.768 748.898 425.055 749.586 425.055  c
750.294 425.055 750.898 424.758 751.398 424.164  c
751.898 423.570 752.148 422.648 752.148 421.398  c
752.148 420.211 751.904 419.320 751.414 418.727  c
750.924 418.133 750.341 417.836 749.664 417.836  c
748.987 417.836 748.391 418.151 747.875 418.781  c
747.359 419.411 747.102 420.331 747.102 421.539  c
h
762.065 423.148 m
763.706 423.352 l
763.446 424.299 762.966 425.039 762.269 425.570  c
761.571 426.102 760.680 426.367 759.597 426.367  c
758.232 426.367 757.149 425.945 756.347 425.102  c
755.545 424.258 755.144 423.076 755.144 421.555  c
755.144 419.992 755.547 418.776 756.354 417.906  c
757.162 417.036 758.211 416.602 759.503 416.602  c
760.753 416.602 761.774 417.026 762.565 417.875  c
763.357 418.724 763.753 419.919 763.753 421.461  c
763.753 421.555 763.748 421.695 763.737 421.883  c
756.784 421.883 l
756.836 422.914 757.125 423.701 757.651 424.242  c
758.177 424.784 758.826 425.055 759.597 425.055  c
760.180 425.055 760.677 424.904 761.089 424.602  c
761.500 424.299 761.826 423.815 762.065 423.148  c
h
756.862 420.586 m
762.081 420.586 l
762.008 419.805 761.810 419.216 761.487 418.820  c
760.977 418.206 760.321 417.898 759.519 417.898  c
758.800 417.898 758.193 418.143 757.698 418.633  c
757.203 419.122 756.925 419.773 756.862 420.586  c
h
770.687 426.148 m
770.687 416.820 l
772.108 416.820 l
772.108 418.117 l
772.400 417.669 772.788 417.305 773.272 417.023  c
773.757 416.742 774.312 416.602 774.937 416.602  c
775.624 416.602 776.189 416.745 776.632 417.031  c
777.075 417.318 777.384 417.721 777.562 418.242  c
778.301 417.148 779.265 416.602 780.452 416.602  c
781.379 416.602 782.090 416.859 782.585 417.375  c
783.080 417.891 783.327 418.680 783.327 419.742  c
783.327 426.148 l
781.765 426.148 l
781.765 420.273 l
781.765 419.638 781.713 419.180 781.608 418.898  c
781.504 418.617 781.317 418.393 781.046 418.227  c
780.775 418.060 780.457 417.977 780.093 417.977  c
779.437 417.977 778.892 418.195 778.460 418.633  c
778.028 419.070 777.812 419.768 777.812 420.727  c
777.812 426.148 l
776.233 426.148 l
776.233 420.086 l
776.233 419.378 776.103 418.849 775.843 418.500  c
775.582 418.151 775.160 417.977 774.577 417.977  c
774.129 417.977 773.718 418.094 773.343 418.328  c
772.968 418.562 772.694 418.904 772.522 419.352  c
772.351 419.799 772.265 420.451 772.265 421.305  c
772.265 426.148 l
770.687 426.148 l
h
785.087 421.477 m
785.087 419.747 785.571 418.466 786.540 417.633  c
787.342 416.945 788.316 416.602 789.462 416.602  c
790.754 416.602 791.806 417.023 792.618 417.867  c
793.431 418.711 793.837 419.872 793.837 421.352  c
793.837 422.549 793.657 423.492 793.298 424.180  c
792.938 424.867 792.415 425.404 791.728 425.789  c
791.040 426.174 790.285 426.367 789.462 426.367  c
788.160 426.367 787.105 425.948 786.298 425.109  c
785.491 424.271 785.087 423.060 785.087 421.477  c
h
786.712 421.477 m
786.712 422.674 786.972 423.570 787.493 424.164  c
788.014 424.758 788.670 425.055 789.462 425.055  c
790.254 425.055 790.910 424.755 791.431 424.156  c
791.951 423.557 792.212 422.648 792.212 421.430  c
792.212 420.273 791.949 419.398 791.423 418.805  c
790.897 418.211 790.243 417.914 789.462 417.914  c
788.670 417.914 788.014 418.211 787.493 418.805  c
786.972 419.398 786.712 420.289 786.712 421.477  c
h
801.754 426.148 m
801.754 424.977 l
801.160 425.904 800.285 426.367 799.129 426.367  c
798.389 426.367 797.707 426.161 797.082 425.750  c
796.457 425.339 795.973 424.766 795.629 424.031  c
795.285 423.297 795.113 422.451 795.113 421.492  c
795.113 420.555 795.270 419.708 795.582 418.953  c
795.895 418.198 796.361 417.617 796.980 417.211  c
797.600 416.805 798.296 416.602 799.066 416.602  c
799.629 416.602 800.129 416.721 800.566 416.961  c
801.004 417.201 801.363 417.508 801.645 417.883  c
801.645 413.258 l
803.207 413.258 l
803.207 426.148 l
801.754 426.148 l
h
796.738 421.492 m
796.738 422.690 796.991 423.583 797.496 424.172  c
798.001 424.760 798.598 425.055 799.285 425.055  c
799.973 425.055 800.559 424.773 801.043 424.211  c
801.527 423.648 801.770 422.784 801.770 421.617  c
801.770 420.346 801.525 419.411 801.035 418.812  c
800.546 418.214 799.941 417.914 799.223 417.914  c
798.514 417.914 797.923 418.201 797.449 418.773  c
796.975 419.346 796.738 420.253 796.738 421.492  c
h
812.093 423.148 m
813.733 423.352 l
813.473 424.299 812.994 425.039 812.296 425.570  c
811.598 426.102 810.707 426.367 809.624 426.367  c
808.259 426.367 807.176 425.945 806.374 425.102  c
805.572 424.258 805.171 423.076 805.171 421.555  c
805.171 419.992 805.575 418.776 806.382 417.906  c
807.189 417.036 808.239 416.602 809.530 416.602  c
810.780 416.602 811.801 417.026 812.593 417.875  c
813.384 418.724 813.780 419.919 813.780 421.461  c
813.780 421.555 813.775 421.695 813.765 421.883  c
806.812 421.883 l
806.864 422.914 807.153 423.701 807.679 424.242  c
808.205 424.784 808.853 425.055 809.624 425.055  c
810.207 425.055 810.705 424.904 811.116 424.602  c
811.528 424.299 811.853 423.815 812.093 423.148  c
h
806.890 420.586 m
812.108 420.586 l
812.035 419.805 811.838 419.216 811.515 418.820  c
811.004 418.206 810.348 417.898 809.546 417.898  c
808.827 417.898 808.220 418.143 807.726 418.633  c
807.231 419.122 806.952 419.773 806.890 420.586  c
h
815.682 426.148 m
815.682 413.258 l
817.260 413.258 l
817.260 426.148 l
815.682 426.148 l
h
f
2 J
10.0000 M
1.00000 1.00000 .600000 RG
0 J
1.45000 M
0.00000 0.00000 0.00000 RG
newpath
914.500 477.500 m
914.500 531.348 851.820 575.000 774.500 575.000  c
697.180 575.000 634.500 531.348 634.500 477.500  c
634.500 423.652 697.180 380.000 774.500 380.000  c
851.820 380.000 914.500 423.652 914.500 477.500  c
h
S
2 J
10.0000 M
1.00000 0.00000 0.00000 RG
newpath
849.500 477.500 m
849.500 503.734 815.921 525.000 774.500 525.000  c
733.079 525.000 699.500 503.734 699.500 477.500  c
699.500 451.266 733.079 430.000 774.500 430.000  c
815.921 430.000 849.500 451.266 849.500 477.500  c
h
f
1.00000 1.00000 1.00000 RG
0 J
1.45000 M
newpath
757.385 462.519 m
757.385 449.628 l
762.245 449.628 l
763.099 449.628 763.750 449.670 764.198 449.753  c
764.833 449.858 765.364 450.058 765.792 450.355  c
766.219 450.652 766.562 451.069 766.823 451.605  c
767.083 452.141 767.213 452.727 767.213 453.363  c
767.213 454.457 766.864 455.384 766.167 456.144  c
765.469 456.904 764.213 457.285 762.401 457.285  c
759.088 457.285 l
759.088 462.519 l
757.385 462.519 l
h
759.088 455.753 m
762.417 455.753 l
763.521 455.753 764.305 455.550 764.768 455.144  c
765.232 454.738 765.463 454.160 765.463 453.410  c
765.463 452.868 765.328 452.407 765.057 452.027  c
764.786 451.647 764.427 451.394 763.979 451.269  c
763.687 451.196 763.156 451.160 762.385 451.160  c
759.088 451.160 l
759.088 455.753 l
h
777.844 449.628 m
779.547 449.628 l
779.547 457.082 l
779.547 458.373 779.402 459.399 779.110 460.160  c
778.818 460.920 778.290 461.540 777.524 462.019  c
776.758 462.498 775.756 462.738 774.516 462.738  c
773.308 462.738 772.321 462.529 771.555 462.113  c
770.790 461.696 770.243 461.095 769.915 460.308  c
769.586 459.522 769.422 458.446 769.422 457.082  c
769.422 449.628 l
771.125 449.628 l
771.125 457.066 l
771.125 458.191 771.230 459.016 771.438 459.542  c
771.646 460.069 772.003 460.477 772.508 460.769  c
773.014 461.061 773.631 461.207 774.360 461.207  c
775.620 461.207 776.516 460.920 777.047 460.347  c
777.579 459.774 777.844 458.681 777.844 457.066  c
777.844 449.628 l
h
781.812 458.378 m
783.421 458.238 l
783.494 458.884 783.669 459.412 783.945 459.824  c
784.221 460.235 784.653 460.569 785.242 460.824  c
785.830 461.079 786.489 461.207 787.218 461.207  c
787.875 461.207 788.450 461.110 788.945 460.917  c
789.440 460.725 789.809 460.459 790.054 460.121  c
790.299 459.782 790.421 459.415 790.421 459.019  c
790.421 458.613 790.304 458.259 790.070 457.957  c
789.835 457.654 789.447 457.404 788.906 457.207  c
788.562 457.071 787.799 456.860 786.617 456.574  c
785.434 456.287 784.604 456.019 784.125 455.769  c
783.510 455.446 783.052 455.045 782.750 454.566  c
782.447 454.087 782.296 453.556 782.296 452.972  c
782.296 452.316 782.481 451.707 782.851 451.144  c
783.221 450.582 783.760 450.152 784.468 449.855  c
785.177 449.558 785.968 449.410 786.843 449.410  c
787.791 449.410 788.630 449.563 789.359 449.871  c
790.088 450.178 790.651 450.631 791.046 451.230  c
791.442 451.829 791.651 452.509 791.671 453.269  c
790.046 453.394 l
789.953 452.571 789.653 451.951 789.148 451.535  c
788.643 451.118 787.895 450.910 786.906 450.910  c
785.875 450.910 785.122 451.100 784.648 451.480  c
784.174 451.860 783.937 452.316 783.937 452.847  c
783.937 453.316 784.109 453.696 784.453 453.988  c
784.776 454.290 785.630 454.597 787.015 454.910  c
788.401 455.222 789.354 455.498 789.875 455.738  c
790.625 456.082 791.177 456.519 791.531 457.050  c
791.885 457.582 792.062 458.191 792.062 458.878  c
792.062 459.566 791.867 460.212 791.476 460.816  c
791.085 461.420 790.523 461.891 789.789 462.230  c
789.054 462.569 788.223 462.738 787.296 462.738  c
786.130 462.738 785.153 462.569 784.367 462.230  c
783.580 461.891 782.963 461.381 782.515 460.699  c
782.067 460.016 781.833 459.243 781.812 458.378  c
h
f
newpath
734.024 484.571 m
734.024 476.461 l
732.634 476.461 l
732.634 475.243 l
734.024 475.243 l
734.024 474.243 l
734.024 473.618 734.082 473.154 734.196 472.852  c
734.342 472.435 734.608 472.099 734.993 471.844  c
735.379 471.589 735.920 471.461 736.618 471.461  c
737.056 471.461 737.545 471.514 738.087 471.618  c
737.853 473.008 l
737.519 472.946 737.207 472.915 736.915 472.915  c
736.436 472.915 736.097 473.016 735.899 473.219  c
735.701 473.422 735.603 473.805 735.603 474.368  c
735.603 475.243 l
737.415 475.243 l
737.415 476.461 l
735.603 476.461 l
735.603 484.571 l
734.024 484.571 l
h
738.057 479.899 m
738.057 478.170 738.541 476.889 739.510 476.055  c
740.312 475.368 741.286 475.024 742.432 475.024  c
743.723 475.024 744.775 475.446 745.588 476.290  c
746.400 477.133 746.807 478.295 746.807 479.774  c
746.807 480.972 746.627 481.915 746.268 482.602  c
745.908 483.290 745.385 483.826 744.697 484.211  c
744.010 484.597 743.255 484.790 742.432 484.790  c
741.130 484.790 740.075 484.370 739.268 483.532  c
738.460 482.693 738.057 481.482 738.057 479.899  c
h
739.682 479.899 m
739.682 481.097 739.942 481.993 740.463 482.586  c
740.984 483.180 741.640 483.477 742.432 483.477  c
743.223 483.477 743.880 483.178 744.400 482.579  c
744.921 481.980 745.182 481.071 745.182 479.852  c
745.182 478.696 744.919 477.821 744.393 477.227  c
743.867 476.633 743.213 476.336 742.432 476.336  c
741.640 476.336 740.984 476.633 740.463 477.227  c
739.942 477.821 739.682 478.711 739.682 479.899  c
h
754.771 484.571 m
754.771 483.196 l
754.052 484.258 753.067 484.790 751.817 484.790  c
751.265 484.790 750.750 484.683 750.271 484.469  c
749.791 484.256 749.437 483.990 749.208 483.672  c
748.979 483.355 748.817 482.961 748.724 482.493  c
748.661 482.180 748.630 481.691 748.630 481.024  c
748.630 475.243 l
750.208 475.243 l
750.208 480.415 l
750.208 481.237 750.239 481.795 750.302 482.086  c
750.406 482.503 750.619 482.829 750.942 483.063  c
751.265 483.297 751.661 483.415 752.130 483.415  c
752.609 483.415 753.057 483.295 753.474 483.055  c
753.890 482.816 754.185 482.485 754.356 482.063  c
754.528 481.641 754.614 481.034 754.614 480.243  c
754.614 475.243 l
756.192 475.243 l
756.192 484.571 l
754.771 484.571 l
h
758.672 484.571 m
758.672 475.243 l
760.094 475.243 l
760.094 476.571 l
760.781 475.540 761.771 475.024 763.062 475.024  c
763.625 475.024 764.143 475.125 764.617 475.329  c
765.091 475.532 765.445 475.797 765.680 476.125  c
765.914 476.454 766.078 476.842 766.172 477.290  c
766.224 477.581 766.250 478.097 766.250 478.836  c
766.250 484.571 l
764.672 484.571 l
764.672 478.899 l
764.672 478.253 764.612 477.769 764.492 477.446  c
764.372 477.123 764.154 476.868 763.836 476.680  c
763.518 476.493 763.151 476.399 762.734 476.399  c
762.057 476.399 761.474 476.612 760.984 477.040  c
760.495 477.467 760.250 478.279 760.250 479.477  c
760.250 484.571 l
758.672 484.571 l
h
774.745 484.571 m
774.745 483.399 l
774.151 484.326 773.276 484.790 772.120 484.790  c
771.381 484.790 770.698 484.584 770.073 484.172  c
769.448 483.761 768.964 483.188 768.620 482.454  c
768.276 481.719 768.104 480.873 768.104 479.915  c
768.104 478.977 768.261 478.131 768.573 477.375  c
768.886 476.620 769.352 476.040 769.972 475.633  c
770.591 475.227 771.287 475.024 772.058 475.024  c
772.620 475.024 773.120 475.144 773.558 475.383  c
773.995 475.623 774.354 475.930 774.636 476.305  c
774.636 471.680 l
776.198 471.680 l
776.198 484.571 l
774.745 484.571 l
h
769.729 479.915 m
769.729 481.112 769.982 482.006 770.487 482.594  c
770.993 483.183 771.589 483.477 772.276 483.477  c
772.964 483.477 773.550 483.196 774.034 482.633  c
774.519 482.071 774.761 481.206 774.761 480.040  c
774.761 478.769 774.516 477.834 774.026 477.235  c
773.537 476.636 772.933 476.336 772.214 476.336  c
771.506 476.336 770.914 476.623 770.440 477.196  c
769.966 477.769 769.729 478.675 769.729 479.915  c
h
784.787 483.415 m
784.204 483.915 783.639 484.269 783.092 484.477  c
782.545 484.685 781.964 484.790 781.350 484.790  c
780.318 484.790 779.529 484.537 778.982 484.032  c
778.436 483.527 778.162 482.883 778.162 482.102  c
778.162 481.654 778.266 481.240 778.475 480.860  c
778.683 480.480 778.954 480.175 779.287 479.946  c
779.620 479.717 780.001 479.545 780.428 479.430  c
780.740 479.347 781.209 479.269 781.834 479.196  c
783.105 479.040 784.042 478.857 784.646 478.649  c
784.657 478.430 784.662 478.290 784.662 478.227  c
784.662 477.592 784.511 477.139 784.209 476.868  c
783.803 476.514 783.204 476.336 782.412 476.336  c
781.662 476.336 781.110 476.467 780.756 476.727  c
780.402 476.987 780.141 477.451 779.975 478.118  c
778.428 477.899 l
778.574 477.232 778.805 476.696 779.123 476.290  c
779.441 475.883 779.904 475.571 780.514 475.352  c
781.123 475.133 781.834 475.024 782.646 475.024  c
783.438 475.024 784.084 475.118 784.584 475.305  c
785.084 475.493 785.451 475.730 785.686 476.016  c
785.920 476.303 786.084 476.659 786.178 477.086  c
786.230 477.357 786.256 477.847 786.256 478.555  c
786.256 480.665 l
786.256 482.133 786.290 483.063 786.357 483.454  c
786.425 483.844 786.558 484.217 786.756 484.571  c
785.100 484.571 l
784.933 484.237 784.829 483.852 784.787 483.415  c
h
784.646 479.883 m
784.074 480.123 783.214 480.321 782.068 480.477  c
781.423 480.571 780.964 480.678 780.693 480.797  c
780.423 480.917 780.214 481.089 780.068 481.313  c
779.923 481.537 779.850 481.790 779.850 482.071  c
779.850 482.487 780.008 482.836 780.326 483.118  c
780.644 483.399 781.110 483.540 781.725 483.540  c
782.339 483.540 782.883 483.407 783.357 483.141  c
783.831 482.875 784.178 482.514 784.396 482.055  c
784.563 481.691 784.646 481.159 784.646 480.461  c
784.646 479.883 l
h
792.157 483.149 m
792.392 484.555 l
791.944 484.649 791.543 484.696 791.188 484.696  c
790.616 484.696 790.170 484.605 789.853 484.422  c
789.535 484.240 789.313 484.000 789.188 483.704  c
789.063 483.407 789.001 482.784 789.001 481.836  c
789.001 476.461 l
787.829 476.461 l
787.829 475.243 l
789.001 475.243 l
789.001 472.930 l
790.563 471.977 l
790.563 475.243 l
792.157 475.243 l
792.157 476.461 l
790.563 476.461 l
790.563 481.930 l
790.563 482.378 790.592 482.667 790.649 482.797  c
790.707 482.928 790.798 483.029 790.923 483.102  c
791.048 483.175 791.230 483.211 791.470 483.211  c
791.636 483.211 791.866 483.191 792.157 483.149  c
h
793.721 473.508 m
793.721 471.680 l
795.299 471.680 l
795.299 473.508 l
793.721 473.508 l
h
793.721 484.571 m
793.721 475.243 l
795.299 475.243 l
795.299 484.571 l
793.721 484.571 l
h
797.110 479.899 m
797.110 478.170 797.595 476.889 798.563 476.055  c
799.366 475.368 800.340 475.024 801.485 475.024  c
802.777 475.024 803.829 475.446 804.642 476.290  c
805.454 477.133 805.860 478.295 805.860 479.774  c
805.860 480.972 805.681 481.915 805.321 482.602  c
804.962 483.290 804.438 483.826 803.751 484.211  c
803.063 484.597 802.308 484.790 801.485 484.790  c
800.183 484.790 799.129 484.370 798.321 483.532  c
797.514 482.693 797.110 481.482 797.110 479.899  c
h
798.735 479.899 m
798.735 481.097 798.996 481.993 799.517 482.586  c
800.037 483.180 800.694 483.477 801.485 483.477  c
802.277 483.477 802.933 483.178 803.454 482.579  c
803.975 481.980 804.235 481.071 804.235 479.852  c
804.235 478.696 803.972 477.821 803.446 477.227  c
802.920 476.633 802.267 476.336 801.485 476.336  c
800.694 476.336 800.037 476.633 799.517 477.227  c
798.996 477.821 798.735 478.711 798.735 479.899  c
h
807.715 484.571 m
807.715 475.243 l
809.137 475.243 l
809.137 476.571 l
809.824 475.540 810.814 475.024 812.105 475.024  c
812.668 475.024 813.186 475.125 813.660 475.329  c
814.134 475.532 814.488 475.797 814.723 476.125  c
814.957 476.454 815.121 476.842 815.215 477.290  c
815.267 477.581 815.293 478.097 815.293 478.836  c
815.293 484.571 l
813.715 484.571 l
813.715 478.899 l
813.715 478.253 813.655 477.769 813.535 477.446  c
813.415 477.123 813.197 476.868 812.879 476.680  c
812.561 476.493 812.194 476.399 811.777 476.399  c
811.100 476.399 810.517 476.612 810.027 477.040  c
809.538 477.467 809.293 478.279 809.293 479.477  c
809.293 484.571 l
807.715 484.571 l
h
f
newpath
751.175 506.623 m
751.175 497.294 l
752.597 497.294 l
752.597 498.591 l
752.888 498.143 753.276 497.779 753.761 497.498  c
754.245 497.216 754.800 497.076 755.425 497.076  c
756.112 497.076 756.677 497.219 757.120 497.505  c
757.563 497.792 757.873 498.195 758.050 498.716  c
758.789 497.623 759.753 497.076 760.940 497.076  c
761.868 497.076 762.578 497.333 763.073 497.849  c
763.568 498.365 763.815 499.154 763.815 500.216  c
763.815 506.623 l
762.253 506.623 l
762.253 500.748 l
762.253 500.112 762.201 499.654 762.097 499.373  c
761.993 499.091 761.805 498.867 761.534 498.701  c
761.263 498.534 760.946 498.451 760.581 498.451  c
759.925 498.451 759.381 498.669 758.948 499.107  c
758.516 499.544 758.300 500.242 758.300 501.201  c
758.300 506.623 l
756.722 506.623 l
756.722 500.560 l
756.722 499.852 756.591 499.323 756.331 498.974  c
756.071 498.625 755.649 498.451 755.065 498.451  c
754.618 498.451 754.206 498.568 753.831 498.802  c
753.456 499.037 753.183 499.378 753.011 499.826  c
752.839 500.274 752.753 500.925 752.753 501.779  c
752.753 506.623 l
751.175 506.623 l
h
765.575 501.951 m
765.575 500.222 766.060 498.940 767.028 498.107  c
767.830 497.419 768.804 497.076 769.950 497.076  c
771.242 497.076 772.294 497.498 773.106 498.341  c
773.919 499.185 774.325 500.347 774.325 501.826  c
774.325 503.024 774.146 503.966 773.786 504.654  c
773.427 505.341 772.903 505.878 772.216 506.263  c
771.528 506.649 770.773 506.841 769.950 506.841  c
768.648 506.841 767.593 506.422 766.786 505.583  c
765.979 504.745 765.575 503.534 765.575 501.951  c
h
767.200 501.951 m
767.200 503.149 767.461 504.044 767.981 504.638  c
768.502 505.232 769.159 505.529 769.950 505.529  c
770.742 505.529 771.398 505.229 771.919 504.630  c
772.440 504.031 772.700 503.123 772.700 501.904  c
772.700 500.748 772.437 499.873 771.911 499.279  c
771.385 498.685 770.731 498.388 769.950 498.388  c
769.159 498.388 768.502 498.685 767.981 499.279  c
767.461 499.873 767.200 500.763 767.200 501.951  c
h
782.242 506.623 m
782.242 505.451 l
781.648 506.378 780.773 506.841 779.617 506.841  c
778.878 506.841 778.195 506.636 777.570 506.224  c
776.945 505.813 776.461 505.240 776.117 504.505  c
775.773 503.771 775.602 502.925 775.602 501.966  c
775.602 501.029 775.758 500.182 776.070 499.427  c
776.383 498.672 776.849 498.091 777.469 497.685  c
778.089 497.279 778.784 497.076 779.555 497.076  c
780.117 497.076 780.617 497.195 781.055 497.435  c
781.492 497.675 781.852 497.982 782.133 498.357  c
782.133 493.732 l
783.695 493.732 l
783.695 506.623 l
782.242 506.623 l
h
777.227 501.966 m
777.227 503.164 777.479 504.057 777.984 504.646  c
778.490 505.235 779.086 505.529 779.773 505.529  c
780.461 505.529 781.047 505.248 781.531 504.685  c
782.016 504.123 782.258 503.258 782.258 502.091  c
782.258 500.820 782.013 499.886 781.523 499.287  c
781.034 498.688 780.430 498.388 779.711 498.388  c
779.003 498.388 778.411 498.675 777.938 499.248  c
777.464 499.820 777.227 500.727 777.227 501.966  c
h
792.581 503.623 m
794.222 503.826 l
793.961 504.774 793.482 505.513 792.784 506.044  c
792.086 506.576 791.196 506.841 790.112 506.841  c
788.748 506.841 787.664 506.419 786.862 505.576  c
786.060 504.732 785.659 503.550 785.659 502.029  c
785.659 500.466 786.063 499.250 786.870 498.380  c
787.677 497.511 788.727 497.076 790.019 497.076  c
791.269 497.076 792.289 497.500 793.081 498.349  c
793.873 499.198 794.269 500.393 794.269 501.935  c
794.269 502.029 794.263 502.169 794.253 502.357  c
787.300 502.357 l
787.352 503.388 787.641 504.175 788.167 504.716  c
788.693 505.258 789.341 505.529 790.112 505.529  c
790.696 505.529 791.193 505.378 791.604 505.076  c
792.016 504.774 792.341 504.289 792.581 503.623  c
h
787.378 501.060 m
792.597 501.060 l
792.524 500.279 792.326 499.690 792.003 499.294  c
791.493 498.680 790.836 498.373 790.034 498.373  c
789.315 498.373 788.709 498.617 788.214 499.107  c
787.719 499.597 787.440 500.248 787.378 501.060  c
h
796.170 506.623 m
796.170 493.732 l
797.748 493.732 l
797.748 506.623 l
796.170 506.623 l
h
f
2 J
10.0000 M
1.00000 0.00000 0.00000 RG
0 J
1.45000 M
0.00000 0.00000 0.00000 RG
newpath
849.500 477.500 m
849.500 503.734 815.921 525.000 774.500 525.000  c
733.079 525.000 699.500 503.734 699.500 477.500  c
699.500 451.266 733.079 430.000 774.500 430.000  c
815.921 430.000 849.500 451.266 849.500 477.500  c
h
S
2 J
10.0000 M
Q
[ 1.00000 0.00000 0.00000 1.00000 0.00000 0.00000 ] defaultmatrix matrix concatmatrix setmatrix
cliprestore

%%Trailer
%%EOF
